flex-commits mailing list archives

Site index · List index
Message view « Date » · « Thread »
Top « Date » · « Thread »
From flex.ci.bui...@gmail.com
Subject Build failed in Jenkins: flex-blazeds #582
Date Fri, 25 Mar 2016 03:58:30 GMT
See <http://apacheflexbuild.cloudapp.net:8080/job/flex-blazeds/582/>

------------------------------------------
[...truncated 822 lines...]
Running flex.messaging.util.UUIDUtilTest
Tests run: 3, Failures: 0, Errors: 0, Skipped: 0, Time elapsed: 0 sec - in flex.messaging.util.UUIDUtilTest
Picked up JAVA_TOOL_OPTIONS: -Dfile.encoding=UTF8

Results :

Failed tests: 
  flex.messaging.io.amf.client.AMFConnectionTest#testCallMultipleTimes AssertionFailedError
  flex.messaging.io.amf.client.AMFConnectionTest#testCallNonexistantMethod AssertionFailedError
  flex.messaging.io.amf.client.AMFConnectionTest#testHttpResponseInfoWithNonexistantMethod
AssertionFailedError
  flex.messaging.io.amf.client.AMFConnectionTest#testInstantiateTypes AssertionFailedError
  flex.messaging.io.amf.client.AMFConnectionTest#testSetGetAMFTrace AssertionFailedError
  flex.messaging.io.amf.client.AMFDataTypeTest#testCallStringArgStringReturn AssertionFailedError
  flex.messaging.io.amf.client.AMFDataTypeTest#testCallIntArgIntReturn AssertionFailedError
  flex.messaging.io.amf.client.AMFDataTypeTest#testCallBooleanArgBooleanReturn AssertionFailedError
  flex.messaging.io.amf.client.AMFDataTypeTest#testCallObjectArgObjectReturn AssertionFailedError
  flex.messaging.io.amf.client.AMFDataTypeTest#testCallObjectArgCustomReturn AssertionFailedError
  flex.messaging.io.amf.client.AMFDataTypeTest#testCallCustomArgObjectReturn AssertionFailedError
  flex.messaging.io.amf.client.AMFDataTypeTest#testCallCustomArgCustomReturn AssertionFailedError
  flex.messaging.io.amf.client.AMFDataTypeTest#testCallNoArgObjectReturn AssertionFailedError
  flex.messaging.io.amf.client.AMFDataTypeTest#testCallNoArgCustomReturn AssertionFailedError
  flex.messaging.io.amf.client.AMFDataTypeTest#testCallNoArgObjectArrayReturn AssertionFailedError
  flex.messaging.io.amf.client.AMFDataTypeTest#testCallDateArgDateReturn AssertionFailedError
  flex.messaging.io.amf.client.AMFDataTypeTest#testCallShortArgShortReturn AssertionFailedError
  flex.messaging.io.amf.client.AMFDataTypeTest#testCallDoubleArgDoubleReturn AssertionFailedError
  flex.messaging.io.amf.client.AMFDataTypeTest#testCallIntArrayArgIntArrayReturn AssertionFailedError
  flex.messaging.io.amf.client.AMFDataTypeTest#testCallObjectArrayArgObjectArrayReturn AssertionFailedError
  flex.messaging.io.amf.client.AMFDataTypeTest#testXMLDocument AssertionFailedError

Tests run: 172, Failures: 21, Errors: 0, Skipped: 0

[ERROR] There are test failures.

Please refer to C:\Jenkins\workspace\flex-blazeds\testsuite\target\surefire-reports for the
individual test results.
[JENKINS] Recording test results
log4j:WARN No appenders could be found for logger (org.apache.commons.beanutils.converters.BooleanConverter).
log4j:WARN Please initialize the log4j system properly.
[INFO] 
[INFO] --- animal-sniffer-maven-plugin:1.15:check (check-jdk-1.6) @ flex-messaging-testsuite
---
[INFO] Checking unresolved references to org.codehaus.mojo.signature:java16:1.1
[INFO] 
[INFO] --- maven-jar-plugin:2.5:jar (default-jar) @ flex-messaging-testsuite ---
[INFO] Building jar: C:\Jenkins\workspace\flex-blazeds\testsuite\target\flex-messaging-testsuite-4.7.3-SNAPSHOT.jar
[INFO] 
[INFO] --- maven-site-plugin:3.4:attach-descriptor (attach-descriptor) @ flex-messaging-testsuite
---
[INFO]                                                                         
[INFO] ------------------------------------------------------------------------
[INFO] Building blazeds-spring-boot-starter 4.7.3-SNAPSHOT
[INFO] ------------------------------------------------------------------------
[INFO] Downloading: http://repo.maven.apache.org/maven2/org/springframework/boot/spring-boot-autoconfigure/1.3.3.RELEASE/spring-boot-autoconfigure-1.3.3.RELEASE.pom
[INFO] I/O exception (java.net.SocketException) caught when processing request: Connection
reset
[INFO] Retrying request
[INFO] I/O exception (java.net.SocketException) caught when processing request: Connection
reset
[INFO] Retrying request
[INFO] I/O exception (java.net.SocketException) caught when processing request: Connection
reset
[INFO] Retrying request
[INFO] Downloading: http://repo.maven.apache.org/maven2/org/springframework/flex/spring-flex-core/1.5.2.RELEASE/spring-flex-core-1.5.2.RELEASE.pom
[INFO] Downloaded: http://repo.maven.apache.org/maven2/org/springframework/flex/spring-flex-core/1.5.2.RELEASE/spring-flex-core-1.5.2.RELEASE.pom
(9 KB at 63.7 KB/sec)
[INFO] Downloading: http://repo.maven.apache.org/maven2/org/springframework/flex/spring-flex-parent/1.5.2.RELEASE/spring-flex-parent-1.5.2.RELEASE.pom
[INFO] Downloaded: http://repo.maven.apache.org/maven2/org/springframework/flex/spring-flex-parent/1.5.2.RELEASE/spring-flex-parent-1.5.2.RELEASE.pom
(13 KB at 80.1 KB/sec)
[INFO] Downloading: http://repo.maven.apache.org/maven2/commons-httpclient/commons-httpclient/3.1/commons-httpclient-3.1.pom
[INFO] Downloaded: http://repo.maven.apache.org/maven2/commons-httpclient/commons-httpclient/3.1/commons-httpclient-3.1.pom
(8 KB at 210.6 KB/sec)
[INFO] Downloading: http://repo.maven.apache.org/maven2/cglib/cglib-nodep/2.1_3/cglib-nodep-2.1_3.pom
[INFO] Downloaded: http://repo.maven.apache.org/maven2/cglib/cglib-nodep/2.1_3/cglib-nodep-2.1_3.pom
(214 B at 6.1 KB/sec)
[INFO] Downloading: http://repo.maven.apache.org/maven2/org/springframework/spring-beans/3.0.5.RELEASE/spring-beans-3.0.5.RELEASE.pom
[INFO] Downloaded: http://repo.maven.apache.org/maven2/org/springframework/spring-beans/3.0.5.RELEASE/spring-beans-3.0.5.RELEASE.pom
(3 KB at 52.7 KB/sec)
[INFO] Downloading: http://repo.maven.apache.org/maven2/org/springframework/spring-parent/3.0.5.RELEASE/spring-parent-3.0.5.RELEASE.pom
[INFO] Downloaded: http://repo.maven.apache.org/maven2/org/springframework/spring-parent/3.0.5.RELEASE/spring-parent-3.0.5.RELEASE.pom
(9 KB at 157.6 KB/sec)
[INFO] Downloading: http://repo.maven.apache.org/maven2/org/springframework/spring-core/3.0.5.RELEASE/spring-core-3.0.5.RELEASE.pom
[INFO] Downloaded: http://repo.maven.apache.org/maven2/org/springframework/spring-core/3.0.5.RELEASE/spring-core-3.0.5.RELEASE.pom
(3 KB at 56.1 KB/sec)
[INFO] Downloading: http://repo.maven.apache.org/maven2/org/springframework/spring-asm/3.0.5.RELEASE/spring-asm-3.0.5.RELEASE.pom
[INFO] Downloaded: http://repo.maven.apache.org/maven2/org/springframework/spring-asm/3.0.5.RELEASE/spring-asm-3.0.5.RELEASE.pom
(2 KB at 39.9 KB/sec)
[INFO] Downloading: http://repo.maven.apache.org/maven2/org/springframework/spring-context/3.0.5.RELEASE/spring-context-3.0.5.RELEASE.pom
[INFO] Downloaded: http://repo.maven.apache.org/maven2/org/springframework/spring-context/3.0.5.RELEASE/spring-context-3.0.5.RELEASE.pom
(7 KB at 175.3 KB/sec)
[INFO] Downloading: http://repo.maven.apache.org/maven2/org/springframework/spring-aop/3.0.5.RELEASE/spring-aop-3.0.5.RELEASE.pom
[INFO] Downloaded: http://repo.maven.apache.org/maven2/org/springframework/spring-aop/3.0.5.RELEASE/spring-aop-3.0.5.RELEASE.pom
(3 KB at 58.3 KB/sec)
[INFO] Downloading: http://repo.maven.apache.org/maven2/org/springframework/spring-expression/3.0.5.RELEASE/spring-expression-3.0.5.RELEASE.pom
[INFO] Downloaded: http://repo.maven.apache.org/maven2/org/springframework/spring-expression/3.0.5.RELEASE/spring-expression-3.0.5.RELEASE.pom
(2 KB at 35.5 KB/sec)
[INFO] Downloading: http://repo.maven.apache.org/maven2/org/springframework/spring-context-support/3.0.5.RELEASE/spring-context-support-3.0.5.RELEASE.pom
[INFO] Downloaded: http://repo.maven.apache.org/maven2/org/springframework/spring-context-support/3.0.5.RELEASE/spring-context-support-3.0.5.RELEASE.pom
(5 KB at 84.1 KB/sec)
[INFO] Downloading: http://repo.maven.apache.org/maven2/org/springframework/spring-web/3.0.5.RELEASE/spring-web-3.0.5.RELEASE.pom
[INFO] Downloaded: http://repo.maven.apache.org/maven2/org/springframework/spring-web/3.0.5.RELEASE/spring-web-3.0.5.RELEASE.pom
(5 KB at 93.0 KB/sec)
[INFO] Downloading: http://repo.maven.apache.org/maven2/org/springframework/spring-webmvc/3.0.5.RELEASE/spring-webmvc-3.0.5.RELEASE.pom
[INFO] Downloaded: http://repo.maven.apache.org/maven2/org/springframework/spring-webmvc/3.0.5.RELEASE/spring-webmvc-3.0.5.RELEASE.pom
(9 KB at 156.9 KB/sec)
[INFO] Downloading: http://repo.maven.apache.org/maven2/org/springframework/boot/spring-boot-starter-web/1.3.3.RELEASE/spring-boot-starter-web-1.3.3.RELEASE.pom
[INFO] Downloaded: http://repo.maven.apache.org/maven2/org/springframework/boot/spring-boot-starter-web/1.3.3.RELEASE/spring-boot-starter-web-1.3.3.RELEASE.pom
(2 KB at 32.5 KB/sec)
[INFO] Downloading: http://repo.maven.apache.org/maven2/org/springframework/boot/spring-boot-starters/1.3.3.RELEASE/spring-boot-starters-1.3.3.RELEASE.pom
[INFO] Downloaded: http://repo.maven.apache.org/maven2/org/springframework/boot/spring-boot-starters/1.3.3.RELEASE/spring-boot-starters-1.3.3.RELEASE.pom
(4 KB at 57.4 KB/sec)
[INFO] Downloading: http://repo.maven.apache.org/maven2/org/springframework/boot/spring-boot-parent/1.3.3.RELEASE/spring-boot-parent-1.3.3.RELEASE.pom
[INFO] Downloaded: http://repo.maven.apache.org/maven2/org/springframework/boot/spring-boot-parent/1.3.3.RELEASE/spring-boot-parent-1.3.3.RELEASE.pom
(25 KB at 415.5 KB/sec)
[INFO] Downloading: http://repo.maven.apache.org/maven2/org/springframework/boot/spring-boot-dependencies/1.3.3.RELEASE/spring-boot-dependencies-1.3.3.RELEASE.pom
[INFO] Downloaded: http://repo.maven.apache.org/maven2/org/springframework/boot/spring-boot-dependencies/1.3.3.RELEASE/spring-boot-dependencies-1.3.3.RELEASE.pom
(73 KB at 1341.8 KB/sec)
[INFO] Downloading: http://repo.maven.apache.org/maven2/org/springframework/spring-framework-bom/4.2.5.RELEASE/spring-framework-bom-4.2.5.RELEASE.pom
[INFO] Downloaded: http://repo.maven.apache.org/maven2/org/springframework/spring-framework-bom/4.2.5.RELEASE/spring-framework-bom-4.2.5.RELEASE.pom
(5 KB at 116.3 KB/sec)
[INFO] Downloading: http://repo.maven.apache.org/maven2/org/springframework/data/spring-data-releasetrain/Gosling-SR4/spring-data-releasetrain-Gosling-SR4.pom
[INFO] Downloaded: http://repo.maven.apache.org/maven2/org/springframework/data/spring-data-releasetrain/Gosling-SR4/spring-data-releasetrain-Gosling-SR4.pom
(5 KB at 10.8 KB/sec)
[INFO] Downloading: http://repo.maven.apache.org/maven2/org/springframework/data/build/spring-data-build/1.7.4.RELEASE/spring-data-build-1.7.4.RELEASE.pom
[INFO] Downloaded: http://repo.maven.apache.org/maven2/org/springframework/data/build/spring-data-build/1.7.4.RELEASE/spring-data-build-1.7.4.RELEASE.pom
(3 KB at 47.1 KB/sec)
[INFO] Downloading: http://repo.maven.apache.org/maven2/org/springframework/integration/spring-integration-bom/4.2.5.RELEASE/spring-integration-bom-4.2.5.RELEASE.pom
[INFO] Downloaded: http://repo.maven.apache.org/maven2/org/springframework/integration/spring-integration-bom/4.2.5.RELEASE/spring-integration-bom-4.2.5.RELEASE.pom
(9 KB at 147.6 KB/sec)
[INFO] Downloading: http://repo.maven.apache.org/maven2/org/springframework/security/spring-security-bom/4.0.3.RELEASE/spring-security-bom-4.0.3.RELEASE.pom
[INFO] Downloaded: http://repo.maven.apache.org/maven2/org/springframework/security/spring-security-bom/4.0.3.RELEASE/spring-security-bom-4.0.3.RELEASE.pom
(5 KB at 68.4 KB/sec)
[INFO] Downloading: http://repo.maven.apache.org/maven2/org/springframework/boot/spring-boot-starter/1.3.3.RELEASE/spring-boot-starter-1.3.3.RELEASE.pom
[INFO] Downloaded: http://repo.maven.apache.org/maven2/org/springframework/boot/spring-boot-starter/1.3.3.RELEASE/spring-boot-starter-1.3.3.RELEASE.pom
(2 KB at 32.8 KB/sec)
[INFO] Downloading: http://repo.maven.apache.org/maven2/org/springframework/boot/spring-boot/1.3.3.RELEASE/spring-boot-1.3.3.RELEASE.pom
[INFO] Downloaded: http://repo.maven.apache.org/maven2/org/springframework/boot/spring-boot/1.3.3.RELEASE/spring-boot-1.3.3.RELEASE.pom
(8 KB at 187.3 KB/sec)
[INFO] Downloading: http://repo.maven.apache.org/maven2/org/springframework/spring-core/4.2.5.RELEASE/spring-core-4.2.5.RELEASE.pom
[INFO] Downloaded: http://repo.maven.apache.org/maven2/org/springframework/spring-core/4.2.5.RELEASE/spring-core-4.2.5.RELEASE.pom
(3 KB at 35.2 KB/sec)
[INFO] Downloading: http://repo.maven.apache.org/maven2/org/springframework/spring-context/4.2.5.RELEASE/spring-context-4.2.5.RELEASE.pom
[INFO] Downloaded: http://repo.maven.apache.org/maven2/org/springframework/spring-context/4.2.5.RELEASE/spring-context-4.2.5.RELEASE.pom
(5 KB at 24.8 KB/sec)
[INFO] Downloading: http://repo.maven.apache.org/maven2/org/springframework/spring-aop/4.2.5.RELEASE/spring-aop-4.2.5.RELEASE.pom
[INFO] Downloaded: http://repo.maven.apache.org/maven2/org/springframework/spring-aop/4.2.5.RELEASE/spring-aop-4.2.5.RELEASE.pom
(3 KB at 50.0 KB/sec)
[INFO] Downloading: http://repo.maven.apache.org/maven2/org/springframework/spring-beans/4.2.5.RELEASE/spring-beans-4.2.5.RELEASE.pom
[INFO] Downloaded: http://repo.maven.apache.org/maven2/org/springframework/spring-beans/4.2.5.RELEASE/spring-beans-4.2.5.RELEASE.pom
(3 KB at 11.5 KB/sec)
[INFO] Downloading: http://repo.maven.apache.org/maven2/org/springframework/spring-expression/4.2.5.RELEASE/spring-expression-4.2.5.RELEASE.pom
[INFO] Downloaded: http://repo.maven.apache.org/maven2/org/springframework/spring-expression/4.2.5.RELEASE/spring-expression-4.2.5.RELEASE.pom
(2 KB at 28.5 KB/sec)
[INFO] Downloading: http://repo.maven.apache.org/maven2/org/springframework/boot/spring-boot-starter-logging/1.3.3.RELEASE/spring-boot-starter-logging-1.3.3.RELEASE.pom
[INFO] Downloaded: http://repo.maven.apache.org/maven2/org/springframework/boot/spring-boot-starter-logging/1.3.3.RELEASE/spring-boot-starter-logging-1.3.3.RELEASE.pom
(2 KB at 10.3 KB/sec)
[INFO] Downloading: http://repo.maven.apache.org/maven2/ch/qos/logback/logback-classic/1.1.5/logback-classic-1.1.5.pom
[INFO] Downloaded: http://repo.maven.apache.org/maven2/ch/qos/logback/logback-classic/1.1.5/logback-classic-1.1.5.pom
(13 KB at 244.8 KB/sec)
[INFO] Downloading: http://repo.maven.apache.org/maven2/ch/qos/logback/logback-parent/1.1.5/logback-parent-1.1.5.pom
[INFO] Downloaded: http://repo.maven.apache.org/maven2/ch/qos/logback/logback-parent/1.1.5/logback-parent-1.1.5.pom
(17 KB at 338.6 KB/sec)
[INFO] Downloading: http://repo.maven.apache.org/maven2/ch/qos/logback/logback-core/1.1.5/logback-core-1.1.5.pom
[INFO] Downloaded: http://repo.maven.apache.org/maven2/ch/qos/logback/logback-core/1.1.5/logback-core-1.1.5.pom
(5 KB at 112.6 KB/sec)
[INFO] Downloading: http://repo.maven.apache.org/maven2/org/slf4j/slf4j-api/1.7.16/slf4j-api-1.7.16.pom
[INFO] Downloaded: http://repo.maven.apache.org/maven2/org/slf4j/slf4j-api/1.7.16/slf4j-api-1.7.16.pom
(3 KB at 37.1 KB/sec)
[INFO] Downloading: http://repo.maven.apache.org/maven2/org/slf4j/slf4j-parent/1.7.16/slf4j-parent-1.7.16.pom
[INFO] Downloaded: http://repo.maven.apache.org/maven2/org/slf4j/slf4j-parent/1.7.16/slf4j-parent-1.7.16.pom
(14 KB at 244.2 KB/sec)
[INFO] Downloading: http://repo.maven.apache.org/maven2/org/slf4j/jcl-over-slf4j/1.7.16/jcl-over-slf4j-1.7.16.pom
[INFO] Downloaded: http://repo.maven.apache.org/maven2/org/slf4j/jcl-over-slf4j/1.7.16/jcl-over-slf4j-1.7.16.pom
(963 B at 24.7 KB/sec)
[INFO] Downloading: http://repo.maven.apache.org/maven2/org/slf4j/jul-to-slf4j/1.7.16/jul-to-slf4j-1.7.16.pom
[INFO] Downloaded: http://repo.maven.apache.org/maven2/org/slf4j/jul-to-slf4j/1.7.16/jul-to-slf4j-1.7.16.pom
(986 B at 20.5 KB/sec)
[INFO] Downloading: http://repo.maven.apache.org/maven2/org/slf4j/log4j-over-slf4j/1.7.16/log4j-over-slf4j-1.7.16.pom
[INFO] Downloaded: http://repo.maven.apache.org/maven2/org/slf4j/log4j-over-slf4j/1.7.16/log4j-over-slf4j-1.7.16.pom
(2 KB at 12.9 KB/sec)
[INFO] Downloading: http://repo.maven.apache.org/maven2/org/yaml/snakeyaml/1.16/snakeyaml-1.16.pom
[INFO] Downloaded: http://repo.maven.apache.org/maven2/org/yaml/snakeyaml/1.16/snakeyaml-1.16.pom
(26 KB at 806.1 KB/sec)
[INFO] Downloading: http://repo.maven.apache.org/maven2/org/springframework/boot/spring-boot-starter-tomcat/1.3.3.RELEASE/spring-boot-starter-tomcat-1.3.3.RELEASE.pom
[INFO] Downloaded: http://repo.maven.apache.org/maven2/org/springframework/boot/spring-boot-starter-tomcat/1.3.3.RELEASE/spring-boot-starter-tomcat-1.3.3.RELEASE.pom
(2 KB at 36.9 KB/sec)
[INFO] Downloading: http://repo.maven.apache.org/maven2/org/apache/tomcat/embed/tomcat-embed-core/8.0.32/tomcat-embed-core-8.0.32.pom
[INFO] Downloaded: http://repo.maven.apache.org/maven2/org/apache/tomcat/embed/tomcat-embed-core/8.0.32/tomcat-embed-core-8.0.32.pom
(2 KB at 9.9 KB/sec)
[INFO] Downloading: http://repo.maven.apache.org/maven2/org/apache/tomcat/embed/tomcat-embed-el/8.0.32/tomcat-embed-el-8.0.32.pom
[INFO] Downloaded: http://repo.maven.apache.org/maven2/org/apache/tomcat/embed/tomcat-embed-el/8.0.32/tomcat-embed-el-8.0.32.pom
(2 KB at 30.3 KB/sec)
[INFO] Downloading: http://repo.maven.apache.org/maven2/org/apache/tomcat/embed/tomcat-embed-logging-juli/8.0.32/tomcat-embed-logging-juli-8.0.32.pom
[INFO] Downloaded: http://repo.maven.apache.org/maven2/org/apache/tomcat/embed/tomcat-embed-logging-juli/8.0.32/tomcat-embed-logging-juli-8.0.32.pom
(2 KB at 37.1 KB/sec)
[INFO] Downloading: http://repo.maven.apache.org/maven2/org/apache/tomcat/embed/tomcat-embed-websocket/8.0.32/tomcat-embed-websocket-8.0.32.pom
[INFO] Downloaded: http://repo.maven.apache.org/maven2/org/apache/tomcat/embed/tomcat-embed-websocket/8.0.32/tomcat-embed-websocket-8.0.32.pom
(2 KB at 33.5 KB/sec)
[INFO] Downloading: http://repo.maven.apache.org/maven2/org/springframework/boot/spring-boot-starter-validation/1.3.3.RELEASE/spring-boot-starter-validation-1.3.3.RELEASE.pom
[INFO] Downloaded: http://repo.maven.apache.org/maven2/org/springframework/boot/spring-boot-starter-validation/1.3.3.RELEASE/spring-boot-starter-validation-1.3.3.RELEASE.pom
(2 KB at 19.7 KB/sec)
[INFO] Downloading: http://repo.maven.apache.org/maven2/org/hibernate/hibernate-validator/5.2.4.Final/hibernate-validator-5.2.4.Final.pom
[INFO] Downloaded: http://repo.maven.apache.org/maven2/org/hibernate/hibernate-validator/5.2.4.Final/hibernate-validator-5.2.4.Final.pom
(13 KB at 275.9 KB/sec)
[INFO] Downloading: http://repo.maven.apache.org/maven2/org/hibernate/hibernate-validator-parent/5.2.4.Final/hibernate-validator-parent-5.2.4.Final.pom
[INFO] Downloaded: http://repo.maven.apache.org/maven2/org/hibernate/hibernate-validator-parent/5.2.4.Final/hibernate-validator-parent-5.2.4.Final.pom
(35 KB at 749.4 KB/sec)
[INFO] Downloading: http://repo.maven.apache.org/maven2/org/jboss/arquillian/arquillian-bom/1.1.9.Final/arquillian-bom-1.1.9.Final.pom
[INFO] Downloaded: http://repo.maven.apache.org/maven2/org/jboss/arquillian/arquillian-bom/1.1.9.Final/arquillian-bom-1.1.9.Final.pom
(11 KB at 167.5 KB/sec)
[INFO] Downloading: http://repo.maven.apache.org/maven2/org/jboss/shrinkwrap/shrinkwrap-bom/1.2.2/shrinkwrap-bom-1.2.2.pom
[INFO] Downloaded: http://repo.maven.apache.org/maven2/org/jboss/shrinkwrap/shrinkwrap-bom/1.2.2/shrinkwrap-bom-1.2.2.pom
(4 KB at 94.4 KB/sec)
[INFO] Downloading: http://repo.maven.apache.org/maven2/org/jboss/shrinkwrap/resolver/shrinkwrap-resolver-bom/2.1.1/shrinkwrap-resolver-bom-2.1.1.pom
[INFO] Downloaded: http://repo.maven.apache.org/maven2/org/jboss/shrinkwrap/resolver/shrinkwrap-resolver-bom/2.1.1/shrinkwrap-resolver-bom-2.1.1.pom
(5 KB at 67.3 KB/sec)
[INFO] Downloading: http://repo.maven.apache.org/maven2/org/jboss/shrinkwrap/descriptors/shrinkwrap-descriptors-bom/2.0.0-alpha-7/shrinkwrap-descriptors-bom-2.0.0-alpha-7.pom
[INFO] Downloaded: http://repo.maven.apache.org/maven2/org/jboss/shrinkwrap/descriptors/shrinkwrap-descriptors-bom/2.0.0-alpha-7/shrinkwrap-descriptors-bom-2.0.0-alpha-7.pom
(6 KB at 83.9 KB/sec)
[INFO] Downloading: http://repo.maven.apache.org/maven2/javax/validation/validation-api/1.1.0.Final/validation-api-1.1.0.Final.pom
[INFO] Downloaded: http://repo.maven.apache.org/maven2/javax/validation/validation-api/1.1.0.Final/validation-api-1.1.0.Final.pom
(8 KB at 187.2 KB/sec)
[INFO] Downloading: http://repo.maven.apache.org/maven2/org/jboss/logging/jboss-logging/3.2.1.Final/jboss-logging-3.2.1.Final.pom
[INFO] Downloaded: http://repo.maven.apache.org/maven2/org/jboss/logging/jboss-logging/3.2.1.Final/jboss-logging-3.2.1.Final.pom
(6 KB at 111.9 KB/sec)
[INFO] Downloading: http://repo.maven.apache.org/maven2/org/jboss/jboss-parent/15/jboss-parent-15.pom
[INFO] Downloaded: http://repo.maven.apache.org/maven2/org/jboss/jboss-parent/15/jboss-parent-15.pom
(31 KB at 592.0 KB/sec)
[INFO] Downloading: http://repo.maven.apache.org/maven2/com/fasterxml/classmate/1.1.0/classmate-1.1.0.pom
[INFO] Downloaded: http://repo.maven.apache.org/maven2/com/fasterxml/classmate/1.1.0/classmate-1.1.0.pom
(7 KB at 183.1 KB/sec)
[INFO] Downloading: http://repo.maven.apache.org/maven2/org/sonatype/oss/oss-parent/7/oss-parent-7.pom
[INFO] Downloaded: http://repo.maven.apache.org/maven2/org/sonatype/oss/oss-parent/7/oss-parent-7.pom
(5 KB at 138.6 KB/sec)
[INFO] Downloading: http://repo.maven.apache.org/maven2/com/fasterxml/jackson/core/jackson-databind/2.6.5/jackson-databind-2.6.5.pom
[INFO] Downloaded: http://repo.maven.apache.org/maven2/com/fasterxml/jackson/core/jackson-databind/2.6.5/jackson-databind-2.6.5.pom
(6 KB at 137.7 KB/sec)
[INFO] Downloading: http://repo.maven.apache.org/maven2/com/fasterxml/jackson/jackson-parent/2.6.2/jackson-parent-2.6.2.pom
[INFO] Downloaded: http://repo.maven.apache.org/maven2/com/fasterxml/jackson/jackson-parent/2.6.2/jackson-parent-2.6.2.pom
(8 KB at 190.2 KB/sec)
[INFO] Downloading: http://repo.maven.apache.org/maven2/com/fasterxml/oss-parent/24/oss-parent-24.pom
[INFO] Downloaded: http://repo.maven.apache.org/maven2/com/fasterxml/oss-parent/24/oss-parent-24.pom
(19 KB at 527.2 KB/sec)
[INFO] Downloading: http://repo.maven.apache.org/maven2/com/fasterxml/jackson/core/jackson-annotations/2.6.0/jackson-annotations-2.6.0.pom
[INFO] Downloaded: http://repo.maven.apache.org/maven2/com/fasterxml/jackson/core/jackson-annotations/2.6.0/jackson-annotations-2.6.0.pom
(2 KB at 17.0 KB/sec)
[INFO] Downloading: http://repo.maven.apache.org/maven2/com/fasterxml/jackson/jackson-parent/2.6.1/jackson-parent-2.6.1.pom
[INFO] Downloaded: http://repo.maven.apache.org/maven2/com/fasterxml/jackson/jackson-parent/2.6.1/jackson-parent-2.6.1.pom
(8 KB at 43.0 KB/sec)
[INFO] Downloading: http://repo.maven.apache.org/maven2/com/fasterxml/oss-parent/23/oss-parent-23.pom
[INFO] Downloaded: http://repo.maven.apache.org/maven2/com/fasterxml/oss-parent/23/oss-parent-23.pom
(19 KB at 523.4 KB/sec)
[INFO] Downloading: http://repo.maven.apache.org/maven2/com/fasterxml/jackson/core/jackson-core/2.6.5/jackson-core-2.6.5.pom
[INFO] Downloaded: http://repo.maven.apache.org/maven2/com/fasterxml/jackson/core/jackson-core/2.6.5/jackson-core-2.6.5.pom
(5 KB at 128.5 KB/sec)
[INFO] Downloading: http://repo.maven.apache.org/maven2/org/springframework/spring-web/4.2.5.RELEASE/spring-web-4.2.5.RELEASE.pom
[INFO] Downloaded: http://repo.maven.apache.org/maven2/org/springframework/spring-web/4.2.5.RELEASE/spring-web-4.2.5.RELEASE.pom
(8 KB at 131.7 KB/sec)
[INFO] Downloading: http://repo.maven.apache.org/maven2/commons-logging/commons-logging/1.2/commons-logging-1.2.pom
[INFO] Downloaded: http://repo.maven.apache.org/maven2/commons-logging/commons-logging/1.2/commons-logging-1.2.pom
(19 KB at 506.9 KB/sec)
[INFO] Downloading: http://repo.maven.apache.org/maven2/org/springframework/spring-webmvc/4.2.5.RELEASE/spring-webmvc-4.2.5.RELEASE.pom
[INFO] Downloaded: http://repo.maven.apache.org/maven2/org/springframework/spring-webmvc/4.2.5.RELEASE/spring-webmvc-4.2.5.RELEASE.pom
(12 KB at 206.1 KB/sec)
[INFO] ------------------------------------------------------------------------
[INFO] Reactor Summary:
[INFO] 
[INFO] Apache Flex: BlazeDS .............................. SUCCESS [ 29.338 s]
[INFO] flex-messaging-common ............................. SUCCESS [ 24.496 s]
[INFO] flex-messaging-core ............................... SUCCESS [ 51.145 s]
[INFO] flex-messaging-proxy .............................. SUCCESS [  7.689 s]
[INFO] flex-messaging-remoting ........................... SUCCESS [  3.907 s]
[INFO] flex-messaging-opt ................................ SUCCESS [  2.380 s]
[INFO] flex-messaging-opt-tomcat ......................... SUCCESS [  2.618 s]
[INFO] flex-messaging-opt-tomcat-base .................... SUCCESS [  4.866 s]
[INFO] flex-messaging-opt-tomcat-4 ....................... SUCCESS [  2.708 s]
[INFO] flex-messaging-opt-tomcat-6 ....................... SUCCESS [  3.893 s]
[INFO] flex-messaging-opt-tomcat-7 ....................... SUCCESS [  4.590 s]
[INFO] flex-messaging-testsuite .......................... SUCCESS [02:54 min]
[INFO] blazeds-spring-boot-starter ....................... FAILURE [01:26 min]
[INFO] ------------------------------------------------------------------------
[INFO] BUILD FAILURE
[INFO] ------------------------------------------------------------------------
[INFO] Total time: 06:47 min
[INFO] Finished at: 2016-03-25T03:54:28+00:00
[INFO] Final Memory: 26M/139M
[INFO] ------------------------------------------------------------------------
Waiting for Jenkins to finish collecting data
[ERROR] Failed to execute goal on project blazeds-spring-boot-starter: Could not resolve dependencies
for project org.apache.flex.blazeds:blazeds-spring-boot-starter:jar:4.7.3-SNAPSHOT: Failed
to collect dependencies at org.springframework.boot:spring-boot-autoconfigure:jar:1.3.3.RELEASE:
Failed to read artifact descriptor for org.springframework.boot:spring-boot-autoconfigure:jar:1.3.3.RELEASE:
Could not transfer artifact org.springframework.boot:spring-boot-autoconfigure:pom:1.3.3.RELEASE
from/to central (http://repo.maven.apache.org/maven2): Connection reset -> [Help 1]
[ERROR] 
[ERROR] To see the full stack trace of the errors, re-run Maven with the -e switch.
[ERROR] Re-run Maven using the -X switch to enable full debug logging.
[ERROR] 
[ERROR] For more information about the errors and possible solutions, please read the following
articles:
[ERROR] [Help 1] http://cwiki.apache.org/confluence/display/MAVEN/DependencyResolutionException
[ERROR] 
[ERROR] After correcting the problems, you can resume the build with the command
[ERROR]   mvn <goals> -rf :blazeds-spring-boot-starter
[JENKINS] Archiving C:\Jenkins\workspace\flex-blazeds\common\pom.xml to org.apache.flex.blazeds/flex-messaging-common/4.7.3-SNAPSHOT/flex-messaging-common-4.7.3-SNAPSHOT.pom
[JENKINS] Archiving C:\Jenkins\workspace\flex-blazeds\common\target\flex-messaging-common.jar
to org.apache.flex.blazeds/flex-messaging-common/4.7.3-SNAPSHOT/flex-messaging-common-4.7.3-SNAPSHOT.jar
[JENKINS] Archiving C:\Jenkins\workspace\flex-blazeds\opt\tomcat\pom.xml to org.apache.flex.blazeds/flex-messaging-opt-tomcat/4.7.3-SNAPSHOT/flex-messaging-opt-tomcat-4.7.3-SNAPSHOT.pom
[JENKINS] Archiving C:\Jenkins\workspace\flex-blazeds\opt\tomcat\tomcat-base\pom.xml to org.apache.flex.blazeds/flex-messaging-opt-tomcat-base/4.7.3-SNAPSHOT/flex-messaging-opt-tomcat-base-4.7.3-SNAPSHOT.pom
[JENKINS] Archiving C:\Jenkins\workspace\flex-blazeds\opt\tomcat\tomcat-base\target\flex-messaging-opt-tomcat-base-4.7.3-SNAPSHOT.jar
to org.apache.flex.blazeds/flex-messaging-opt-tomcat-base/4.7.3-SNAPSHOT/flex-messaging-opt-tomcat-base-4.7.3-SNAPSHOT.jar
[JENKINS] Archiving C:\Jenkins\workspace\flex-blazeds\testsuite\pom.xml to org.apache.flex.blazeds/flex-messaging-testsuite/4.7.3-SNAPSHOT/flex-messaging-testsuite-4.7.3-SNAPSHOT.pom
[JENKINS] Archiving C:\Jenkins\workspace\flex-blazeds\testsuite\target\flex-messaging-testsuite-4.7.3-SNAPSHOT.jar
to org.apache.flex.blazeds/flex-messaging-testsuite/4.7.3-SNAPSHOT/flex-messaging-testsuite-4.7.3-SNAPSHOT.jar
[JENKINS] Archiving C:\Jenkins\workspace\flex-blazeds\proxy\pom.xml to org.apache.flex.blazeds/flex-messaging-proxy/4.7.3-SNAPSHOT/flex-messaging-proxy-4.7.3-SNAPSHOT.pom
[JENKINS] Archiving C:\Jenkins\workspace\flex-blazeds\proxy\target\flex-messaging-proxy-4.7.3-SNAPSHOT.jar
to org.apache.flex.blazeds/flex-messaging-proxy/4.7.3-SNAPSHOT/flex-messaging-proxy-4.7.3-SNAPSHOT.jar
[JENKINS] Archiving <http://apacheflexbuild.cloudapp.net:8080/job/flex-blazeds/ws/pom.xml>
to org.apache.flex.blazeds/blazeds/4.7.3-SNAPSHOT/blazeds-4.7.3-SNAPSHOT.pom
[JENKINS] Archiving C:\Jenkins\workspace\flex-blazeds\blazeds-spring-boot-starter\pom.xml
to org.apache.flex.blazeds/blazeds-spring-boot-starter/4.7.3-SNAPSHOT/blazeds-spring-boot-starter-4.7.3-SNAPSHOT.pom
[JENKINS] Archiving C:\Jenkins\workspace\flex-blazeds\remoting\pom.xml to org.apache.flex.blazeds/flex-messaging-remoting/4.7.3-SNAPSHOT/flex-messaging-remoting-4.7.3-SNAPSHOT.pom
[JENKINS] Archiving C:\Jenkins\workspace\flex-blazeds\remoting\target\flex-messaging-remoting-4.7.3-SNAPSHOT.jar
to org.apache.flex.blazeds/flex-messaging-remoting/4.7.3-SNAPSHOT/flex-messaging-remoting-4.7.3-SNAPSHOT.jar
[JENKINS] Archiving C:\Jenkins\workspace\flex-blazeds\opt\tomcat\tomcat-7\pom.xml to org.apache.flex.blazeds/flex-messaging-opt-tomcat-7/4.7.3-SNAPSHOT/flex-messaging-opt-tomcat-7-4.7.3-SNAPSHOT.pom
[JENKINS] Archiving C:\Jenkins\workspace\flex-blazeds\opt\tomcat\tomcat-7\target\flex-messaging-opt-tomcat-7-4.7.3-SNAPSHOT.jar
to org.apache.flex.blazeds/flex-messaging-opt-tomcat-7/4.7.3-SNAPSHOT/flex-messaging-opt-tomcat-7-4.7.3-SNAPSHOT.jar
[JENKINS] Archiving C:\Jenkins\workspace\flex-blazeds\core\pom.xml to org.apache.flex.blazeds/flex-messaging-core/4.7.3-SNAPSHOT/flex-messaging-core-4.7.3-SNAPSHOT.pom
[JENKINS] Archiving C:\Jenkins\workspace\flex-blazeds\core\target\flex-messaging-core-4.7.3-SNAPSHOT.jar
to org.apache.flex.blazeds/flex-messaging-core/4.7.3-SNAPSHOT/flex-messaging-core-4.7.3-SNAPSHOT.jar
[JENKINS] Archiving C:\Jenkins\workspace\flex-blazeds\opt\tomcat\tomcat-6\pom.xml to org.apache.flex.blazeds/flex-messaging-opt-tomcat-6/4.7.3-SNAPSHOT/flex-messaging-opt-tomcat-6-4.7.3-SNAPSHOT.pom
[JENKINS] Archiving C:\Jenkins\workspace\flex-blazeds\opt\tomcat\tomcat-6\target\flex-messaging-opt-tomcat-6-4.7.3-SNAPSHOT.jar
to org.apache.flex.blazeds/flex-messaging-opt-tomcat-6/4.7.3-SNAPSHOT/flex-messaging-opt-tomcat-6-4.7.3-SNAPSHOT.jar
[JENKINS] Archiving C:\Jenkins\workspace\flex-blazeds\opt\tomcat\tomcat-4\pom.xml to org.apache.flex.blazeds/flex-messaging-opt-tomcat-4/4.7.3-SNAPSHOT/flex-messaging-opt-tomcat-4-4.7.3-SNAPSHOT.pom
[JENKINS] Archiving C:\Jenkins\workspace\flex-blazeds\opt\tomcat\tomcat-4\target\flex-messaging-opt-tomcat-4-4.7.3-SNAPSHOT.jar
to org.apache.flex.blazeds/flex-messaging-opt-tomcat-4/4.7.3-SNAPSHOT/flex-messaging-opt-tomcat-4-4.7.3-SNAPSHOT.jar
[JENKINS] Archiving C:\Jenkins\workspace\flex-blazeds\opt\pom.xml to org.apache.flex.blazeds/flex-messaging-opt/4.7.3-SNAPSHOT/flex-messaging-opt-4.7.3-SNAPSHOT.pom
channel stopped
Picked up JAVA_TOOL_OPTIONS: -Dfile.encoding=UTF8
Archiving artifacts

Mime
View raw message