flex-commits mailing list archives

Site index · List index
Message view « Date » · « Thread »
Top « Date » · « Thread »
From flex.ci.bui...@gmail.com
Subject Build failed in Jenkins: flex-asjs #872
Date Fri, 01 Jan 2016 06:13:07 GMT
See <http://apacheflexbuild.cloudapp.net:8080/job/flex-asjs/872/>

------------------------------------------
[...truncated 920 lines...]
     [java] Compiling file: <http://apacheflexbuild.cloudapp.net:8080/job/flex-asjs/ws/frameworks/projects/HTML/js/out/org/apache/flex/html/HRule.js>
     [java] Compiling file: <http://apacheflexbuild.cloudapp.net:8080/job/flex-asjs/ws/frameworks/projects/HTML/js/out/org/apache/flex/html/TextInput.js>
     [java] Compiling file: <http://apacheflexbuild.cloudapp.net:8080/job/flex-asjs/ws/frameworks/projects/HTML/js/out/org/apache/flex/html/supportClasses/Viewport.js>
     [java] Compiling file: <http://apacheflexbuild.cloudapp.net:8080/job/flex-asjs/ws/frameworks/projects/HTML/js/out/org/apache/flex/html/supportClasses/ScrollingViewport.js>
     [java] Compiling file: <http://apacheflexbuild.cloudapp.net:8080/job/flex-asjs/ws/frameworks/projects/HTML/js/out/org/apache/flex/html/Slider.js>
     [java] Compiling file: <http://apacheflexbuild.cloudapp.net:8080/job/flex-asjs/ws/frameworks/projects/HTML/js/out/org/apache/flex/html/beads/models/ViewportModel.js>
     [java] Compiling file: <http://apacheflexbuild.cloudapp.net:8080/job/flex-asjs/ws/frameworks/projects/HTML/js/out/org/apache/flex/html/beads/ImageView.js>
     [java] Compiling file: <http://apacheflexbuild.cloudapp.net:8080/job/flex-asjs/ws/frameworks/projects/HTML/js/out/org/apache/flex/html/supportClasses/UIItemRendererBase.js>
     [java] Compiling file: <http://apacheflexbuild.cloudapp.net:8080/job/flex-asjs/ws/frameworks/projects/HTML/js/out/org/apache/flex/html/beads/controllers/ListSingleSelectionMouseController.js>
     [java] Compiling file: <http://apacheflexbuild.cloudapp.net:8080/job/flex-asjs/ws/frameworks/projects/HTML/js/out/org/apache/flex/html/beads/ITextItemRenderer.js>
     [java] Compiling file: <http://apacheflexbuild.cloudapp.net:8080/job/flex-asjs/ws/frameworks/projects/HTML/js/out/org/apache/flex/html/supportClasses/ButtonBarButtonItemRenderer.js>
     [java] Compiling file: <http://apacheflexbuild.cloudapp.net:8080/job/flex-asjs/ws/frameworks/projects/HTML/js/out/org/apache/flex/html/beads/models/ArraySelectionModel.js>
     [java] Compiling file: <http://apacheflexbuild.cloudapp.net:8080/job/flex-asjs/ws/frameworks/projects/HTML/js/out/org/apache/flex/html/ButtonBar.js>
     [java] Compiling file: <http://apacheflexbuild.cloudapp.net:8080/job/flex-asjs/ws/frameworks/projects/HTML/js/out/org/apache/flex/html/beads/DateFieldView.js>
     [java] Compiling file: <http://apacheflexbuild.cloudapp.net:8080/job/flex-asjs/ws/frameworks/projects/HTML/js/out/org/apache/flex/html/supportClasses/Border.js>
     [java] Compiling file: <http://apacheflexbuild.cloudapp.net:8080/job/flex-asjs/ws/frameworks/projects/HTML/js/out/org/apache/flex/html/beads/models/TextModel.js>
     [java] Compiling file: <http://apacheflexbuild.cloudapp.net:8080/job/flex-asjs/ws/frameworks/projects/HTML/js/out/org/apache/flex/html/beads/models/ImageAndTextModel.js>
     [java] Compiling file: <http://apacheflexbuild.cloudapp.net:8080/job/flex-asjs/ws/frameworks/projects/HTML/js/out/org/apache/flex/html/TextButton.js>
     [java] Compiling file: <http://apacheflexbuild.cloudapp.net:8080/job/flex-asjs/ws/frameworks/projects/HTML/js/out/org/apache/flex/html/ToggleTextButton.js>
     [java] Compiling file: <http://apacheflexbuild.cloudapp.net:8080/job/flex-asjs/ws/frameworks/projects/HTML/js/out/org/apache/flex/html/DateChooser.js>
     [java] Compiling file: <http://apacheflexbuild.cloudapp.net:8080/job/flex-asjs/ws/frameworks/projects/HTML/js/out/org/apache/flex/html/beads/layouts/OneFlexibleChildHorizontalLayout.js>
     [java] Compiling file: <http://apacheflexbuild.cloudapp.net:8080/job/flex-asjs/ws/frameworks/projects/HTML/js/out/org/apache/flex/html/beads/DataGridLinesBead.js>
     [java] Compiling file: <http://apacheflexbuild.cloudapp.net:8080/job/flex-asjs/ws/frameworks/projects/HTML/js/out/org/apache/flex/html/beads/controllers/ItemRendererMouseController.js>
     [java] Found ignorable: goog.events.Event
     [java] Compiling file: <http://apacheflexbuild.cloudapp.net:8080/job/flex-asjs/ws/frameworks/projects/HTML/js/out/HTMLClasses.js>
     [java] Compiling file: <http://apacheflexbuild.cloudapp.net:8080/job/flex-asjs/ws/frameworks/projects/HTML/js/out/org/apache/flex/html/beads/layouts/LayoutChangeNotifier.js>
     [java] Compiling file: <http://apacheflexbuild.cloudapp.net:8080/job/flex-asjs/ws/frameworks/projects/HTML/js/out/org/apache/flex/html/beads/models/DateChooserModel.js>
     [java] Compiling file: <http://apacheflexbuild.cloudapp.net:8080/job/flex-asjs/ws/frameworks/projects/HTML/js/out/org/apache/flex/html/beads/models/PanelModel.js>
     [java] Compiling file: <http://apacheflexbuild.cloudapp.net:8080/job/flex-asjs/ws/frameworks/projects/HTML/js/out/org/apache/flex/html/beads/DataItemRendererFactoryForArrayList.js>
     [java] Compiling file: <http://apacheflexbuild.cloudapp.net:8080/job/flex-asjs/ws/frameworks/projects/HTML/js/out/org/apache/flex/html/beads/layouts/VerticalLayout.js>
     [java] Compiling file: <http://apacheflexbuild.cloudapp.net:8080/job/flex-asjs/ws/frameworks/projects/HTML/js/out/org/apache/flex/html/ImageButton.js>
     [java] Compiling file: <http://apacheflexbuild.cloudapp.net:8080/job/flex-asjs/ws/frameworks/projects/HTML/js/out/org/apache/flex/html/MXMLBeadViewBase.js>
     [java] Compiling file: <http://apacheflexbuild.cloudapp.net:8080/job/flex-asjs/ws/frameworks/projects/HTML/js/out/org/apache/flex/html/beads/TitleBarView.js>
     [java] Compiling file: <http://apacheflexbuild.cloudapp.net:8080/job/flex-asjs/ws/frameworks/projects/HTML/js/out/org/apache/flex/html/beads/controllers/DateChooserMouseController.js>
     [java] Compiling file: <http://apacheflexbuild.cloudapp.net:8080/job/flex-asjs/ws/frameworks/projects/HTML/js/out/org/apache/flex/html/beads/layouts/OneFlexibleChildVerticalLayout.js>
     [java] Compiling file: <http://apacheflexbuild.cloudapp.net:8080/job/flex-asjs/ws/frameworks/projects/HTML/js/out/org/apache/flex/html/supportClasses/DataItemRenderer.js>
     [java] Compiling file: <http://apacheflexbuild.cloudapp.net:8080/job/flex-asjs/ws/frameworks/projects/HTML/js/out/org/apache/flex/html/supportClasses/StringItemRenderer.js>
     [java] Compiling file: <http://apacheflexbuild.cloudapp.net:8080/job/flex-asjs/ws/frameworks/projects/HTML/js/out/org/apache/flex/html/beads/DateChooserView.js>
     [java] Compiling file: <http://apacheflexbuild.cloudapp.net:8080/job/flex-asjs/ws/frameworks/projects/HTML/js/out/org/apache/flex/html/Panel.js>
     [java] Compiling file: <http://apacheflexbuild.cloudapp.net:8080/job/flex-asjs/ws/frameworks/projects/HTML/js/out/org/apache/flex/html/beads/SliderTrackView.js>
     [java] Compiling file: <http://apacheflexbuild.cloudapp.net:8080/job/flex-asjs/ws/frameworks/projects/HTML/js/out/org/apache/flex/html/beads/models/ImageModel.js>
     [java] Compiling file: <http://apacheflexbuild.cloudapp.net:8080/job/flex-asjs/ws/frameworks/projects/HTML/js/out/org/apache/flex/html/beads/TextItemRendererFactoryForArrayData.js>
     [java] Compiling file: <http://apacheflexbuild.cloudapp.net:8080/job/flex-asjs/ws/frameworks/projects/HTML/js/out/org/apache/flex/html/beads/PanelView.js>
     [java] Compiling file: <http://apacheflexbuild.cloudapp.net:8080/job/flex-asjs/ws/frameworks/projects/HTML/js/out/org/apache/flex/html/ControlBar.js>
     [java] Compiling file: <http://apacheflexbuild.cloudapp.net:8080/job/flex-asjs/ws/frameworks/projects/HTML/js/out/org/apache/flex/html/beads/models/ListPresentationModel.js>
     [java] Compiling file: <http://apacheflexbuild.cloudapp.net:8080/job/flex-asjs/ws/frameworks/projects/HTML/js/out/org/apache/flex/html/beads/models/TitleBarModel.js>
     [java] Compiling file: <http://apacheflexbuild.cloudapp.net:8080/job/flex-asjs/ws/frameworks/projects/HTML/js/out/org/apache/flex/html/supportClasses/DateChooserButton.js>
     [java] Compiling file: <http://apacheflexbuild.cloudapp.net:8080/job/flex-asjs/ws/frameworks/projects/HTML/js/out/org/apache/flex/html/beads/ButtonBarView.js>
     [java] Compiling file: <http://apacheflexbuild.cloudapp.net:8080/job/flex-asjs/ws/frameworks/projects/HTML/js/out/org/apache/flex/html/accessories/PasswordInputBead.js>
     [java] Compiling file: <http://apacheflexbuild.cloudapp.net:8080/job/flex-asjs/ws/frameworks/projects/HTML/js/out/org/apache/flex/html/DateField.js>
     [java] Compiling file: <http://apacheflexbuild.cloudapp.net:8080/job/flex-asjs/ws/frameworks/projects/HTML/js/out/org/apache/flex/html/CloseButton.js>
     [java] Compiling file: <http://apacheflexbuild.cloudapp.net:8080/job/flex-asjs/ws/frameworks/projects/HTML/js/out/org/apache/flex/html/beads/layouts/ButtonBarLayout.js>
     [java] Compiling file: <http://apacheflexbuild.cloudapp.net:8080/job/flex-asjs/ws/frameworks/projects/HTML/js/out/org/apache/flex/html/ImageAndTextButton.js>
     [java] Compiling file: <http://apacheflexbuild.cloudapp.net:8080/job/flex-asjs/ws/frameworks/projects/HTML/js/out/org/apache/flex/html/beads/layouts/HorizontalLayout.js>
     [java] Compiling file: <http://apacheflexbuild.cloudapp.net:8080/job/flex-asjs/ws/frameworks/projects/HTML/js/out/org/apache/flex/html/supportClasses/DropDownListList.js>
     [java] Compiling file: <http://apacheflexbuild.cloudapp.net:8080/job/flex-asjs/ws/frameworks/projects/HTML/js/out/org/apache/flex/html/Alert.js>
     [java] Compiling file: <http://apacheflexbuild.cloudapp.net:8080/job/flex-asjs/ws/frameworks/projects/HTML/js/out/org/apache/flex/html/TextArea.js>
     [java] Compiling file: <http://apacheflexbuild.cloudapp.net:8080/job/flex-asjs/ws/frameworks/projects/HTML/js/out/org/apache/flex/html/MultilineLabel.js>
     [java] Compiling file: <http://apacheflexbuild.cloudapp.net:8080/job/flex-asjs/ws/frameworks/projects/HTML/js/out/org/apache/flex/svg/TextButton.js>
     [java] Compiling file: <http://apacheflexbuild.cloudapp.net:8080/job/flex-asjs/ws/frameworks/projects/HTML/js/out/org/apache/flex/html/beads/AlertView.js>
     [java] Compiling file: <http://apacheflexbuild.cloudapp.net:8080/job/flex-asjs/ws/frameworks/projects/HTML/js/out/org/apache/flex/html/beads/DataItemRendererFactoryForArrayData.js>
     [java] Compiling file: <http://apacheflexbuild.cloudapp.net:8080/job/flex-asjs/ws/frameworks/projects/HTML/js/out/org/apache/flex/html/Spinner.js>
     [java] Compiling file: <http://apacheflexbuild.cloudapp.net:8080/job/flex-asjs/ws/frameworks/projects/HTML/js/out/org/apache/flex/html/beads/models/DataGridPresentationModel.js>
     [java] Compiling file: <http://apacheflexbuild.cloudapp.net:8080/job/flex-asjs/ws/frameworks/projects/HTML/js/out/org/apache/flex/html/DataGrid.js>
     [java] Compiling file: <http://apacheflexbuild.cloudapp.net:8080/job/flex-asjs/ws/frameworks/projects/HTML/js/out/org/apache/flex/html/beads/layouts/TileLayout.js>
     [java] Compiling file: <http://apacheflexbuild.cloudapp.net:8080/job/flex-asjs/ws/frameworks/projects/HTML/js/out/org/apache/flex/html/beads/layouts/BasicLayout.js>
     [java] Compiling file: <http://apacheflexbuild.cloudapp.net:8080/job/flex-asjs/ws/frameworks/projects/HTML/js/out/org/apache/flex/html/accessories/NumericOnlyTextInputBead.js>
     [java] Compiling file: <http://apacheflexbuild.cloudapp.net:8080/job/flex-asjs/ws/frameworks/projects/HTML/js/out/org/apache/flex/html/beads/DataGridView.js>
     [java] Picked up JAVA_TOOL_OPTIONS: -Dfile.encoding=UTF8

compile-extern-swc:
     [echo] Compiling externs/HTML.swc
     [echo] FLEX_HOME: <http://apacheflexbuild.cloudapp.net:8080/job/flex-asjs/ws/>
     [echo] FALCON_HOME: <http://apacheflexbuild.cloudapp.net:8080/job/flex-asjs/ws/../flex-falcon/compiler/generated/dist/sdk>
    [compc] Loading configuration: <http://apacheflexbuild.cloudapp.net:8080/job/flex-asjs/ws/frameworks/projects/HTML/compile-asjs-config.xml>
    [compc] 
    [compc] Picked up JAVA_TOOL_OPTIONS: -Dfile.encoding=UTF8
    [compc] 268063 bytes written to C:\Jenkins\workspace\flex-asjs\frameworks\externs\HTML.swc
in 61.705 seconds

copy-js:
     [copy] Copying 110 files to <http://apacheflexbuild.cloudapp.net:8080/job/flex-asjs/ws/frameworks/js/FlexJS/libs>

compile:
     [echo] Compiling libs/HTML.swc
     [echo] FLEX_HOME: <http://apacheflexbuild.cloudapp.net:8080/job/flex-asjs/ws/>
     [echo] FALCON_HOME: <http://apacheflexbuild.cloudapp.net:8080/job/flex-asjs/ws/../flex-falcon/compiler/generated/dist/sdk>
    [compc] Loading configuration: <http://apacheflexbuild.cloudapp.net:8080/job/flex-asjs/ws/frameworks/projects/HTML/compile-config.xml>
    [compc] 
    [compc] 785695 bytes written to C:\Jenkins\workspace\flex-asjs\frameworks\libs\HTML.swc
in 64.709 seconds
    [compc] Picked up JAVA_TOOL_OPTIONS: -Dfile.encoding=UTF8

test:
[available] DEPRECATED - <available> used to override an existing property.
[available]   Build file should not reuse the same property name for different values.

clean:

compile:
     [echo] Compiling FlexUnitFlexJSApplication.swf
     [echo] FLEX_HOME: <http://apacheflexbuild.cloudapp.net:8080/job/flex-asjs/ws/>
     [echo] FALCON_HOME: <http://apacheflexbuild.cloudapp.net:8080/job/flex-asjs/ws/../flex-falcon/compiler/generated/dist/sdk>
     [echo] FLEXUNIT_HOME: C:\jenkins\workspace\flex-flexunit
     [echo] playerglobal.version: 11.7
    [mxmlc] Loading configuration: <http://apacheflexbuild.cloudapp.net:8080/job/flex-asjs/ws/frameworks/flex-config.xml>
    [mxmlc] 
    [mxmlc] C:\jenkins\workspace\flex-flexunit\FlexUnit4\target\flexunit-4.3.0-20140410-as3_4.12.0.swc
    [mxmlc] Warning: The definition mx.utils.ObjectUtil depended on by org.flexunit.runner.Description
in the SWC C:\jenkins\workspace\flex-flexunit\FlexUnit4\target\flexunit-4.3.0-20140410-as3_4.12.0.swc
could not be found
    [mxmlc] 
    [mxmlc] C:\jenkins\workspace\flex-flexunit\FlexUnit4\target\flexunit-4.3.0-20140410-as3_4.12.0.swc
    [mxmlc] Warning: The definition mx.utils.StringUtil depended on by flexunit.framework.AsyncTestHelper
in the SWC C:\jenkins\workspace\flex-flexunit\FlexUnit4\target\flexunit-4.3.0-20140410-as3_4.12.0.swc
could not be found
    [mxmlc] 
    [mxmlc] C:\jenkins\workspace\flex-flexunit\FlexUnit4\target\flexunit-4.3.0-20140410-as3_4.12.0.swc
    [mxmlc] Warning: The definition mx.utils.ObjectUtil depended on by flexunit.framework.Assert
in the SWC C:\jenkins\workspace\flex-flexunit\FlexUnit4\target\flexunit-4.3.0-20140410-as3_4.12.0.swc
could not be found
    [mxmlc] 
    [mxmlc] C:\jenkins\workspace\flex-flexunit\FlexUnit4\target\flexunit-4.3.0-20140410-as3_4.12.0.swc
    [mxmlc] Warning: The definition mx.utils.StringUtil depended on by flexunit.framework.Assert
in the SWC C:\jenkins\workspace\flex-flexunit\FlexUnit4\target\flexunit-4.3.0-20140410-as3_4.12.0.swc
could not be found
    [mxmlc] 
    [mxmlc] Picked up JAVA_TOOL_OPTIONS: -Dfile.encoding=UTF8
    [mxmlc] 129270 bytes written to C:\Jenkins\workspace\flex-asjs\frameworks\projects\HTML\as\tests\FlexUnitFlexJSApplication.swf
in 28.207 seconds

test:
 [flexunit] Validating task attributes ...
 [flexunit] Generating default values ...
 [flexunit] Using the following settings for the test run:
 [flexunit] 	FLEX_HOME: [<http://apacheflexbuild.cloudapp.net:8080/job/flex-asjs/ws/]>
 [flexunit] 	haltonfailure: [false]
 [flexunit] 	headless: [false]
 [flexunit] 	display: [99]
 [flexunit] 	localTrusted: [true]
 [flexunit] 	player: [flash]
 [flexunit] 	command: [C:\Program Files (x86)\Mozilla Firefox\firefox.exe]
 [flexunit] 	port: [1024]
 [flexunit] 	swf: [<http://apacheflexbuild.cloudapp.net:8080/job/flex-asjs/ws/frameworks/projects/HTML/as/tests/FlexUnitFlexJSApplication.swf]>
 [flexunit] 	timeout: [90000ms]
 [flexunit] 	toDir: [<http://apacheflexbuild.cloudapp.net:8080/job/flex-asjs/ws/frameworks/projects/HTML/as/tests/out]>
 [flexunit] Setting up server process ...
 [flexunit] Entry [<http://apacheflexbuild.cloudapp.net:8080/job/flex-asjs/ws/frameworks/projects/HTML/as/tests]>
already available in local trust file at [C:\Users\apacheflexbuild\AppData\Roaming\Macromedia\Flash
Player\#Security\FlashPlayerTrust\flexUnit.cfg].
 [flexunit] Executing 'C:\Program Files (x86)\Mozilla Firefox\firefox.exe' with arguments:
 [flexunit] '<http://apacheflexbuild.cloudapp.net:8080/job/flex-asjs/ws/frameworks/projects/HTML/as/tests/FlexUnitFlexJSApplication.swf'>
 [flexunit] 
 [flexunit] The ' characters around the executable and arguments are
 [flexunit] not part of the command.
 [flexunit] 
 [flexunit] Starting server ...
 [flexunit] Opening server socket on port [1024].
 [flexunit] Waiting for client connection ...
 [flexunit] 
 [flexunit] Stopping server ...
 [flexunit] End of test data reached, sending acknowledgement to player ...
 [flexunit] Closing client connection ...
 [flexunit] Closing server on port [1024] ...

BUILD FAILED
<http://apacheflexbuild.cloudapp.net:8080/job/flex-asjs/ws/build.xml>:431: The following
error occurred while executing this line:
<http://apacheflexbuild.cloudapp.net:8080/job/flex-asjs/ws/frameworks/build.xml>:83:
The following error occurred while executing this line:
<http://apacheflexbuild.cloudapp.net:8080/job/flex-asjs/ws/frameworks/build.xml>:202:
The following error occurred while executing this line:
<http://apacheflexbuild.cloudapp.net:8080/job/flex-asjs/ws/frameworks/projects/HTML/build.xml>:39:
The following error occurred while executing this line:
<http://apacheflexbuild.cloudapp.net:8080/job/flex-asjs/ws/frameworks/projects/HTML/as/tests/build.xml>:146:
java.util.concurrent.ExecutionException: Socket timeout waiting for flexunit report
	at java.util.concurrent.FutureTask.report(FutureTask.java:122)
	at java.util.concurrent.FutureTask.get(FutureTask.java:188)
	at org.flexunit.ant.tasks.TestRun.run(Unknown Source)
	at org.flexunit.ant.tasks.FlexUnitTask.execute(Unknown Source)
	at org.apache.tools.ant.UnknownElement.execute(UnknownElement.java:292)
	at sun.reflect.GeneratedMethodAccessor4.invoke(Unknown Source)
	at sun.reflect.DelegatingMethodAccessorImpl.invoke(DelegatingMethodAccessorImpl.java:43)
	at java.lang.reflect.Method.invoke(Method.java:606)
	at org.apache.tools.ant.dispatch.DispatchUtils.execute(DispatchUtils.java:106)
	at org.apache.tools.ant.Task.perform(Task.java:348)
	at org.apache.tools.ant.Target.execute(Target.java:435)
	at org.apache.tools.ant.Target.performTasks(Target.java:456)
	at org.apache.tools.ant.Project.executeSortedTargets(Project.java:1393)
	at org.apache.tools.ant.helper.SingleCheckExecutor.executeTargets(SingleCheckExecutor.java:38)
	at org.apache.tools.ant.Project.executeTargets(Project.java:1248)
	at org.apache.tools.ant.taskdefs.Ant.execute(Ant.java:440)
	at org.apache.tools.ant.UnknownElement.execute(UnknownElement.java:292)
	at sun.reflect.GeneratedMethodAccessor4.invoke(Unknown Source)
	at sun.reflect.DelegatingMethodAccessorImpl.invoke(DelegatingMethodAccessorImpl.java:43)
	at java.lang.reflect.Method.invoke(Method.java:606)
	at org.apache.tools.ant.dispatch.DispatchUtils.execute(DispatchUtils.java:106)
	at org.apache.tools.ant.Task.perform(Task.java:348)
	at org.apache.tools.ant.Target.execute(Target.java:435)
	at org.apache.tools.ant.Target.performTasks(Target.java:456)
	at org.apache.tools.ant.Project.executeSortedTargets(Project.java:1393)
	at org.apache.tools.ant.helper.SingleCheckExecutor.executeTargets(SingleCheckExecutor.java:38)
	at org.apache.tools.ant.Project.executeTargets(Project.java:1248)
	at org.apache.tools.ant.taskdefs.Ant.execute(Ant.java:440)
	at org.apache.tools.ant.UnknownElement.execute(UnknownElement.java:292)
	at sun.reflect.GeneratedMethodAccessor4.invoke(Unknown Source)
	at sun.reflect.DelegatingMethodAccessorImpl.invoke(DelegatingMethodAccessorImpl.java:43)
	at java.lang.reflect.Method.invoke(Method.java:606)
	at org.apache.tools.ant.dispatch.DispatchUtils.execute(DispatchUtils.java:106)
	at org.apache.tools.ant.Task.perform(Task.java:348)
	at org.apache.tools.ant.Target.execute(Target.java:435)
	at org.apache.tools.ant.Target.performTasks(Target.java:456)
	at org.apache.tools.ant.Project.executeSortedTargets(Project.java:1393)
	at org.apache.tools.ant.helper.SingleCheckExecutor.executeTargets(SingleCheckExecutor.java:38)
	at org.apache.tools.ant.Project.executeTargets(Project.java:1248)
	at org.apache.tools.ant.taskdefs.Ant.execute(Ant.java:440)
	at org.apache.tools.ant.taskdefs.CallTarget.execute(CallTarget.java:105)
	at org.apache.tools.ant.UnknownElement.execute(UnknownElement.java:292)
	at sun.reflect.GeneratedMethodAccessor4.invoke(Unknown Source)
	at sun.reflect.DelegatingMethodAccessorImpl.invoke(DelegatingMethodAccessorImpl.java:43)
	at java.lang.reflect.Method.invoke(Method.java:606)
	at org.apache.tools.ant.dispatch.DispatchUtils.execute(DispatchUtils.java:106)
	at org.apache.tools.ant.Task.perform(Task.java:348)
	at org.apache.tools.ant.Target.execute(Target.java:435)
	at org.apache.tools.ant.Target.performTasks(Target.java:456)
	at org.apache.tools.ant.Project.executeSortedTargets(Project.java:1393)
	at org.apache.tools.ant.helper.SingleCheckExecutor.executeTargets(SingleCheckExecutor.java:38)
	at org.apache.tools.ant.Project.executeTargets(Project.java:1248)
	at org.apache.tools.ant.taskdefs.Ant.execute(Ant.java:440)
	at org.apache.tools.ant.UnknownElement.execute(UnknownElement.java:292)
	at sun.reflect.GeneratedMethodAccessor4.invoke(Unknown Source)
	at sun.reflect.DelegatingMethodAccessorImpl.invoke(DelegatingMethodAccessorImpl.java:43)
	at java.lang.reflect.Method.invoke(Method.java:606)
	at org.apache.tools.ant.dispatch.DispatchUtils.execute(DispatchUtils.java:106)
	at org.apache.tools.ant.Task.perform(Task.java:348)
	at org.apache.tools.ant.Target.execute(Target.java:435)
	at org.apache.tools.ant.Target.performTasks(Target.java:456)
	at org.apache.tools.ant.Project.executeSortedTargets(Project.java:1393)
	at org.apache.tools.ant.Project.executeTarget(Project.java:1364)
	at org.apache.tools.ant.helper.DefaultExecutor.executeTargets(DefaultExecutor.java:41)
	at org.apache.tools.ant.Project.executeTargets(Project.java:1248)
	at org.apache.tools.ant.Main.runBuild(Main.java:851)
	at org.apache.tools.ant.Main.startAnt(Main.java:235)
	at org.apache.tools.ant.launch.Launcher.run(Launcher.java:280)
	at org.apache.tools.ant.launch.Launcher.main(Launcher.java:109)
Caused by: Socket timeout waiting for flexunit report
	at org.flexunit.ant.FlexUnitSocketServer.start(Unknown Source)
	at org.flexunit.ant.FlexUnitSocketThread.call(Unknown Source)
	at java.util.concurrent.FutureTask.run(FutureTask.java:262)
	at java.util.concurrent.ThreadPoolExecutor.runWorker(ThreadPoolExecutor.java:1145)
	at java.util.concurrent.ThreadPoolExecutor$Worker.run(ThreadPoolExecutor.java:615)
	at java.lang.Thread.run(Thread.java:745)
Caused by: java.net.SocketTimeoutException: Accept timed out
	at java.net.DualStackPlainSocketImpl.waitForNewConnection(Native Method)
	at java.net.DualStackPlainSocketImpl.socketAccept(DualStackPlainSocketImpl.java:135)
	at java.net.AbstractPlainSocketImpl.accept(AbstractPlainSocketImpl.java:398)
	at java.net.PlainSocketImpl.accept(PlainSocketImpl.java:198)
	at java.net.ServerSocket.implAccept(ServerSocket.java:530)
	at java.net.ServerSocket.accept(ServerSocket.java:498)
	at org.flexunit.ant.FlexUnitSocketServer.openClientSocket(Unknown Source)
	... 6 more

Total time: 12 minutes 17 seconds
Picked up JAVA_TOOL_OPTIONS: -Dfile.encoding=UTF8
Process leaked file descriptors. See http://wiki.jenkins-ci.org/display/JENKINS/Spawning+processes+from+build
for more information
Build step 'Invoke Ant' marked build as failure
Skipped archiving because build is not successful

Mime
View raw message