flex-commits mailing list archives

Site index · List index
Message view « Date » · « Thread »
Top « Date » · « Thread »
From flex.ci.bui...@gmail.com
Subject Build failed in Jenkins: flex-asjs #876
Date Mon, 04 Jan 2016 06:28:42 GMT
See <http://apacheflexbuild.cloudapp.net:8080/job/flex-asjs/876/changes>

Changes:

[Alex Harui] try using standalone player and specify non-flex flexunit to reduce socket timeouts

------------------------------------------
[...truncated 1729 lines...]
     [java] Dependencies calculated for '<http://apacheflexbuild.cloudapp.net:8080/job/flex-asjs/ws/mustella/tests/bin/js-debug/org/apache/flex/core/IBeadModel.js'>
     [java] Dependencies calculated for '<http://apacheflexbuild.cloudapp.net:8080/job/flex-asjs/ws/mustella/tests/bin/js-debug/org/apache/flex/core/IBeadController.js'>
     [java] Dependencies calculated for '<http://apacheflexbuild.cloudapp.net:8080/job/flex-asjs/ws/mustella/tests/bin/js-debug/org/apache/flex/core/IBeadView.js'>
     [java] Dependencies calculated for '<http://apacheflexbuild.cloudapp.net:8080/job/flex-asjs/ws/mustella/tests/bin/js-debug/org/apache/flex/core/IFlexJSElement.js'>
     [java] Dependencies calculated for '<http://apacheflexbuild.cloudapp.net:8080/job/flex-asjs/ws/mustella/tests/bin/js-debug/org/apache/flex/core/ILayoutChild.js'>
     [java] Dependencies calculated for '<http://apacheflexbuild.cloudapp.net:8080/job/flex-asjs/ws/mustella/tests/bin/js-debug/org/apache/flex/core/IMeasurementBead.js'>
     [java] Dependencies calculated for '<http://apacheflexbuild.cloudapp.net:8080/job/flex-asjs/ws/mustella/tests/bin/js-debug/org/apache/flex/core/IParentIUIBase.js'>
     [java] Dependencies calculated for '<http://apacheflexbuild.cloudapp.net:8080/job/flex-asjs/ws/mustella/tests/bin/js-debug/org/apache/flex/core/IStrandWithModel.js'>
     [java] Dependencies calculated for '<http://apacheflexbuild.cloudapp.net:8080/job/flex-asjs/ws/mustella/tests/bin/js-debug/org/apache/flex/core/IStyleableObject.js'>
     [java] Dependencies calculated for '<http://apacheflexbuild.cloudapp.net:8080/job/flex-asjs/ws/mustella/tests/bin/js-debug/org/apache/flex/core/IContentView.js'>
     [java] Dependencies calculated for '<http://apacheflexbuild.cloudapp.net:8080/job/flex-asjs/ws/mustella/tests/bin/js-debug/org/apache/flex/html/beads/layouts/BasicLayout.js'>
     [java] Dependencies calculated for '<http://apacheflexbuild.cloudapp.net:8080/job/flex-asjs/ws/mustella/tests/bin/js-debug/org/apache/flex/core/IBeadLayout.js'>
     [java] Dependencies calculated for '<http://apacheflexbuild.cloudapp.net:8080/job/flex-asjs/ws/mustella/tests/bin/js-debug/org/apache/flex/core/ILayoutHost.js'>
     [java] Dependencies calculated for '<http://apacheflexbuild.cloudapp.net:8080/job/flex-asjs/ws/mustella/tests/bin/js-debug/org/apache/flex/html/supportClasses/Viewport.js'>
     [java] Dependencies calculated for '<http://apacheflexbuild.cloudapp.net:8080/job/flex-asjs/ws/mustella/tests/bin/js-debug/org/apache/flex/geom/Rectangle.js'>
     [java] Dependencies calculated for '<http://apacheflexbuild.cloudapp.net:8080/job/flex-asjs/ws/mustella/tests/bin/js-debug/org/apache/flex/geom/Size.js'>
     [java] Dependencies calculated for '<http://apacheflexbuild.cloudapp.net:8080/job/flex-asjs/ws/mustella/tests/bin/js-debug/org/apache/flex/utils/CSSContainerUtils.js'>
     [java] Dependencies calculated for '<http://apacheflexbuild.cloudapp.net:8080/job/flex-asjs/ws/mustella/tests/bin/js-debug/org/apache/flex/utils/CSSUtils.js'>
     [java] Dependencies calculated for '<http://apacheflexbuild.cloudapp.net:8080/job/flex-asjs/ws/mustella/tests/bin/js-debug/org/apache/flex/core/IViewport.js'>
     [java] Dependencies calculated for '<http://apacheflexbuild.cloudapp.net:8080/job/flex-asjs/ws/mustella/tests/bin/js-debug/org/apache/flex/html/beads/ContainerView.js'>
     [java] Dependencies calculated for '<http://apacheflexbuild.cloudapp.net:8080/job/flex-asjs/ws/mustella/tests/bin/js-debug/org/apache/flex/core/BeadViewBase.js'>
     [java] Dependencies calculated for '<http://apacheflexbuild.cloudapp.net:8080/job/flex-asjs/ws/mustella/tests/bin/js-debug/org/apache/flex/core/IContainerView.js'>
     [java] Dependencies calculated for '<http://apacheflexbuild.cloudapp.net:8080/job/flex-asjs/ws/mustella/tests/bin/js-debug/org/apache/flex/core/IContentViewHost.js'>
     [java] Dependencies calculated for '<http://apacheflexbuild.cloudapp.net:8080/job/flex-asjs/ws/mustella/tests/bin/js-debug/org/apache/flex/core/IViewportModel.js'>
     [java] Dependencies calculated for '<http://apacheflexbuild.cloudapp.net:8080/job/flex-asjs/ws/mustella/tests/bin/js-debug/org/apache/flex/html/beads/IBackgroundBead.js'>
     [java] Dependencies calculated for '<http://apacheflexbuild.cloudapp.net:8080/job/flex-asjs/ws/mustella/tests/bin/js-debug/org/apache/flex/html/beads/IBorderBead.js'>
     [java] Dependencies calculated for '<http://apacheflexbuild.cloudapp.net:8080/job/flex-asjs/ws/mustella/tests/bin/js-debug/org/apache/flex/html/beads/models/ViewportModel.js'>
     [java] Dependencies calculated for '<http://apacheflexbuild.cloudapp.net:8080/job/flex-asjs/ws/mustella/tests/bin/js-debug/org/apache/flex/html/beads/DataItemRendererFactoryForArrayList.js'>
     [java] Dependencies calculated for '<http://apacheflexbuild.cloudapp.net:8080/job/flex-asjs/ws/mustella/tests/bin/js-debug/org/apache/flex/collections/ArrayList.js'>
     [java] Dependencies calculated for '<http://apacheflexbuild.cloudapp.net:8080/job/flex-asjs/ws/mustella/tests/bin/js-debug/org/apache/flex/collections/ICollection.js'>
     [java] Dependencies calculated for '<http://apacheflexbuild.cloudapp.net:8080/job/flex-asjs/ws/mustella/tests/bin/js-debug/org/apache/flex/core/SimpleCSSStyles.js'>
     [java] Dependencies calculated for '<http://apacheflexbuild.cloudapp.net:8080/job/flex-asjs/ws/mustella/tests/bin/js-debug/org/apache/flex/html/List.js'>
     [java] Dependencies calculated for '<http://apacheflexbuild.cloudapp.net:8080/job/flex-asjs/ws/mustella/tests/bin/js-debug/org/apache/flex/core/ListBase.js'>
     [java] Dependencies calculated for '<http://apacheflexbuild.cloudapp.net:8080/job/flex-asjs/ws/mustella/tests/bin/js-debug/org/apache/flex/core/ListBaseStrandChildren.js'>
     [java] Dependencies calculated for '<http://apacheflexbuild.cloudapp.net:8080/job/flex-asjs/ws/mustella/tests/bin/js-debug/org/apache/flex/html/beads/ListView.js'>
     [java] Dependencies calculated for '<http://apacheflexbuild.cloudapp.net:8080/job/flex-asjs/ws/mustella/tests/bin/js-debug/org/apache/flex/html/supportClasses/Border.js'>
     [java] Dependencies calculated for '<http://apacheflexbuild.cloudapp.net:8080/job/flex-asjs/ws/mustella/tests/bin/js-debug/org/apache/flex/core/IItemRendererParent.js'>
     [java] Dependencies calculated for '<http://apacheflexbuild.cloudapp.net:8080/job/flex-asjs/ws/mustella/tests/bin/js-debug/org/apache/flex/core/IItemRenderer.js'>
     [java] Dependencies calculated for '<http://apacheflexbuild.cloudapp.net:8080/job/flex-asjs/ws/mustella/tests/bin/js-debug/org/apache/flex/core/IRollOverModel.js'>
     [java] Dependencies calculated for '<http://apacheflexbuild.cloudapp.net:8080/job/flex-asjs/ws/mustella/tests/bin/js-debug/org/apache/flex/core/ISelectableItemRenderer.js'>
     [java] Dependencies calculated for '<http://apacheflexbuild.cloudapp.net:8080/job/flex-asjs/ws/mustella/tests/bin/js-debug/org/apache/flex/core/ISelectionModel.js'>
     [java] Dependencies calculated for '<http://apacheflexbuild.cloudapp.net:8080/job/flex-asjs/ws/mustella/tests/bin/js-debug/org/apache/flex/html/beads/IListView.js'>
     [java] Dependencies calculated for '<http://apacheflexbuild.cloudapp.net:8080/job/flex-asjs/ws/mustella/tests/bin/js-debug/org/apache/flex/html/beads/models/ListPresentationModel.js'>
     [java] Dependencies calculated for '<http://apacheflexbuild.cloudapp.net:8080/job/flex-asjs/ws/mustella/tests/bin/js-debug/org/apache/flex/core/IListPresentationModel.js'>
     [java] Dependencies calculated for '<http://apacheflexbuild.cloudapp.net:8080/job/flex-asjs/ws/mustella/tests/bin/js-debug/org/apache/flex/html/supportClasses/DataGroup.js'>
     [java] Dependencies calculated for '<http://apacheflexbuild.cloudapp.net:8080/job/flex-asjs/ws/mustella/tests/bin/js-debug/org/apache/flex/html/supportClasses/DataItemRenderer.js'>
     [java] Dependencies calculated for '<http://apacheflexbuild.cloudapp.net:8080/job/flex-asjs/ws/mustella/tests/bin/js-debug/org/apache/flex/html/beads/controllers/ItemRendererMouseController.js'>
     [java] Dependencies calculated for '<http://apacheflexbuild.cloudapp.net:8080/job/flex-asjs/ws/mustella/tests/bin/js-debug/org/apache/flex/html/supportClasses/UIItemRendererBase.js'>
     [java] Dependencies calculated for '<http://apacheflexbuild.cloudapp.net:8080/job/flex-asjs/ws/mustella/tests/bin/js-debug/org/apache/flex/core/IDataProviderItemRendererMapper.js'>
     [java] Dependencies calculated for '<http://apacheflexbuild.cloudapp.net:8080/job/flex-asjs/ws/mustella/tests/bin/js-debug/org/apache/flex/core/IItemRendererClassFactory.js'>
     [java] Dependencies calculated for '<http://apacheflexbuild.cloudapp.net:8080/job/flex-asjs/ws/mustella/tests/bin/js-debug/org/apache/flex/core/IFactory.js'>
     [java] Dependencies calculated for '<http://apacheflexbuild.cloudapp.net:8080/job/flex-asjs/ws/mustella/tests/bin/js-debug/org/apache/flex/core/IItemRendererProvider.js'>
     [java] Dependencies calculated for '<http://apacheflexbuild.cloudapp.net:8080/job/flex-asjs/ws/mustella/tests/bin/js-debug/org/apache/flex/html/beads/layouts/VerticalLayout.js'>
     [java] Dependencies calculated for '<http://apacheflexbuild.cloudapp.net:8080/job/flex-asjs/ws/mustella/tests/bin/js-debug/org/apache/flex/html/beads/controllers/ListSingleSelectionMouseController.js'>
     [java] Dependencies calculated for '<http://apacheflexbuild.cloudapp.net:8080/job/flex-asjs/ws/mustella/tests/bin/js-debug/org/apache/flex/events/MouseEvent.js'>
     [java] Dependencies calculated for '<http://apacheflexbuild.cloudapp.net:8080/job/flex-asjs/ws/mustella/tests/bin/js-debug/org/apache/flex/geom/Point.js'>
     [java] Dependencies calculated for '<http://apacheflexbuild.cloudapp.net:8080/job/flex-asjs/ws/mustella/tests/bin/js-debug/org/apache/flex/utils/PointUtils.js'>
     [java] Dependencies calculated for '<http://apacheflexbuild.cloudapp.net:8080/job/flex-asjs/ws/mustella/tests/bin/js-debug/org/apache/flex/core/ItemRendererClassFactory.js'>
     [java] Dependencies calculated for '<http://apacheflexbuild.cloudapp.net:8080/job/flex-asjs/ws/mustella/tests/bin/js-debug/org/apache/flex/core/ClassFactory.js'>
     [java] Dependencies calculated for '<http://apacheflexbuild.cloudapp.net:8080/job/flex-asjs/ws/mustella/tests/bin/js-debug/org/apache/flex/core/Strand.js'>
     [java] Dependencies calculated for '<http://apacheflexbuild.cloudapp.net:8080/job/flex-asjs/ws/mustella/tests/bin/js-debug/org/apache/flex/html/supportClasses/StringItemRenderer.js'>
     [java] Dependencies calculated for '<http://apacheflexbuild.cloudapp.net:8080/job/flex-asjs/ws/mustella/tests/bin/js-debug/org/apache/flex/html/beads/ITextItemRenderer.js'>
     [java] Dependencies calculated for '<http://apacheflexbuild.cloudapp.net:8080/job/flex-asjs/ws/mustella/tests/bin/js-debug/org/apache/flex/html/beads/models/DataGridModel.js'>
     [java] Dependencies calculated for '<http://apacheflexbuild.cloudapp.net:8080/job/flex-asjs/ws/mustella/tests/bin/js-debug/org/apache/flex/html/beads/models/ArrayListSelectionModel.js'>
     [java] Dependencies calculated for '<http://apacheflexbuild.cloudapp.net:8080/job/flex-asjs/ws/mustella/tests/bin/js-debug/org/apache/flex/core/IDataGridModel.js'>
     [java] Dependencies calculated for '<http://apacheflexbuild.cloudapp.net:8080/job/flex-asjs/ws/mustella/tests/bin/js-debug/org/apache/flex/html/beads/DataItemRendererFactoryForArrayData.js'>
     [java] Dependencies calculated for '<http://apacheflexbuild.cloudapp.net:8080/job/flex-asjs/ws/mustella/tests/bin/js-debug/org/apache/flex/html/supportClasses/ScrollingViewport.js'>
     [java] Dependencies calculated for '<http://apacheflexbuild.cloudapp.net:8080/job/flex-asjs/ws/mustella/tests/bin/js-debug/org/apache/flex/html/beads/models/ArraySelectionModel.js'>
     [java] Dependencies calculated for '<http://apacheflexbuild.cloudapp.net:8080/job/flex-asjs/ws/mustella/tests/bin/js-debug/org/apache/flex/core/Application.js'>
     [java] Dependencies calculated for '<http://apacheflexbuild.cloudapp.net:8080/job/flex-asjs/ws/mustella/tests/bin/js-debug/org/apache/flex/core/ApplicationBase.js'>
     [java] Dependencies calculated for '<http://apacheflexbuild.cloudapp.net:8080/job/flex-asjs/ws/mustella/tests/bin/js-debug/org/apache/flex/core/IFlexInfo.js'>
     [java] Dependencies calculated for '<http://apacheflexbuild.cloudapp.net:8080/job/flex-asjs/ws/mustella/tests/bin/js-debug/org/apache/flex/core/IApplicationView.js'>
     [java] Dependencies calculated for '<http://apacheflexbuild.cloudapp.net:8080/job/flex-asjs/ws/mustella/tests/bin/js-debug/org/apache/flex/core/SimpleCSSValuesImpl.js'>
     [java] Dependencies calculated for '<http://apacheflexbuild.cloudapp.net:8080/job/flex-asjs/ws/mustella/tests/bin/js-debug/BasicTests.js'>
     [java] Dependencies calculated for '<http://apacheflexbuild.cloudapp.net:8080/job/flex-asjs/ws/mustella/tests/bin/js-debug/org/apache/flex/core/ViewBase.js'>
     [java] Dependencies calculated for '<http://apacheflexbuild.cloudapp.net:8080/job/flex-asjs/ws/mustella/tests/bin/js-debug/org/apache/flex/core/ContainerBase.js'>
     [java] Dependencies calculated for '<http://apacheflexbuild.cloudapp.net:8080/job/flex-asjs/ws/mustella/tests/bin/js-debug/org/apache/flex/core/ContainerBaseStrandChildren.js'>
     [java] Dependencies calculated for '<http://apacheflexbuild.cloudapp.net:8080/job/flex-asjs/ws/mustella/tests/bin/js-debug/org/apache/flex/core/IPopUpHost.js'>
     [java] Dependencies calculated for '<http://apacheflexbuild.cloudapp.net:8080/job/flex-asjs/ws/mustella/tests/bin/js-debug/halo/views/ButtonTests.js'>
     [java] Dependencies calculated for '<http://apacheflexbuild.cloudapp.net:8080/job/flex-asjs/ws/mustella/tests/bin/js-debug/shim/VBox.js'>
     [java] Dependencies calculated for '<http://apacheflexbuild.cloudapp.net:8080/job/flex-asjs/ws/mustella/tests/bin/js-debug/org/apache/flex/html/Container.js'>
     [java] Dependencies calculated for '<http://apacheflexbuild.cloudapp.net:8080/job/flex-asjs/ws/mustella/tests/bin/js-debug/org/apache/flex/html/TextButton.js'>
     [java] Dependencies calculated for '<http://apacheflexbuild.cloudapp.net:8080/job/flex-asjs/ws/mustella/tests/bin/js-debug/org/apache/flex/html/Button.js'>
     [java] Dependencies calculated for '<http://apacheflexbuild.cloudapp.net:8080/job/flex-asjs/ws/mustella/tests/bin/js-debug/org/apache/flex/html/Label.js'>
     [java] Dependencies calculated for '<http://apacheflexbuild.cloudapp.net:8080/job/flex-asjs/ws/mustella/tests/bin/js-debug/halo/views/CheckBoxTests.js'>
     [java] Dependencies calculated for '<http://apacheflexbuild.cloudapp.net:8080/job/flex-asjs/ws/mustella/tests/bin/js-debug/org/apache/flex/html/CheckBox.js'>
     [java] Dependencies calculated for '<http://apacheflexbuild.cloudapp.net:8080/job/flex-asjs/ws/mustella/tests/bin/js-debug/org/apache/flex/utils/MixinManager.js'>
     [java] Dependencies calculated for '<http://apacheflexbuild.cloudapp.net:8080/job/flex-asjs/ws/mustella/tests/bin/js-debug/org/apache/flex/core/CSSFontFaceBead.js'>
     [java] Dependencies calculated for '<http://apacheflexbuild.cloudapp.net:8080/job/flex-asjs/ws/mustella/tests/bin/js-debug/org/apache/flex/utils/Language.js'>
     [java] Jan 04, 2016 6:27:05 AM com.google.javascript.jscomp.LoggerErrorManager printSummary
     [java] INFO: 0 error(s), 0 warning(s), 96.04711806492222% typed
     [java] The project 'BasicTestsApp' has been successfully compiled and optimized.
     [java] Picked up JAVA_TOOL_OPTIONS: -Dfile.encoding=UTF8

basictests-compile-java:
   [delete] Deleting directory <http://apacheflexbuild.cloudapp.net:8080/job/flex-asjs/ws/mustella/java/bin>
    [mkdir] Created dir: <http://apacheflexbuild.cloudapp.net:8080/job/flex-asjs/ws/mustella/java/bin>
    [javac] <http://apacheflexbuild.cloudapp.net:8080/job/flex-asjs/ws/build.xml>:1142:
warning: 'includeantruntime' was not set, defaulting to build.sysclasspath=last; set to false
for repeatable builds
    [javac] Compiling 11 source files to <http://apacheflexbuild.cloudapp.net:8080/job/flex-asjs/ws/mustella/java/bin>

basictests-run-js:
     [echo] url=file://<http://apacheflexbuild.cloudapp.net:8080/job/flex-asjs/ws/mustella/tests/basicTests/bin/js-debug/index.html>
     [echo] script=<http://apacheflexbuild.cloudapp.net:8080/job/flex-asjs/ws/mustella/tests/basicTests/halo/scripts/ButtonTestScript.mxml>
     [echo] script=<http://apacheflexbuild.cloudapp.net:8080/job/flex-asjs/ws/mustella/tests/basicTests/halo/scripts/CheckBoxTestScript.mxml>
     [java] file://<http://apacheflexbuild.cloudapp.net:8080/job/flex-asjs/ws/mustella/tests/bin/js-debug/index.html>
     [java] org.openqa.selenium.firefox.NotConnectedException: Unable to connect to host 127.0.0.1
on port 7055 after 45000 ms. Firefox console output:
     [java] ata\Local\Temp\2\anonymous6647499736003505693webdriver-profile\extensions\fxdriver@googlecode.com
     [java] 1451888863559	addons.xpi	DEBUG	Ignoring file entry whose name is not a valid add-on
ID: C:\Users\APACHE~1\AppData\Local\Temp\2\anonymous6647499736003505693webdriver-profile\extensions\webdriver-staging
     [java] 1451888863560	addons.xpi	INFO	SystemAddonInstallLocation directory is missing
     [java] 1451888863567	addons.xpi	INFO	Mapping {972ce4c6-7e08-4474-a285-3208198ce6fd} to
C:\Program Files (x86)\Mozilla Firefox\browser\extensions\{972ce4c6-7e08-4474-a285-3208198ce6fd}
     [java] 1451888863567	addons.xpi	DEBUG	Skipping unavailable install location app-system-share
     [java] 1451888863568	addons.xpi	DEBUG	Skipping unavailable install location app-system-local
     [java] 1451888863568	addons.xpi	DEBUG	checkForChanges
     [java] 1451888863569	addons.xpi	DEBUG	Loaded add-on state from prefs: {"app-profile":{"fxdriver@googlecode.com":{"d":"C:\\Users\\APACHE~1\\AppData\\Local\\Temp\\2\\anonymous6647499736003505693webdriver-profile\\extensions\\fxdriver@googlecode.com","e":false,"v":"2.45.0","st":1451888844694,"mt":1451888844626}},"app-global":{"{972ce4c6-7e08-4474-a285-3208198ce6fd}":{"d":"C:\\Program
Files (x86)\\Mozilla Firefox\\browser\\extensions\\{972ce4c6-7e08-4474-a285-3208198ce6fd}","e":true,"v":"43.0.1","st":1451367994962,"mt":1451367994781}}}
     [java] 1451888863570	addons.xpi	DEBUG	Existing add-on fxdriver@googlecode.com in app-profile
     [java] 1451888863577	addons.xpi	DEBUG	getModTime: Recursive scan of {972ce4c6-7e08-4474-a285-3208198ce6fd}
     [java] 1451888863578	addons.xpi	DEBUG	Existing add-on {972ce4c6-7e08-4474-a285-3208198ce6fd}
in app-global
     [java] 1451888863578	addons.xpi	DEBUG	getInstallState changed: false, state: {"app-profile":{"fxdriver@googlecode.com":{"d":"C:\\Users\\APACHE~1\\AppData\\Local\\Temp\\2\\anonymous6647499736003505693webdriver-profile\\extensions\\fxdriver@googlecode.com","e":false,"v":"2.45.0","st":1451888844694,"mt":1451888844626}},"app-global":{"{972ce4c6-7e08-4474-a285-3208198ce6fd}":{"d":"C:\\Program
Files (x86)\\Mozilla Firefox\\browser\\extensions\\{972ce4c6-7e08-4474-a285-3208198ce6fd}","e":true,"v":"43.0.1","st":1451367994962,"mt":1451367994781}}}
     [java] 1451888863580	addons.xpi	DEBUG	No changes found
     [java] 1451888863607	addons.manager	DEBUG	Registering shutdown blocker for XPIProvider
     [java] 1451888863608	addons.manager	DEBUG	Provider finished startup: XPIProvider
     [java] 1451888863608	addons.manager	DEBUG	Starting provider: LightweightThemeManager
     [java] 1451888863608	addons.manager	DEBUG	Registering shutdown blocker for LightweightThemeManager
     [java] 1451888863609	addons.manager	DEBUG	Provider finished startup: LightweightThemeManager
     [java] 1451888863610	addons.manager	DEBUG	Starting provider: GMPProvider
     [java] 1451888863630	addons.manager	DEBUG	Registering shutdown blocker for GMPProvider
     [java] 1451888863630	addons.manager	DEBUG	Provider finished startup: GMPProvider
     [java] 1451888863630	addons.manager	DEBUG	Starting provider: PluginProvider
     [java] 1451888863631	addons.manager	DEBUG	Registering shutdown blocker for PluginProvider
     [java] 1451888863637	addons.manager	DEBUG	Provider finished startup: PluginProvider
     [java] 1451888863637	addons.manager	DEBUG	Completed startup sequence
     [java] 1451888863798	addons.xpi-utils	DEBUG	Starting async load of XPI database C:\Users\APACHE~1\AppData\Local\Temp\2\anonymous6647499736003505693webdriver-profile\extensions.json
     [java] *** Blocklist::_loadBlocklistFromFile: blocklist is disabled
     [java] 1451888864125	addons.manager	DEBUG	Starting provider: <unnamed-provider>
     [java] 1451888864125	addons.manager	DEBUG	Registering shutdown blocker for <unnamed-provider>
     [java] 1451888864126	addons.manager	DEBUG	Provider finished startup: <unnamed-provider>
     [java] 1451888864462	addons.xpi-utils	DEBUG	Async JSON file read took 0 MS
     [java] 1451888864462	addons.xpi-utils	DEBUG	Finished async read of XPI database, parsing...
     [java] 1451888864472	addons.xpi-utils	DEBUG	Successfully read XPI database
     [java] 1451888865038	addons.manager	DEBUG	Starting provider: PreviousExperimentProvider
     [java] 1451888865038	addons.manager	DEBUG	Registering shutdown blocker for PreviousExperimentProvider
     [java] 1451888865038	addons.manager	DEBUG	Provider finished startup: PreviousExperimentProvider
     [java] 
     [java] 	at org.openqa.selenium.firefox.internal.NewProfileExtensionConnection.start(NewProfileExtensionConnection.java:118)
     [java] 	at org.openqa.selenium.firefox.FirefoxDriver.startClient(FirefoxDriver.java:246)
     [java] 	at org.openqa.selenium.remote.RemoteWebDriver.<init>(RemoteWebDriver.java:114)
     [java] 	at org.openqa.selenium.firefox.FirefoxDriver.<init>(FirefoxDriver.java:193)
     [java] 	at org.openqa.selenium.firefox.FirefoxDriver.<init>(FirefoxDriver.java:186)
     [java] 	at org.openqa.selenium.firefox.FirefoxDriver.<init>(FirefoxDriver.java:182)
     [java] 	at org.openqa.selenium.firefox.FirefoxDriver.<init>(FirefoxDriver.java:95)
     [java] 	at marmotinni.MarmotinniRunner.main(Unknown Source)
     [java] Exception in thread "main" org.openqa.selenium.WebDriverException: Failed to connect
to binary FirefoxBinary(C:\Program Files (x86)\Mozilla Firefox\firefox.exe) on port 7055;
process output follows: 
     [java] ata\Local\Temp\2\anonymous6647499736003505693webdriver-profile\extensions\fxdriver@googlecode.com
     [java] 1451888863559	addons.xpi	DEBUG	Ignoring file entry whose name is not a valid add-on
ID: C:\Users\APACHE~1\AppData\Local\Temp\2\anonymous6647499736003505693webdriver-profile\extensions\webdriver-staging
     [java] 1451888863560	addons.xpi	INFO	SystemAddonInstallLocation directory is missing
     [java] 1451888863567	addons.xpi	INFO	Mapping {972ce4c6-7e08-4474-a285-3208198ce6fd} to
C:\Program Files (x86)\Mozilla Firefox\browser\extensions\{972ce4c6-7e08-4474-a285-3208198ce6fd}
     [java] 1451888863567	addons.xpi	DEBUG	Skipping unavailable install location app-system-share
     [java] 1451888863568	addons.xpi	DEBUG	Skipping unavailable install location app-system-local
     [java] 1451888863568	addons.xpi	DEBUG	checkForChanges
     [java] 1451888863569	addons.xpi	DEBUG	Loaded add-on state from prefs: {"app-profile":{"fxdriver@googlecode.com":{"d":"C:\\Users\\APACHE~1\\AppData\\Local\\Temp\\2\\anonymous6647499736003505693webdriver-profile\\extensions\\fxdriver@googlecode.com","e":false,"v":"2.45.0","st":1451888844694,"mt":1451888844626}},"app-global":{"{972ce4c6-7e08-4474-a285-3208198ce6fd}":{"d":"C:\\Program
Files (x86)\\Mozilla Firefox\\browser\\extensions\\{972ce4c6-7e08-4474-a285-3208198ce6fd}","e":true,"v":"43.0.1","st":1451367994962,"mt":1451367994781}}}
     [java] 1451888863570	addons.xpi	DEBUG	Existing add-on fxdriver@googlecode.com in app-profile
     [java] 1451888863577	addons.xpi	DEBUG	getModTime: Recursive scan of {972ce4c6-7e08-4474-a285-3208198ce6fd}
     [java] 1451888863578	addons.xpi	DEBUG	Existing add-on {972ce4c6-7e08-4474-a285-3208198ce6fd}
in app-global
     [java] 1451888863578	addons.xpi	DEBUG	getInstallState changed: false, state: {"app-profile":{"fxdriver@googlecode.com":{"d":"C:\\Users\\APACHE~1\\AppData\\Local\\Temp\\2\\anonymous6647499736003505693webdriver-profile\\extensions\\fxdriver@googlecode.com","e":false,"v":"2.45.0","st":1451888844694,"mt":1451888844626}},"app-global":{"{972ce4c6-7e08-4474-a285-3208198ce6fd}":{"d":"C:\\Program
Files (x86)\\Mozilla Firefox\\browser\\extensions\\{972ce4c6-7e08-4474-a285-3208198ce6fd}","e":true,"v":"43.0.1","st":1451367994962,"mt":1451367994781}}}
     [java] 1451888863580	addons.xpi	DEBUG	No changes found
     [java] 1451888863607	addons.manager	DEBUG	Registering shutdown blocker for XPIProvider
     [java] 1451888863608	addons.manager	DEBUG	Provider finished startup: XPIProvider
     [java] 1451888863608	addons.manager	DEBUG	Starting provider: LightweightThemeManager
     [java] 1451888863608	addons.manager	DEBUG	Registering shutdown blocker for LightweightThemeManager
     [java] 1451888863609	addons.manager	DEBUG	Provider finished startup: LightweightThemeManager
     [java] 1451888863610	addons.manager	DEBUG	Starting provider: GMPProvider
     [java] 1451888863630	addons.manager	DEBUG	Registering shutdown blocker for GMPProvider
     [java] 1451888863630	addons.manager	DEBUG	Provider finished startup: GMPProvider
     [java] 1451888863630	addons.manager	DEBUG	Starting provider: PluginProvider
     [java] 1451888863631	addons.manager	DEBUG	Registering shutdown blocker for PluginProvider
     [java] 1451888863637	addons.manager	DEBUG	Provider finished startup: PluginProvider
     [java] 1451888863637	addons.manager	DEBUG	Completed startup sequence
     [java] 1451888863798	addons.xpi-utils	DEBUG	Starting async load of XPI database C:\Users\APACHE~1\AppData\Local\Temp\2\anonymous6647499736003505693webdriver-profile\extensions.json
     [java] *** Blocklist::_loadBlocklistFromFile: blocklist is disabled
     [java] 1451888864125	addons.manager	DEBUG	Starting provider: <unnamed-provider>
     [java] 1451888864125	addons.manager	DEBUG	Registering shutdown blocker for <unnamed-provider>
     [java] 1451888864126	addons.manager	DEBUG	Provider finished startup: <unnamed-provider>
     [java] 1451888864462	addons.xpi-utils	DEBUG	Async JSON file read took 0 MS
     [java] 1451888864462	addons.xpi-utils	DEBUG	Finished async read of XPI database, parsing...
     [java] 1451888864472	addons.xpi-utils	DEBUG	Successfully read XPI database
     [java] 1451888865038	addons.manager	DEBUG	Starting provider: PreviousExperimentProvider
     [java] 1451888865038	addons.manager	DEBUG	Registering shutdown blocker for PreviousExperimentProvider
     [java] 1451888865038	addons.manager	DEBUG	Provider finished startup: PreviousExperimentProvider
     [java] 
     [java] Build info: version: '2.45.0', revision: '32a636c', time: '2015-03-05 22:01:35'
     [java] System info: host: 'apacheflexbuild', ip: '100.68.242.38', os.name: 'Windows Server
2008 R2', os.arch: 'amd64', os.version: '6.1', java.version: '1.7.0_55'
     [java] Driver info: driver.version: FirefoxDriver
     [java] 	at org.openqa.selenium.firefox.internal.NewProfileExtensionConnection.start(NewProfileExtensionConnection.java:130)
     [java] 	at org.openqa.selenium.firefox.FirefoxDriver.startClient(FirefoxDriver.java:246)
     [java] 	at org.openqa.selenium.remote.RemoteWebDriver.<init>(RemoteWebDriver.java:114)
     [java] 	at org.openqa.selenium.firefox.FirefoxDriver.<init>(FirefoxDriver.java:193)
     [java] 	at org.openqa.selenium.firefox.FirefoxDriver.<init>(FirefoxDriver.java:186)
     [java] 	at org.openqa.selenium.firefox.FirefoxDriver.<init>(FirefoxDriver.java:182)
     [java] 	at org.openqa.selenium.firefox.FirefoxDriver.<init>(FirefoxDriver.java:95)
     [java] 	at marmotinni.MarmotinniRunner.main(Unknown Source)
     [java] Caused by: org.openqa.selenium.firefox.NotConnectedException: Unable to connect
to host 127.0.0.1 on port 7055 after 45000 ms. Firefox console output:
     [java] ata\Local\Temp\2\anonymous6647499736003505693webdriver-profile\extensions\fxdriver@googlecode.com
     [java] 1451888863559	addons.xpi	DEBUG	Ignoring file entry whose name is not a valid add-on
ID: C:\Users\APACHE~1\AppData\Local\Temp\2\anonymous6647499736003505693webdriver-profile\extensions\webdriver-staging
     [java] 1451888863560	addons.xpi	INFO	SystemAddonInstallLocation directory is missing
     [java] 1451888863567	addons.xpi	INFO	Mapping {972ce4c6-7e08-4474-a285-3208198ce6fd} to
C:\Program Files (x86)\Mozilla Firefox\browser\extensions\{972ce4c6-7e08-4474-a285-3208198ce6fd}
     [java] 1451888863567	addons.xpi	DEBUG	Skipping unavailable install location app-system-share
     [java] 1451888863568	addons.xpi	DEBUG	Skipping unavailable install location app-system-local
     [java] 1451888863568	addons.xpi	DEBUG	checkForChanges
     [java] 1451888863569	addons.xpi	DEBUG	Loaded add-on state from prefs: {"app-profile":{"fxdriver@googlecode.com":{"d":"C:\\Users\\APACHE~1\\AppData\\Local\\Temp\\2\\anonymous6647499736003505693webdriver-profile\\extensions\\fxdriver@googlecode.com","e":false,"v":"2.45.0","st":1451888844694,"mt":1451888844626}},"app-global":{"{972ce4c6-7e08-4474-a285-3208198ce6fd}":{"d":"C:\\Program
Files (x86)\\Mozilla Firefox\\browser\\extensions\\{972ce4c6-7e08-4474-a285-3208198ce6fd}","e":true,"v":"43.0.1","st":1451367994962,"mt":1451367994781}}}
     [java] 1451888863570	addons.xpi	DEBUG	Existing add-on fxdriver@googlecode.com in app-profile
     [java] 1451888863577	addons.xpi	DEBUG	getModTime: Recursive scan of {972ce4c6-7e08-4474-a285-3208198ce6fd}
     [java] 1451888863578	addons.xpi	DEBUG	Existing add-on {972ce4c6-7e08-4474-a285-3208198ce6fd}
in app-global
     [java] 1451888863578	addons.xpi	DEBUG	getInstallState changed: false, state: {"app-profile":{"fxdriver@googlecode.com":{"d":"C:\\Users\\APACHE~1\\AppData\\Local\\Temp\\2\\anonymous6647499736003505693webdriver-profile\\extensions\\fxdriver@googlecode.com","e":false,"v":"2.45.0","st":1451888844694,"mt":1451888844626}},"app-global":{"{972ce4c6-7e08-4474-a285-3208198ce6fd}":{"d":"C:\\Program
Files (x86)\\Mozilla Firefox\\browser\\extensions\\{972ce4c6-7e08-4474-a285-3208198ce6fd}","e":true,"v":"43.0.1","st":1451367994962,"mt":1451367994781}}}
     [java] 1451888863580	addons.xpi	DEBUG	No changes found
     [java] 1451888863607	addons.manager	DEBUG	Registering shutdown blocker for XPIProvider
     [java] 1451888863608	addons.manager	DEBUG	Provider finished startup: XPIProvider
     [java] 1451888863608	addons.manager	DEBUG	Starting provider: LightweightThemeManager
     [java] 1451888863608	addons.manager	DEBUG	Registering shutdown blocker for LightweightThemeManager
     [java] 1451888863609	addons.manager	DEBUG	Provider finished startup: LightweightThemeManager
     [java] 1451888863610	addons.manager	DEBUG	Starting provider: GMPProvider
     [java] 1451888863630	addons.manager	DEBUG	Registering shutdown blocker for GMPProvider
     [java] 1451888863630	addons.manager	DEBUG	Provider finished startup: GMPProvider
     [java] 1451888863630	addons.manager	DEBUG	Starting provider: PluginProvider
     [java] 1451888863631	addons.manager	DEBUG	Registering shutdown blocker for PluginProvider
     [java] 1451888863637	addons.manager	DEBUG	Provider finished startup: PluginProvider
     [java] 1451888863637	addons.manager	DEBUG	Completed startup sequence
     [java] 1451888863798	addons.xpi-utils	DEBUG	Starting async load of XPI database C:\Users\APACHE~1\AppData\Local\Temp\2\anonymous6647499736003505693webdriver-profile\extensions.json
     [java] *** Blocklist::_loadBlocklistFromFile: blocklist is disabled
     [java] 1451888864125	addons.manager	DEBUG	Starting provider: <unnamed-provider>
     [java] 1451888864125	addons.manager	DEBUG	Registering shutdown blocker for <unnamed-provider>
     [java] 1451888864126	addons.manager	DEBUG	Provider finished startup: <unnamed-provider>
     [java] 1451888864462	addons.xpi-utils	DEBUG	Async JSON file read took 0 MS
     [java] 1451888864462	addons.xpi-utils	DEBUG	Finished async read of XPI database, parsing...
     [java] 1451888864472	addons.xpi-utils	DEBUG	Successfully read XPI database
     [java] 1451888865038	addons.manager	DEBUG	Starting provider: PreviousExperimentProvider
     [java] 1451888865038	addons.manager	DEBUG	Registering shutdown blocker for PreviousExperimentProvider
     [java] 1451888865038	addons.manager	DEBUG	Provider finished startup: PreviousExperimentProvider
     [java] 
     [java] 	at org.openqa.selenium.firefox.internal.NewProfileExtensionConnection.start(NewProfileExtensionConnection.java:118)
     [java] 	... 7 more
     [java] Picked up JAVA_TOOL_OPTIONS: -Dfile.encoding=UTF8

BUILD FAILED
<http://apacheflexbuild.cloudapp.net:8080/job/flex-asjs/ws/build.xml>:1051: Java returned:
1

Total time: 26 minutes 28 seconds
Picked up JAVA_TOOL_OPTIONS: -Dfile.encoding=UTF8
Build step 'Invoke Ant' marked build as failure
Skipped archiving because build is not successful

Mime
View raw message