flex-commits mailing list archives

Site index · List index
Message view « Date » · « Thread »
Top « Date » · « Thread »
From flex.ci.bui...@gmail.com
Subject Build failed in Jenkins: flex-flexunit #515
Date Tue, 29 Dec 2015 15:53:07 GMT
See <http://apacheflexbuild.cloudapp.net:8080/job/flex-flexunit/515/>

------------------------------------------
Started by user Alex Harui
Building remotely on flex_sdk_slave2 in workspace <http://apacheflexbuild.cloudapp.net:8080/job/flex-flexunit/ws/>
 > C:\Program Files (x86)\Git\cmd\git.exe rev-parse --is-inside-work-tree # timeout=10
Fetching changes from the remote Git repository
 > C:\Program Files (x86)\Git\cmd\git.exe config remote.origin.url https://git-wip-us.apache.org/repos/asf/flex-flexunit.git
# timeout=10
Fetching upstream changes from https://git-wip-us.apache.org/repos/asf/flex-flexunit.git
 > C:\Program Files (x86)\Git\cmd\git.exe --version # timeout=10
 > C:\Program Files (x86)\Git\cmd\git.exe fetch --tags --progress https://git-wip-us.apache.org/repos/asf/flex-flexunit.git
+refs/heads/*:refs/remotes/origin/*
 > C:\Program Files (x86)\Git\cmd\git.exe rev-parse "origin/develop^{commit}" # timeout=10
Checking out Revision 3b946dd86e1f53e0a6aea8dbb616398ec4b03c44 (origin/develop)
 > C:\Program Files (x86)\Git\cmd\git.exe config core.sparsecheckout # timeout=10
 > C:\Program Files (x86)\Git\cmd\git.exe checkout -f 3b946dd86e1f53e0a6aea8dbb616398ec4b03c44
 > C:\Program Files (x86)\Git\cmd\git.exe rev-list 3b946dd86e1f53e0a6aea8dbb616398ec4b03c44
# timeout=10
[flex-flexunit] $ cmd.exe /C '"c:\Jenkins\tools\hudson.tasks.Ant_AntInstallation\c_apache-ant-1.9.3\bin\ant.bat
-file jenkins.xml clean main && exit %%ERRORLEVEL%%"'
Buildfile: <http://apacheflexbuild.cloudapp.net:8080/job/flex-flexunit/ws/jenkins.xml>

clean:
   [delete] Deleting directory <http://apacheflexbuild.cloudapp.net:8080/job/flex-flexunit/ws/jenkins/temp>
   [delete] Deleting directory <http://apacheflexbuild.cloudapp.net:8080/job/flex-flexunit/ws/jenkins/player>
   [delete] Deleting directory <http://apacheflexbuild.cloudapp.net:8080/job/flex-flexunit/ws/jenkins>

init:
    [mkdir] Created dir: <http://apacheflexbuild.cloudapp.net:8080/job/flex-flexunit/ws/jenkins>
    [mkdir] Created dir: <http://apacheflexbuild.cloudapp.net:8080/job/flex-flexunit/ws/jenkins/temp>

playerglobal-check:

playerglobal-settarget:

playerglobal10.1-download:

playerglobal11.1-download:
    [mkdir] Created dir: <http://apacheflexbuild.cloudapp.net:8080/job/flex-flexunit/ws/jenkins/player/11.1>
      [get] Getting: http://download.macromedia.com/pub/flashplayer/updaters/11/playerglobal11_1.swc
      [get] To: <http://apacheflexbuild.cloudapp.net:8080/job/flex-flexunit/ws/jenkins/player/11.1/playerglobal.swc>
      [get] http://download.macromedia.com/pub/flashplayer/updaters/11/playerglobal11_1.swc
moved to http://fpdownload.macromedia.com/pub/flashplayer/updaters/11/playerglobal11_1.swc

playerglobal-download:

thirdparty-downloads:

main:

BUILD SUCCESSFUL
Total time: 2 minutes 51 seconds
Picked up JAVA_TOOL_OPTIONS: -Dfile.encoding=UTF8
[flex-flexunit] $ cmd /c call C:\Users\APACHE~1\AppData\Local\Temp\2\hudson3314091089835661370.bat

<http://apacheflexbuild.cloudapp.net:8080/job/flex-flexunit/ws/>mkdir> jenkins\temp\flex-sdk


<http://apacheflexbuild.cloudapp.net:8080/job/flex-flexunit/ws/>cd> <http://apacheflexbuild.cloudapp.net:8080/job/flex-flexunit/ws/../flex-sdk-release/ide/flashbuilder/>


c:\Jenkins\workspace\flex-sdk-release\ide\flashbuilder>makeApacheFlexForIDE.bat <http://apacheflexbuild.cloudapp.net:8080/job/flex-flexunit/ws/jenkins/temp/flex-sdk>
-Dbuild.noprompt=true 
Copying the Apache Flex SDK from ..\.. to "<http://apacheflexbuild.cloudapp.net:8080/job/flex-flexunit/ws/jenkins/temp/flex-sdk">
64725 File(s) copied
Missing value for property build.noprompt
Picked up JAVA_TOOL_OPTIONS: -Dfile.encoding=UTF8
Downloading and unzipping Adobe AIR Runtime Kit for Windows from "http://airdownload.adobe.com/air/win/download/15.0/AdobeAIRSDK.zip"
to "<http://apacheflexbuild.cloudapp.net:8080/job/flex-flexunit/ws/jenkins/temp/flex-sdk">
Downloading Adobe Flash Player playerglobal.swc from "http://fpdownload.macromedia.com/get/flashplayer/updaters/11/playerglobal11_1.swc"
to "<http://apacheflexbuild.cloudapp.net:8080/job/flex-flexunit/ws/jenkins/temp/flex-sdk/frameworks/libs/player/11.1/playerglobal.swc">
Downloading Adobe Flash Player playerglobal.swc from "http://fpdownload.macromedia.com/get/flashplayer/updaters/11/playerglobal15_0.swc"
to "<http://apacheflexbuild.cloudapp.net:8080/job/flex-flexunit/ws/jenkins/temp/flex-sdk/frameworks/libs/player/15.0/playerglobal.swc">
Installing frameworks config files configured for use with Adobe Flash Builder
<http://apacheflexbuild.cloudapp.net:8080/job/flex-flexunit/ws/jenkins/temp/flex-sdk/ide/flashbuilder/config/air-config.xml>
<http://apacheflexbuild.cloudapp.net:8080/job/flex-flexunit/ws/jenkins/temp/flex-sdk/ide/flashbuilder/config/airmobile-config.xml>
<http://apacheflexbuild.cloudapp.net:8080/job/flex-flexunit/ws/jenkins/temp/flex-sdk/ide/flashbuilder/config/flex-config.xml>
        3 file(s) copied.
[flex-flexunit] $ cmd.exe /C '"c:\Jenkins\tools\hudson.tasks.Ant_AntInstallation\c_apache-ant-1.9.3\bin\ant.bat
-file build.xml -Dbuild.noprompt=true thirdparty-downloads package clean_as3 && exit
%%ERRORLEVEL%%"'
Buildfile: <http://apacheflexbuild.cloudapp.net:8080/job/flex-flexunit/ws/build.xml>

thirdparty-downloads:

prepare:

maven-ant-tasks-jar-check:

maven-ant-tasks-jar:

ant-contrib-check:

ant-contrib-jar:

main:
  [typedef] Could not load definitions from resource org/apache/maven/artifact/ant/antlib.xml.
It could not be found.
  [taskdef] Could not load definitions from resource net/sf/antcontrib/antcontrib.properties.
It could not be found.

thirdparty-downloads:

prepare:

junit-jar-check:

junit-jar:

ant-jar-check:

ant-jar:

ant-launcher-jar-check:

ant-launcher-jar:

ant-testutil-jar-check:

ant-testutil-jar:

dom4j-jar-check:

dom4j-jar:

jaxen-jar-check:

jaxen-jar:

main:
  [typedef] Could not load definitions from resource org/apache/maven/artifact/ant/antlib.xml.
It could not be found.
  [taskdef] Could not load definitions from resource net/sf/antcontrib/antcontrib.properties.
It could not be found.

thirdparty-downloads:

prepare:

flexunit1lib-swc-check:

flexunit1lib-swc:

hamcrest-swc-check:

hamcrest-swc:

main:
  [typedef] Could not load definitions from resource org/apache/maven/artifact/ant/antlib.xml.
It could not be found.
  [taskdef] Could not load definitions from resource net/sf/antcontrib/antcontrib.properties.
It could not be found.

thirdparty-downloads:

prepare:

fluint-swc-check:

fluint-swc:

main:

thirdparty-downloads:

prepare:

flexunit1lib-swc-check:

flexunit1lib-swc:

hamcrest-swc-check:

hamcrest-swc:

fluint-swc-check:

fluint-swc:

mockolate-swc-check:

mockolate-swc:
     [echo] Obtaining lib/mockolate-0.9.5.swc

download-zip:

copy-exists:

copy-before-get:
      [get] Getting: https://github.com/downloads/drewbourne/mockolate/mockolate-0.9.5.zip
      [get] To: <http://apacheflexbuild.cloudapp.net:8080/job/flex-flexunit/ws/FlexUnit4Test/in/mockolate-0.9.5.zip>
      [get] https://github.com/downloads/drewbourne/mockolate/mockolate-0.9.5.zip moved to
https://cloud.github.com/downloads/drewbourne/mockolate/mockolate-0.9.5.zip
      [get] Error getting https://github.com/downloads/drewbourne/mockolate/mockolate-0.9.5.zip
to <http://apacheflexbuild.cloudapp.net:8080/job/flex-flexunit/ws/FlexUnit4Test/in/mockolate-0.9.5.zip>

BUILD FAILED
<http://apacheflexbuild.cloudapp.net:8080/job/flex-flexunit/ws/build.xml>:115: The following
error occurred while executing this line:
<http://apacheflexbuild.cloudapp.net:8080/job/flex-flexunit/ws/FlexUnit4Test/build.xml>:189:
The following error occurred while executing this line:
<http://apacheflexbuild.cloudapp.net:8080/job/flex-flexunit/ws/FlexUnit4Test/downloads.xml>:277:
The following error occurred while executing this line:
<http://apacheflexbuild.cloudapp.net:8080/job/flex-flexunit/ws/FlexUnit4Test/downloads.xml>:114:
javax.net.ssl.SSLHandshakeException: Received fatal alert: handshake_failure
	at sun.security.ssl.Alerts.getSSLException(Alerts.java:192)
	at sun.security.ssl.Alerts.getSSLException(Alerts.java:154)
	at sun.security.ssl.SSLSocketImpl.recvAlert(SSLSocketImpl.java:1959)
	at sun.security.ssl.SSLSocketImpl.readRecord(SSLSocketImpl.java:1077)
	at sun.security.ssl.SSLSocketImpl.performInitialHandshake(SSLSocketImpl.java:1312)
	at sun.security.ssl.SSLSocketImpl.startHandshake(SSLSocketImpl.java:1339)
	at sun.security.ssl.SSLSocketImpl.startHandshake(SSLSocketImpl.java:1323)
	at sun.net.www.protocol.https.HttpsClient.afterConnect(HttpsClient.java:563)
	at sun.net.www.protocol.https.AbstractDelegateHttpsURLConnection.connect(AbstractDelegateHttpsURLConnection.java:185)
	at sun.net.www.protocol.https.HttpsURLConnectionImpl.connect(HttpsURLConnectionImpl.java:153)
	at org.apache.tools.ant.taskdefs.Get$GetThread.openConnection(Get.java:690)
	at org.apache.tools.ant.taskdefs.Get$GetThread.openConnection(Get.java:715)
	at org.apache.tools.ant.taskdefs.Get$GetThread.get(Get.java:606)
	at org.apache.tools.ant.taskdefs.Get$GetThread.run(Get.java:596)

Total time: 13 seconds
Picked up JAVA_TOOL_OPTIONS: -Dfile.encoding=UTF8
Build step 'Invoke Ant' marked build as failure
Archiving artifacts
Recording test results
ERROR: Publisher hudson.tasks.junit.JUnitResultArchiver aborted due to exception
hudson.AbortException: No test report files were found. Configuration error?
	at hudson.tasks.junit.JUnitParser$ParseResultCallable.invoke(JUnitParser.java:116)
	at hudson.tasks.junit.JUnitParser$ParseResultCallable.invoke(JUnitParser.java:93)
	at hudson.FilePath$FileCallableWrapper.call(FilePath.java:2677)
	at hudson.remoting.UserRequest.perform(UserRequest.java:121)
	at hudson.remoting.UserRequest.perform(UserRequest.java:49)
	at hudson.remoting.Request$2.run(Request.java:324)
	at hudson.remoting.InterceptingExecutorService$1.call(InterceptingExecutorService.java:68)
	at java.util.concurrent.FutureTask.run(Unknown Source)
	at java.util.concurrent.ThreadPoolExecutor.runWorker(Unknown Source)
	at java.util.concurrent.ThreadPoolExecutor$Worker.run(Unknown Source)
	at hudson.remoting.Engine$1$1.run(Engine.java:63)
	at java.lang.Thread.run(Unknown Source)
	at ......remote call to flex_sdk_slave2(Native Method)
	at hudson.remoting.Channel.attachCallSiteStackTrace(Channel.java:1356)
	at hudson.remoting.UserResponse.retrieve(UserRequest.java:221)
	at hudson.remoting.Channel.call(Channel.java:752)
	at hudson.FilePath.act(FilePath.java:970)
	at hudson.FilePath.act(FilePath.java:959)
	at hudson.tasks.junit.JUnitParser.parseResult(JUnitParser.java:90)
	at hudson.tasks.junit.JUnitResultArchiver.parse(JUnitResultArchiver.java:120)
	at hudson.tasks.junit.JUnitResultArchiver.perform(JUnitResultArchiver.java:137)
	at hudson.tasks.BuildStepCompatibilityLayer.perform(BuildStepCompatibilityLayer.java:74)
	at hudson.tasks.BuildStepMonitor$1.perform(BuildStepMonitor.java:20)
	at hudson.model.AbstractBuild$AbstractBuildExecution.perform(AbstractBuild.java:770)
	at hudson.model.AbstractBuild$AbstractBuildExecution.performAllBuildSteps(AbstractBuild.java:734)
	at hudson.model.Build$BuildExecution.post2(Build.java:183)
	at hudson.model.AbstractBuild$AbstractBuildExecution.post(AbstractBuild.java:683)
	at hudson.model.Run.execute(Run.java:1784)
	at hudson.model.FreeStyleBuild.run(FreeStyleBuild.java:43)
	at hudson.model.ResourceController.execute(ResourceController.java:89)
	at hudson.model.Executor.run(Executor.java:240)

Mime
View raw message