flex-commits mailing list archives

Site index · List index
Message view « Date » · « Thread »
Top « Date » · « Thread »
From flex.ci.bui...@gmail.com
Subject Build failed in Jenkins: flex-blazeds #479
Date Sun, 20 Dec 2015 14:05:59 GMT
See <http://apacheflexbuild.cloudapp.net:8080/job/flex-blazeds/479/changes>

Changes:

[jmclean] removed @author tag

[jmclean] fixed some funny characters in comments

[christofer.dutz] FLEX-34849 - adding flex-messaging-core as a maven dependency gives a wrong
dependency

[christofer.dutz] FLEX-34708 - Dependency on tomcat-catalina should be PROVIDED

[christofer.dutz] FLEX-34680 - BeanProxy.getBeanProperties caches and returns values with
incorrect Map

[christofer.dutz] Fix security issue due to local entity resolution issues in DocumentBuilder.

[christofer.dutz] Created a portable test for the xml parsing problem.

[christofer.dutz] FLEX-34921 - Fix streaming on tomcat-7.0.27 + version.

[christofer.dutz] Adding an "allow-xml-external-entity-expansion" property to the serialization
config.

[christofer.dutz] Re-Added the header for the 4.7.1 release

[christofer.dutz] Removed all "exclude" javadoc annotations

[christofer.dutz] Continued cleaning up the javadoc comments

[christofer.dutz] Continued cleaning up the javadoc comments

[christofer.dutz] Turned off the java-doc generation for now ... as there are far too many
places that need fixing.

[christofer.dutz] Reverted a version update.

[christofer.dutz] [maven-release-plugin] prepare release blazeds-4.7.1

[christofer.dutz] [maven-release-plugin] prepare for next development iteration

[Alex Harui] approval script

[Alex Harui] header

[Alex Harui] adjust rat filter

[Alex Harui] update notice files for 4.7.1

[christofer.dutz] [maven-release-plugin] prepare release blazeds-4.7.1

[christofer.dutz] [maven-release-plugin] rollback the release of blazeds-4.7.1

[christofer.dutz] [maven-release-plugin] prepare release blazeds-4.7.1

[christofer.dutz] [maven-release-plugin] prepare for next development iteration

[christofer.dutz] Added a config option to turn xml doctype declarations on in AMF Xml payload.
It is called: "allow-xml-doctype-declaration"

------------------------------------------
[...truncated 183 lines...]
[WARNING] Entry: blazeds-4.7.2-SNAPSHOT/proxy/src/flex/management/runtime/messaging/services/http/HTTPProxyAdapterControl.java
longer than 100 characters.
[WARNING] Entry: blazeds-4.7.2-SNAPSHOT/proxy/src/flex/management/runtime/messaging/services/http/HTTPProxyAdapterControlMBean.java
longer than 100 characters.
[WARNING] Entry: blazeds-4.7.2-SNAPSHOT/proxy/src/flex/management/runtime/messaging/services/http/HTTPProxyDestinationControl.java
longer than 100 characters.
[WARNING] Entry: blazeds-4.7.2-SNAPSHOT/proxy/src/flex/management/runtime/messaging/services/http/HTTPProxyDestinationControlMBean.java
longer than 100 characters.
[WARNING] Entry: blazeds-4.7.2-SNAPSHOT/proxy/src/flex/management/runtime/messaging/services/http/SOAPProxyAdapterControl.java
longer than 100 characters.
[WARNING] Entry: blazeds-4.7.2-SNAPSHOT/proxy/src/flex/management/runtime/messaging/services/http/SOAPProxyAdapterControlMBean.java
longer than 100 characters.
[WARNING] Entry: blazeds-4.7.2-SNAPSHOT/proxy/src/flex/management/runtime/messaging/services/HTTPProxyServiceControl.java
longer than 100 characters.
[WARNING] Entry: blazeds-4.7.2-SNAPSHOT/proxy/src/flex/management/runtime/messaging/services/HTTPProxyServiceControlMBean.java
longer than 100 characters.
[WARNING] Entry: blazeds-4.7.2-SNAPSHOT/proxy/src/flex/messaging/services/http/httpclient/EasySSLProtocolSocketFactory.java
longer than 100 characters.
[WARNING] Entry: blazeds-4.7.2-SNAPSHOT/remoting/src/flex/management/runtime/messaging/services/remoting/adapters/JavaAdapterControl.java
longer than 100 characters.
[WARNING] Entry: blazeds-4.7.2-SNAPSHOT/remoting/src/flex/management/runtime/messaging/services/remoting/adapters/JavaAdapterControlMBean.java
longer than 100 characters.
[WARNING] Entry: blazeds-4.7.2-SNAPSHOT/remoting/src/flex/management/runtime/messaging/services/remoting/adapters/package-info.java
longer than 100 characters.
[WARNING] Entry: blazeds-4.7.2-SNAPSHOT/remoting/src/flex/management/runtime/messaging/services/remoting/package-info.java
longer than 100 characters.
[WARNING] Entry: blazeds-4.7.2-SNAPSHOT/remoting/src/flex/management/runtime/messaging/services/remoting/RemotingDestinationControl.java
longer than 100 characters.
[WARNING] Entry: blazeds-4.7.2-SNAPSHOT/remoting/src/flex/management/runtime/messaging/services/remoting/RemotingDestinationControlMBean.java
longer than 100 characters.
[WARNING] Entry: blazeds-4.7.2-SNAPSHOT/remoting/src/flex/management/runtime/messaging/services/RemotingServiceControl.java
longer than 100 characters.
[WARNING] Entry: blazeds-4.7.2-SNAPSHOT/remoting/src/flex/management/runtime/messaging/services/RemotingServiceControlMBean.java
longer than 100 characters.
[WARNING] Entry: blazeds-4.7.2-SNAPSHOT/remoting/src/flex/messaging/services/remoting/adapters/NoSuchMethodException.java
longer than 100 characters.
[WARNING] Entry: blazeds-4.7.2-SNAPSHOT/remoting/src/flex/messaging/services/remoting/adapters/NoSuchServiceException.java
longer than 100 characters.
[WARNING] Entry: blazeds-4.7.2-SNAPSHOT/testsuite/src/test/java/flex/messaging/config/ChannelSettingsParseUriTest.java
longer than 100 characters.
[WARNING] Entry: blazeds-4.7.2-SNAPSHOT/testsuite/src/test/java/flex/messaging/config/services/1e_adapter_include.xml
longer than 100 characters.
[WARNING] Entry: blazeds-4.7.2-SNAPSHOT/testsuite/src/test/java/flex/messaging/config/services/1e_channel_include.xml
longer than 100 characters.
[WARNING] Entry: blazeds-4.7.2-SNAPSHOT/testsuite/src/test/java/flex/messaging/config/services/1e_constraint_include.xml
longer than 100 characters.
[WARNING] Entry: blazeds-4.7.2-SNAPSHOT/testsuite/src/test/java/flex/messaging/config/services/1e_destination_include.xml
longer than 100 characters.
[WARNING] Entry: blazeds-4.7.2-SNAPSHOT/testsuite/src/test/java/flex/messaging/config/services/1f_service_include.xml
longer than 100 characters.
[WARNING] Entry: blazeds-4.7.2-SNAPSHOT/testsuite/src/test/java/flex/messaging/config/services/adapters/1i_adapter_include.xml
longer than 100 characters.
[WARNING] Entry: blazeds-4.7.2-SNAPSHOT/testsuite/src/test/java/flex/messaging/config/services/channels/1i_channel_include.xml
longer than 100 characters.
[WARNING] Entry: blazeds-4.7.2-SNAPSHOT/testsuite/src/test/java/flex/messaging/config/services/constraints/1i_constraint_include.xml
longer than 100 characters.
[WARNING] Entry: blazeds-4.7.2-SNAPSHOT/testsuite/src/test/java/flex/messaging/config/services/destinations/1i_destination_include.xml
longer than 100 characters.
[WARNING] Entry: blazeds-4.7.2-SNAPSHOT/testsuite/src/test/java/flex/messaging/config/services/services/1i_service_include.xml
longer than 100 characters.
[WARNING] Entry: blazeds-4.7.2-SNAPSHOT/testsuite/src/test/java/flex/messaging/io/amf/translator/HashReferenceTableTest.java
longer than 100 characters.
[WARNING] Entry: blazeds-4.7.2-SNAPSHOT/testsuite/src/test/java/flex/messaging/io/amf/translator/StrictReferenceTableTest.java
longer than 100 characters.
[WARNING] Entry: blazeds-4.7.2-SNAPSHOT/testsuite/src/test/java/flex/messaging/io/amf/validators/AmfDeserializationValidatorTest.java
longer than 100 characters.
[WARNING] Entry: blazeds-4.7.2-SNAPSHOT/testsuite/src/test/java/flex/messaging/io/amfx/AllowDocumentTypeDeclaration.java
longer than 100 characters.
[WARNING] Entry: blazeds-4.7.2-SNAPSHOT/testsuite/src/test/java/flex/messaging/io/amfx/DeserializationConfirmation.java
longer than 100 characters.
[WARNING] Entry: blazeds-4.7.2-SNAPSHOT/testsuite/src/test/java/flex/messaging/securityadvisories/BlazeDsXmlProcessingXXEVulnerability.java
longer than 100 characters.
[WARNING] Entry: blazeds-4.7.2-SNAPSHOT/testsuite/src/test/java/flex/messaging/services/http/SettingsReplaceUtilTest.java
longer than 100 characters.
[WARNING] Entry: blazeds-4.7.2-SNAPSHOT/testsuite/src/test/java/flex/messaging/util/concurrent/DefaultThreadPoolExecutorTest.java
longer than 100 characters.
[INFO]                                                                         
[INFO] ------------------------------------------------------------------------
[INFO] Building flex-messaging-common 4.7.2-SNAPSHOT
[INFO] ------------------------------------------------------------------------
[INFO] 
[INFO] --- maven-clean-plugin:2.5:clean (default-clean) @ flex-messaging-common ---
[INFO] Deleting C:\Jenkins\workspace\flex-blazeds\modules\common\target
[INFO] 
[INFO] --- maven-remote-resources-plugin:1.5:process (default) @ flex-messaging-common ---
[INFO] 
[INFO] --- maven-resources-plugin:2.6:resources (default-resources) @ flex-messaging-common
---
[INFO] Using 'UTF-8' encoding to copy filtered resources.
[INFO] Copying 1 resource
[INFO] Copying 3 resources
[INFO] 
[INFO] --- maven-compiler-plugin:3.1:compile (default-compile) @ flex-messaging-common ---
[INFO] Changes detected - recompiling the module!
[INFO] Compiling 47 source files to C:\Jenkins\workspace\flex-blazeds\modules\common\target\classes
[WARNING] /C:/Jenkins/workspace/flex-blazeds/modules/common/src/flex/messaging/config/ClientConfiguration.java:
Some input files use unchecked or unsafe operations.
[WARNING] /C:/Jenkins/workspace/flex-blazeds/modules/common/src/flex/messaging/config/ClientConfiguration.java:
Recompile with -Xlint:unchecked for details.
[INFO] 
[INFO] --- maven-resources-plugin:2.6:testResources (default-testResources) @ flex-messaging-common
---
[INFO] Using 'UTF-8' encoding to copy filtered resources.
[INFO] skip non existing resourceDirectory C:\Jenkins\workspace\flex-blazeds\modules\common\src\test\resources
[INFO] Copying 3 resources
[INFO] 
[INFO] --- maven-compiler-plugin:3.1:testCompile (default-testCompile) @ flex-messaging-common
---
[INFO] No sources to compile
[INFO] 
[INFO] --- maven-surefire-plugin:2.17:test (default-test) @ flex-messaging-common ---
[JENKINS] Recording test results
[INFO] 
[INFO] --- maven-jar-plugin:2.5:jar (default-jar) @ flex-messaging-common ---
[INFO] Building jar: C:\Jenkins\workspace\flex-blazeds\modules\common\target\flex-messaging-common.jar
[INFO] 
[INFO] --- maven-site-plugin:3.4:attach-descriptor (attach-descriptor) @ flex-messaging-common
---
[INFO] 
[INFO] --- maven-assembly-plugin:2.5.1:single (assemble-sources-releases) @ flex-messaging-common
---
[INFO] Reading assembly descriptor: src/assembly/assemble-zip.xml
[INFO] Reading assembly descriptor: src/assembly/assemble-gz.xml
[WARNING] The assembly id source-release is used more than once.
[INFO] Building zip: C:\Jenkins\workspace\flex-blazeds\modules\common\target\flex-messaging-common-source-release.zip
[INFO] Building tar: C:\Jenkins\workspace\flex-blazeds\modules\common\target\flex-messaging-common-source-release.tar.gz
[INFO]                                                                         
[INFO] ------------------------------------------------------------------------
[INFO] Building flex-messaging-core 4.7.2-SNAPSHOT
[INFO] ------------------------------------------------------------------------
[INFO] 
[INFO] --- maven-clean-plugin:2.5:clean (default-clean) @ flex-messaging-core ---
[INFO] Deleting C:\Jenkins\workspace\flex-blazeds\modules\core\target
[INFO] 
[INFO] --- javacc-maven-plugin:2.5:javacc (javacc) @ flex-messaging-core ---
[INFO] Skipping - all parsers are up to date
[INFO] 
[INFO] --- maven-remote-resources-plugin:1.5:process (default) @ flex-messaging-core ---
[INFO] 
[INFO] --- maven-resources-plugin:2.6:resources (default-resources) @ flex-messaging-core
---
[INFO] Using 'UTF-8' encoding to copy filtered resources.
[INFO] skip non existing resourceDirectory C:\Jenkins\workspace\flex-blazeds\modules\core\src\main\resources
[INFO] Copying 3 resources
[INFO] 
[INFO] --- maven-compiler-plugin:3.1:compile (default-compile) @ flex-messaging-core ---
[INFO] Changes detected - recompiling the module!
[INFO] Compiling 365 source files to C:\Jenkins\workspace\flex-blazeds\modules\core\target\classes
[INFO] -------------------------------------------------------------
[WARNING] COMPILATION WARNING : 
[INFO] -------------------------------------------------------------
[WARNING] /C:/Jenkins/workspace/flex-blazeds/modules/core/src/flex/messaging/HttpFlexSession.java:
Some input files use or override a deprecated API.
[WARNING] /C:/Jenkins/workspace/flex-blazeds/modules/core/src/flex/messaging/HttpFlexSession.java:
Recompile with -Xlint:deprecation for details.
[WARNING] /C:/Jenkins/workspace/flex-blazeds/modules/core/src/flex/messaging/MessageClient.java:
Some input files use unchecked or unsafe operations.
[WARNING] /C:/Jenkins/workspace/flex-blazeds/modules/core/src/flex/messaging/MessageClient.java:
Recompile with -Xlint:unchecked for details.
[INFO] 4 warnings 
[INFO] -------------------------------------------------------------
[INFO] -------------------------------------------------------------
[ERROR] COMPILATION ERROR : 
[INFO] -------------------------------------------------------------
[ERROR] /C:/Jenkins/workspace/flex-blazeds/modules/core/src/ExcludeDoclet.java:[1,1] package
com.sun.javadoc does not exist
[ERROR] /C:/Jenkins/workspace/flex-blazeds/modules/core/src/ExcludeDoclet.java:[2,38] package
com.sun.tools.doclets.standard does not exist
[ERROR] /C:/Jenkins/workspace/flex-blazeds/modules/core/src/ExcludeDoclet.java:[3,29] package
com.sun.tools.javadoc does not exist
[ERROR] /C:/Jenkins/workspace/flex-blazeds/modules/core/src/ExcludeDoclet.java:[16,60] cannot
find symbol
  symbol:   class DocErrorReporter
  location: class ExcludeDoclet
[ERROR] /C:/Jenkins/workspace/flex-blazeds/modules/core/src/ExcludeDoclet.java:[27,33] cannot
find symbol
  symbol:   class RootDoc
  location: class ExcludeDoclet
[ERROR] /C:/Jenkins/workspace/flex-blazeds/modules/core/src/ExcludeDoclet.java:[33,36] cannot
find symbol
  symbol:   class Doc
  location: class ExcludeDoclet
[ERROR] /C:/Jenkins/workspace/flex-blazeds/modules/core/src/ExcludeDoclet.java:[13,9] cannot
find symbol
  symbol:   variable Main
  location: class ExcludeDoclet
[ERROR] /C:/Jenkins/workspace/flex-blazeds/modules/core/src/ExcludeDoclet.java:[19,16] cannot
find symbol
  symbol:   variable Standard
  location: class ExcludeDoclet
[ERROR] /C:/Jenkins/workspace/flex-blazeds/modules/core/src/ExcludeDoclet.java:[24,16] cannot
find symbol
  symbol:   variable Standard
  location: class ExcludeDoclet
[ERROR] /C:/Jenkins/workspace/flex-blazeds/modules/core/src/ExcludeDoclet.java:[30,32] cannot
find symbol
  symbol:   class RootDoc
  location: class ExcludeDoclet
[ERROR] /C:/Jenkins/workspace/flex-blazeds/modules/core/src/ExcludeDoclet.java:[30,54] cannot
find symbol
  symbol:   class RootDoc
  location: class ExcludeDoclet
[ERROR] /C:/Jenkins/workspace/flex-blazeds/modules/core/src/ExcludeDoclet.java:[30,16] cannot
find symbol
  symbol:   variable Standard
  location: class ExcludeDoclet
[ERROR] /C:/Jenkins/workspace/flex-blazeds/modules/core/src/ExcludeDoclet.java:[35,28] cannot
find symbol
  symbol:   class ProgramElementDoc
  location: class ExcludeDoclet
[ERROR] /C:/Jenkins/workspace/flex-blazeds/modules/core/src/ExcludeDoclet.java:[36,19] cannot
find symbol
  symbol:   class ProgramElementDoc
  location: class ExcludeDoclet
[ERROR] /C:/Jenkins/workspace/flex-blazeds/modules/core/src/ExcludeDoclet.java:[57,39] cannot
find symbol
  symbol:   class Doc
  location: class ExcludeDoclet
[ERROR] /C:/Jenkins/workspace/flex-blazeds/modules/core/src/ExcludeDoclet.java:[57,56] cannot
find symbol
  symbol:   class Doc
  location: class ExcludeDoclet
[INFO] 16 errors 
[INFO] -------------------------------------------------------------
[INFO] ------------------------------------------------------------------------
[INFO] Reactor Summary:
[INFO] 
[INFO] Apache Flex: BlazeDS .............................. SUCCESS [01:02 min]
[INFO] flex-messaging-common ............................. SUCCESS [ 16.783 s]
[INFO] flex-messaging-core ............................... FAILURE [ 26.397 s]
[INFO] flex-messaging-proxy .............................. SKIPPED
[INFO] flex-messaging-remoting ........................... SKIPPED
[INFO] flex-messaging-opt ................................ SKIPPED
[INFO] flex-messaging-opt-tomcat7 ........................ SKIPPED
[INFO] flex-messaging-opt-tomcat6 ........................ SKIPPED
[INFO] flex-messaging-opt-tomcat4 ........................ SKIPPED
[INFO] flex-messaging-testsuite .......................... SKIPPED
[INFO] ------------------------------------------------------------------------
[INFO] BUILD FAILURE
[INFO] ------------------------------------------------------------------------
[INFO] Total time: 01:55 min
[INFO] Finished at: 2015-12-20T14:04:14+00:00
[INFO] Final Memory: 27M/102M
[INFO] ------------------------------------------------------------------------
[ERROR] Failed to execute goal org.apache.maven.plugins:maven-compiler-plugin:3.1:compile
(default-compile) on project flex-messaging-core: Compilation failure: Compilation failure:
[ERROR] /C:/Jenkins/workspace/flex-blazeds/modules/core/src/ExcludeDoclet.java:[1,1] package
com.sun.javadoc does not exist
[ERROR] /C:/Jenkins/workspace/flex-blazeds/modules/core/src/ExcludeDoclet.java:[2,38] package
com.sun.tools.doclets.standard does not exist
[ERROR] /C:/Jenkins/workspace/flex-blazeds/modules/core/src/ExcludeDoclet.java:[3,29] package
com.sun.tools.javadoc does not exist
[ERROR] /C:/Jenkins/workspace/flex-blazeds/modules/core/src/ExcludeDoclet.java:[16,60] cannot
find symbol
[ERROR] symbol:   class DocErrorReporter
[ERROR] location: class ExcludeDoclet
[ERROR] /C:/Jenkins/workspace/flex-blazeds/modules/core/src/ExcludeDoclet.java:[27,33] cannot
find symbol
[ERROR] symbol:   class RootDoc
[ERROR] location: class ExcludeDoclet
[ERROR] /C:/Jenkins/workspace/flex-blazeds/modules/core/src/ExcludeDoclet.java:[33,36] cannot
find symbol
[ERROR] symbol:   class Doc
[ERROR] location: class ExcludeDoclet
[ERROR] /C:/Jenkins/workspace/flex-blazeds/modules/core/src/ExcludeDoclet.java:[13,9] cannot
find symbol
[ERROR] symbol:   variable Main
[ERROR] location: class ExcludeDoclet
[ERROR] /C:/Jenkins/workspace/flex-blazeds/modules/core/src/ExcludeDoclet.java:[19,16] cannot
find symbol
[ERROR] symbol:   variable Standard
[ERROR] location: class ExcludeDoclet
[ERROR] /C:/Jenkins/workspace/flex-blazeds/modules/core/src/ExcludeDoclet.java:[24,16] cannot
find symbol
[ERROR] symbol:   variable Standard
[ERROR] location: class ExcludeDoclet
[ERROR] /C:/Jenkins/workspace/flex-blazeds/modules/core/src/ExcludeDoclet.java:[30,32] cannot
find symbol
[ERROR] symbol:   class RootDoc
[ERROR] location: class ExcludeDoclet
[ERROR] /C:/Jenkins/workspace/flex-blazeds/modules/core/src/ExcludeDoclet.java:[30,54] cannot
find symbol
[ERROR] symbol:   class RootDoc
[ERROR] location: class ExcludeDoclet
[ERROR] /C:/Jenkins/workspace/flex-blazeds/modules/core/src/ExcludeDoclet.java:[30,16] cannot
find symbol
[ERROR] symbol:   variable Standard
[ERROR] location: class ExcludeDoclet
[ERROR] /C:/Jenkins/workspace/flex-blazeds/modules/core/src/ExcludeDoclet.java:[35,28] cannot
find symbol
[ERROR] symbol:   class ProgramElementDoc
[ERROR] location: class ExcludeDoclet
[ERROR] /C:/Jenkins/workspace/flex-blazeds/modules/core/src/ExcludeDoclet.java:[36,19] cannot
find symbol
[ERROR] symbol:   class ProgramElementDoc
[ERROR] location: class ExcludeDoclet
[ERROR] /C:/Jenkins/workspace/flex-blazeds/modules/core/src/ExcludeDoclet.java:[57,39] cannot
find symbol
[ERROR] symbol:   class Doc
[ERROR] location: class ExcludeDoclet
[ERROR] /C:/Jenkins/workspace/flex-blazeds/modules/core/src/ExcludeDoclet.java:[57,56] cannot
find symbol
[ERROR] symbol:   class Doc
[ERROR] location: class ExcludeDoclet
[ERROR] -> [Help 1]
[ERROR] 
[ERROR] To see the full stack trace of the errors, re-run Maven with the -e switch.
[ERROR] Re-run Maven using the -X switch to enable full debug logging.
[ERROR] 
[ERROR] For more information about the errors and possible solutions, please read the following
articles:
[ERROR] [Help 1] http://cwiki.apache.org/confluence/display/MAVEN/MojoFailureException
[ERROR] 
[ERROR] After correcting the problems, you can resume the build with the command
[ERROR]   mvn <goals> -rf :flex-messaging-core
[JENKINS] Archiving C:\Jenkins\workspace\flex-blazeds\modules\proxy\pom.xml to org.apache.flex.blazeds/flex-messaging-proxy/4.7.2-SNAPSHOT/flex-messaging-proxy-4.7.2-SNAPSHOT.pom
[JENKINS] Archiving C:\Jenkins\workspace\flex-blazeds\modules\opt\poms\tomcat7\pom.xml to
org.apache.flex.blazeds/flex-messaging-opt-tomcat7/4.7.2-SNAPSHOT/flex-messaging-opt-tomcat7-4.7.2-SNAPSHOT.pom
[JENKINS] Archiving C:\Jenkins\workspace\flex-blazeds\modules\common\pom.xml to org.apache.flex.blazeds/flex-messaging-common/4.7.2-SNAPSHOT/flex-messaging-common-4.7.2-SNAPSHOT.pom
[JENKINS] Archiving C:\Jenkins\workspace\flex-blazeds\modules\common\target\flex-messaging-common.jar
to org.apache.flex.blazeds/flex-messaging-common/4.7.2-SNAPSHOT/flex-messaging-common-4.7.2-SNAPSHOT.jar
[JENKINS] Archiving C:\Jenkins\workspace\flex-blazeds\modules\common\target\flex-messaging-common-source-release.zip
to org.apache.flex.blazeds/flex-messaging-common/4.7.2-SNAPSHOT/flex-messaging-common-4.7.2-SNAPSHOT-source-release.zip
[JENKINS] Archiving C:\Jenkins\workspace\flex-blazeds\modules\common\target\flex-messaging-common-source-release.tar.gz
to org.apache.flex.blazeds/flex-messaging-common/4.7.2-SNAPSHOT/flex-messaging-common-4.7.2-SNAPSHOT-source-release.tar.gz
[JENKINS] Archiving <http://apacheflexbuild.cloudapp.net:8080/job/flex-blazeds/ws/modules/pom.xml>
to org.apache.flex.blazeds/blazeds/4.7.2-SNAPSHOT/blazeds-4.7.2-SNAPSHOT.pom
[JENKINS] Archiving <http://apacheflexbuild.cloudapp.net:8080/job/flex-blazeds/ws/modules/target/blazeds-4.7.2-SNAPSHOT-source-release.zip>
to org.apache.flex.blazeds/blazeds/4.7.2-SNAPSHOT/blazeds-4.7.2-SNAPSHOT-source-release.zip
[JENKINS] Archiving <http://apacheflexbuild.cloudapp.net:8080/job/flex-blazeds/ws/modules/target/blazeds-4.7.2-SNAPSHOT-source-release.tar.gz>
to org.apache.flex.blazeds/blazeds/4.7.2-SNAPSHOT/blazeds-4.7.2-SNAPSHOT-source-release.tar.gz
[JENKINS] Archiving C:\Jenkins\workspace\flex-blazeds\modules\opt\poms\tomcat6\pom.xml to
org.apache.flex.blazeds/flex-messaging-opt-tomcat6/4.7.2-SNAPSHOT/flex-messaging-opt-tomcat6-4.7.2-SNAPSHOT.pom
[JENKINS] Archiving C:\Jenkins\workspace\flex-blazeds\modules\remoting\pom.xml to org.apache.flex.blazeds/flex-messaging-remoting/4.7.2-SNAPSHOT/flex-messaging-remoting-4.7.2-SNAPSHOT.pom
[JENKINS] Archiving C:\Jenkins\workspace\flex-blazeds\modules\opt\poms\tomcat4\pom.xml to
org.apache.flex.blazeds/flex-messaging-opt-tomcat4/4.7.2-SNAPSHOT/flex-messaging-opt-tomcat4-4.7.2-SNAPSHOT.pom
[JENKINS] Archiving C:\Jenkins\workspace\flex-blazeds\modules\core\pom.xml to org.apache.flex.blazeds/flex-messaging-core/4.7.2-SNAPSHOT/flex-messaging-core-4.7.2-SNAPSHOT.pom
[JENKINS] Archiving C:\Jenkins\workspace\flex-blazeds\modules\opt\pom.xml to org.apache.flex.blazeds/flex-messaging-opt/4.7.2-SNAPSHOT/flex-messaging-opt-4.7.2-SNAPSHOT.pom
[JENKINS] Archiving C:\Jenkins\workspace\flex-blazeds\modules\testsuite\pom.xml to org.apache.flex.blazeds/flex-messaging-testsuite/4.7.2-SNAPSHOT/flex-messaging-testsuite-4.7.2-SNAPSHOT.pom
channel stopped
Picked up JAVA_TOOL_OPTIONS: -Dfile.encoding=UTF8
Archiving artifacts

Mime
View raw message