flex-commits mailing list archives

Site index · List index
Message view « Date » · « Thread »
Top « Date » · « Thread »
From flex.ci.bui...@gmail.com
Subject Build failed in Jenkins: flex-sdk_nightly #837
Date Wed, 30 Dec 2015 15:09:35 GMT
See <http://apacheflexbuild.cloudapp.net:8080/job/flex-sdk_nightly/837/>

------------------------------------------
[...truncated 649 lines...]

bundles-clean:

clean:

clean:

clean:

bundles-clean:

clean:

clean:

clean:

clean:

clean:

bundles-clean:

clean:

bundles-clean:

clean:

clean:

bundles-clean:

clean:

bundles-clean:

clean:

bundles-clean:

clean:

bundles-clean:

clean:

bundles-clean:

clean:

clean:

clean:

clean:

frameworks-rsls-clean:

package-clean:
[available] DEPRECATED - <available> used to override an existing property.
[available]   Build file should not reuse the same property name for different values.
[available] DEPRECATED - <available> used to override an existing property.
[available]   Build file should not reuse the same property name for different values.

clean-temp:

clean-dependencychecker:

checkintests-clean:
 [loadfile] <http://apacheflexbuild.cloudapp.net:8080/job/flex-sdk_nightly/ws/mustella/local.properties>
doesn't exist

cleanmustellaswc:

clean:
[available] DEPRECATED - <available> used to override an existing property.
[available]   Build file should not reuse the same property name for different values.
[available] DEPRECATED - <available> used to override an existing property.
[available]   Build file should not reuse the same property name for different values.

clean:

clean:
 [loadfile] <http://apacheflexbuild.cloudapp.net:8080/job/flex-sdk_nightly/ws/mustella/local.properties>
doesn't exist

cleanswfs:

clean:
     [echo] Deleting old results and files from previous testsuite build.

super-clean:

create-description:
     [echo] build.number is 20151230

create-config:

playerglobal-setswfversion:

flex-config:
     [copy] Copying 1 file to <http://apacheflexbuild.cloudapp.net:8080/job/flex-sdk_nightly/ws/frameworks>
     [copy] Copying 1 file to <http://apacheflexbuild.cloudapp.net:8080/job/flex-sdk_nightly/ws/frameworks>
     [copy] Copying 1 file to <http://apacheflexbuild.cloudapp.net:8080/job/flex-sdk_nightly/ws/frameworks>

stage-source:
[available] DEPRECATED - <available> used to override an existing property.
[available]   Build file should not reuse the same property name for different values.
[available] DEPRECATED - <available> used to override an existing property.
[available]   Build file should not reuse the same property name for different values.

clean-temp:
     [copy] Copying 30 files to <http://apacheflexbuild.cloudapp.net:8080/job/flex-sdk_nightly/ws/temp>
[available] DEPRECATED - <available> used to override an existing property.
[available]   Build file should not reuse the same property name for different values.
[available] DEPRECATED - <available> used to override an existing property.
[available]   Build file should not reuse the same property name for different values.

stage-bin:
     [copy] Copying 30 files to <http://apacheflexbuild.cloudapp.net:8080/job/flex-sdk_nightly/ws/temp/bin>
[available] DEPRECATED - <available> used to override an existing property.
[available]   Build file should not reuse the same property name for different values.
[available] DEPRECATED - <available> used to override an existing property.
[available]   Build file should not reuse the same property name for different values.

stage-frameworks:
     [copy] Copying 6015 files to <http://apacheflexbuild.cloudapp.net:8080/job/flex-sdk_nightly/ws/temp/frameworks>
     [copy] Copying 9 files to <http://apacheflexbuild.cloudapp.net:8080/job/flex-sdk_nightly/ws/temp/frameworks/javascript>
[available] DEPRECATED - <available> used to override an existing property.
[available]   Build file should not reuse the same property name for different values.
[available] DEPRECATED - <available> used to override an existing property.
[available]   Build file should not reuse the same property name for different values.

stage-frameworks-tests:
     [copy] Copying 206 files to <http://apacheflexbuild.cloudapp.net:8080/job/flex-sdk_nightly/ws/temp/frameworks>
[available] DEPRECATED - <available> used to override an existing property.
[available]   Build file should not reuse the same property name for different values.
[available] DEPRECATED - <available> used to override an existing property.
[available]   Build file should not reuse the same property name for different values.

version-update:
[available] DEPRECATED - <available> used to override an existing property.
[available]   Build file should not reuse the same property name for different values.
[available] DEPRECATED - <available> used to override an existing property.
[available]   Build file should not reuse the same property name for different values.

have-greptask:
[available] DEPRECATED - <available> used to override an existing property.
[available]   Build file should not reuse the same property name for different values.
[available] DEPRECATED - <available> used to override an existing property.
[available]   Build file should not reuse the same property name for different values.

no-greptask:
     [echo] Version files not updated.
     [echo] antelopetasks*.jar not found in anttask.classpath
[available] DEPRECATED - <available> used to override an existing property.
[available]   Build file should not reuse the same property name for different values.
[available] DEPRECATED - <available> used to override an existing property.
[available]   Build file should not reuse the same property name for different values.

stage-tlf:
     [copy] Copying 231 files to <http://apacheflexbuild.cloudapp.net:8080/job/flex-sdk_nightly/ws/temp/frameworks/projects/textLayout>
[available] DEPRECATED - <available> used to override an existing property.
[available]   Build file should not reuse the same property name for different values.
[available] DEPRECATED - <available> used to override an existing property.
[available]   Build file should not reuse the same property name for different values.

stage-modules:
     [copy] Copying 1732 files to <http://apacheflexbuild.cloudapp.net:8080/job/flex-sdk_nightly/ws/temp/modules>
     [copy] Copying 1830 files to <http://apacheflexbuild.cloudapp.net:8080/job/flex-sdk_nightly/ws/temp/modules/thirdparty>
     [copy] Copying 49 files to <http://apacheflexbuild.cloudapp.net:8080/job/flex-sdk_nightly/ws/temp/asdoc>
     [copy] Copying 12 files to <http://apacheflexbuild.cloudapp.net:8080/job/flex-sdk_nightly/ws/temp/ide>
[available] DEPRECATED - <available> used to override an existing property.
[available]   Build file should not reuse the same property name for different values.
[available] DEPRECATED - <available> used to override an existing property.
[available]   Build file should not reuse the same property name for different values.

stage-mustella:
     [copy] Copying 102 files to <http://apacheflexbuild.cloudapp.net:8080/job/flex-sdk_nightly/ws/temp/mustella>
     [copy] Copying 803 files to <http://apacheflexbuild.cloudapp.net:8080/job/flex-sdk_nightly/ws/temp/samples>
     [copy] Copying 7 files to <http://apacheflexbuild.cloudapp.net:8080/job/flex-sdk_nightly/ws/temp/templates>

source-package-zip:
    [mkdir] Created dir: <http://apacheflexbuild.cloudapp.net:8080/job/flex-sdk_nightly/ws/out>
      [zip] Building zip: <http://apacheflexbuild.cloudapp.net:8080/job/flex-sdk_nightly/837/artifact/out/apache-flex-sdk-4.15.0-src.zip>

source-package-tgz:
      [tar] Building tar: <http://apacheflexbuild.cloudapp.net:8080/job/flex-sdk_nightly/837/artifact/out/apache-flex-sdk-4.15.0-src.tar.gz>

source-package:

source-release:

setup-binary-release:

thirdparty-downloads:

thirdparty-downloads:

pixelbender-check:

pixelbender-download:
    [mkdir] Created dir: <http://apacheflexbuild.cloudapp.net:8080/job/flex-sdk_nightly/ws/in>

get_from_mirror:

download_using_mirror:
      [get] Getting: http://www.apache.org/dyn/mirrors/mirrors.cgi/flex/pixelbender/1.0/binaries/apache-flex-sdk-pixel-bender-1.0.0-bin.zip?asjson=true
      [get] To: <http://apacheflexbuild.cloudapp.net:8080/job/flex-sdk_nightly/ws/frameworks/mirror.json>
      [get] .
   [delete] Deleting: <http://apacheflexbuild.cloudapp.net:8080/job/flex-sdk_nightly/ws/frameworks/mirror.json>
     [echo] Using mirror: http://mirrors.koehn.com/apache/
      [get] Getting: http://mirrors.koehn.com/apache/flex/pixelbender/1.0/binaries/apache-flex-sdk-pixel-bender-1.0.0-bin.zip
      [get] To: <http://apacheflexbuild.cloudapp.net:8080/job/flex-sdk_nightly/ws/in/apache-flex-sdk-pixel-bender-1.0.0-bin.zip>

download_using_get:
    [unzip] Expanding: <http://apacheflexbuild.cloudapp.net:8080/job/flex-sdk_nightly/ws/in/apache-flex-sdk-pixel-bender-1.0.0-bin.zip>
into <http://apacheflexbuild.cloudapp.net:8080/job/flex-sdk_nightly/ws/>

swfobject-check:

swfobject-download:
      [get] Getting: https://codeload.github.com/swfobject/swfobject/zip/2.2
      [get] To: <http://apacheflexbuild.cloudapp.net:8080/job/flex-sdk_nightly/ws/in/swfobject_2_2.zip>
    [unzip] Expanding: <http://apacheflexbuild.cloudapp.net:8080/job/flex-sdk_nightly/ws/in/swfobject_2_2.zip>
into <http://apacheflexbuild.cloudapp.net:8080/job/flex-sdk_nightly/ws/templates/swfobject>

swfobject-fabridge-download:
     [copy] Copying 1 file to <http://apacheflexbuild.cloudapp.net:8080/job/flex-sdk_nightly/ws/frameworks/javascript/FABridge/samples/fabridge/swfobject>

osmf-check:

osmf-download:

download-osmf-swc:
      [get] Getting: http://downloads.sourceforge.net/project/osmf.adobe/OSMF%202.0%20Release%20%28final%20source%2C%20ASDocs%2C%20pdf%20guides%20and%20release%20notes%29/OSMF.swc?r=&ts=1381906346&use_mirror=optimate
      [get] To: <http://apacheflexbuild.cloudapp.net:8080/job/flex-sdk_nightly/ws/in/osmf.swc>
      [get] Error opening connection java.io.FileNotFoundException: http://downloads.sourceforge.net/project/osmf.adobe/OSMF%202.0%20Release%20%28final%20source%2C%20ASDocs%2C%20pdf%20guides%20and%20release%20notes%29/OSMF.swc?r=&ts=1381906346&use_mirror=optimate
      [get] Error opening connection java.io.FileNotFoundException: http://downloads.sourceforge.net/project/osmf.adobe/OSMF%202.0%20Release%20%28final%20source%2C%20ASDocs%2C%20pdf%20guides%20and%20release%20notes%29/OSMF.swc?r=&ts=1381906346&use_mirror=optimate
      [get] Error opening connection java.io.FileNotFoundException: http://downloads.sourceforge.net/project/osmf.adobe/OSMF%202.0%20Release%20%28final%20source%2C%20ASDocs%2C%20pdf%20guides%20and%20release%20notes%29/OSMF.swc?r=&ts=1381906346&use_mirror=optimate
      [get] Can't get http://downloads.sourceforge.net/project/osmf.adobe/OSMF%202.0%20Release%20%28final%20source%2C%20ASDocs%2C%20pdf%20guides%20and%20release%20notes%29/OSMF.swc?r=&ts=1381906346&use_mirror=optimate
to <http://apacheflexbuild.cloudapp.net:8080/job/flex-sdk_nightly/ws/in/osmf.swc>

BUILD FAILED
<http://apacheflexbuild.cloudapp.net:8080/job/flex-sdk_nightly/ws/build.xml>:157: The
following error occurred while executing this line:
<http://apacheflexbuild.cloudapp.net:8080/job/flex-sdk_nightly/ws/frameworks/build.xml>:100:
The following error occurred while executing this line:
<http://apacheflexbuild.cloudapp.net:8080/job/flex-sdk_nightly/ws/frameworks/downloads.xml>:99:
The following error occurred while executing this line:
<http://apacheflexbuild.cloudapp.net:8080/job/flex-sdk_nightly/ws/frameworks/downloads.xml>:110:
Can't get http://downloads.sourceforge.net/project/osmf.adobe/OSMF%202.0%20Release%20%28final%20source%2C%20ASDocs%2C%20pdf%20guides%20and%20release%20notes%29/OSMF.swc?r=&ts=1381906346&use_mirror=optimate
to <http://apacheflexbuild.cloudapp.net:8080/job/flex-sdk_nightly/ws/in/osmf.swc>

Total time: 11 minutes 12 seconds
Picked up JAVA_TOOL_OPTIONS: -Dfile.encoding=UTF8
Build step 'Invoke Ant' marked build as failure
Archiving artifacts

Mime
View raw message