flex-commits mailing list archives

Site index · List index
Message view « Date » · « Thread »
Top « Date » · « Thread »
From flex.ci.bui...@gmail.com
Subject Build failed in Jenkins: flex-flexunit #507
Date Mon, 28 Dec 2015 21:22:25 GMT
See <http://apacheflexbuild.cloudapp.net:8080/job/flex-flexunit/507/changes>

Changes:

[Alex Harui] Revert "Temporarily disabling as3 compilation to determine if that's why some
unit tests are failing"

[Alex Harui] Revert "Temporarily disabling as3 compilation to determine if that's why some
unit tests are failing. Then we'll restore this and change in the right place."

[Alex Harui] try to remove the as3 swc temporarily after it is built.  The build scripts cared
too much about its existence

------------------------------------------
[...truncated 74 lines...]

clean:

clean:
  [typedef] Could not load definitions from resource org/apache/maven/artifact/ant/antlib.xml.
It could not be found.
  [taskdef] Could not load definitions from resource net/sf/antcontrib/antcontrib.properties.
It could not be found.

clean:

clean:
  [typedef] Could not load definitions from resource org/apache/maven/artifact/ant/antlib.xml.
It could not be found.
  [taskdef] Could not load definitions from resource net/sf/antcontrib/antcontrib.properties.
It could not be found.

clean:
  [typedef] Could not load definitions from resource org/apache/maven/artifact/ant/antlib.xml.
It could not be found.
  [taskdef] Could not load definitions from resource net/sf/antcontrib/antcontrib.properties.
It could not be found.

clean:

clean:

clean:
  [typedef] Could not load definitions from resource org/apache/maven/artifact/ant/antlib.xml.
It could not be found.
  [taskdef] Could not load definitions from resource net/sf/antcontrib/antcontrib.properties.
It could not be found.

clean:
  [typedef] Could not load definitions from resource org/apache/maven/artifact/ant/antlib.xml.
It could not be found.
  [taskdef] Could not load definitions from resource net/sf/antcontrib/antcontrib.properties.
It could not be found.

clean:
  [typedef] Could not load definitions from resource org/apache/maven/artifact/ant/antlib.xml.
It could not be found.
  [taskdef] Could not load definitions from resource net/sf/antcontrib/antcontrib.properties.
It could not be found.

clean:

clean:

thirdparty-downloads:

prepare:

maven-ant-tasks-jar-check:

maven-ant-tasks-jar:

ant-contrib-check:

ant-contrib-jar:

main:
  [typedef] Could not load definitions from resource org/apache/maven/artifact/ant/antlib.xml.
It could not be found.
  [taskdef] Could not load definitions from resource net/sf/antcontrib/antcontrib.properties.
It could not be found.

thirdparty-downloads:

prepare:
    [mkdir] Created dir: <http://apacheflexbuild.cloudapp.net:8080/job/flex-flexunit/ws/FlexUnit4AntTasks/lib>

junit-jar-check:

junit-jar:
     [echo] Obtaining lib/junit-3.8.1.jar

echo-cpl1.0-license:

junit-jar-check:

junit-download-jar:

download-jar:
      [get] Getting: http://search.maven.org/remotecontent?filepath=junit/junit/3.8.1/junit-3.8.1.jar
      [get] To: <http://apacheflexbuild.cloudapp.net:8080/job/flex-flexunit/ws/FlexUnit4AntTasks/lib/junit-3.8.1.jar>
      [get] http://search.maven.org/remotecontent?filepath=junit/junit/3.8.1/junit-3.8.1.jar
moved to https://repo1.maven.org/maven2/junit/junit/3.8.1/junit-3.8.1.jar

fail-with-message:

ant-jar-check:

ant-jar:
     [echo] Obtaining lib/ant-1.7.1.jar

ant-jar-check:

ant-download-jar:

download-jar:
      [get] Getting: http://search.maven.org/remotecontent?filepath=org/apache/ant/ant/1.7.1/ant-1.7.1.jar
      [get] To: <http://apacheflexbuild.cloudapp.net:8080/job/flex-flexunit/ws/FlexUnit4AntTasks/lib/ant-1.7.1.jar>
      [get] http://search.maven.org/remotecontent?filepath=org/apache/ant/ant/1.7.1/ant-1.7.1.jar
moved to https://repo1.maven.org/maven2/org/apache/ant/ant/1.7.1/ant-1.7.1.jar

fail-with-message:

ant-launcher-jar-check:

ant-launcher-jar:
     [echo] Obtaining lib/ant-launcher-1.7.1.jar

ant-launcher-jar-check:

ant-launcher-download-jar:

download-jar:
      [get] Getting: http://search.maven.org/remotecontent?filepath=org/apache/ant/ant-launcher/1.7.1/ant-launcher-1.7.1.jar
      [get] To: <http://apacheflexbuild.cloudapp.net:8080/job/flex-flexunit/ws/FlexUnit4AntTasks/lib/ant-launcher-1.7.1.jar>
      [get] http://search.maven.org/remotecontent?filepath=org/apache/ant/ant-launcher/1.7.1/ant-launcher-1.7.1.jar
moved to https://repo1.maven.org/maven2/org/apache/ant/ant-launcher/1.7.1/ant-launcher-1.7.1.jar

fail-with-message:

ant-testutil-jar-check:

ant-testutil-jar:
     [echo] Obtaining lib/ant-testutil-1.7.1.jar

ant-testutil-jar-check:

ant-testutil-download-jar:

download-jar:
      [get] Getting: http://search.maven.org/remotecontent?filepath=org/apache/ant/ant-testutil/1.7.1/ant-testutil-1.7.1.jar
      [get] To: <http://apacheflexbuild.cloudapp.net:8080/job/flex-flexunit/ws/FlexUnit4AntTasks/lib/ant-testutil-1.7.1.jar>
      [get] http://search.maven.org/remotecontent?filepath=org/apache/ant/ant-testutil/1.7.1/ant-testutil-1.7.1.jar
moved to https://repo1.maven.org/maven2/org/apache/ant/ant-testutil/1.7.1/ant-testutil-1.7.1.jar

fail-with-message:

dom4j-jar-check:

dom4j-jar:
     [echo] Obtaining lib/dom4j-1.6.1.jar

dom4j-jar-check:

dom4j-download-jar:

download-jar:
      [get] Getting: http://search.maven.org/remotecontent?filepath=dom4j/dom4j/1.6.1/dom4j-1.6.1.jar
      [get] To: <http://apacheflexbuild.cloudapp.net:8080/job/flex-flexunit/ws/FlexUnit4AntTasks/lib/dom4j-1.6.1.jar>
      [get] http://search.maven.org/remotecontent?filepath=dom4j/dom4j/1.6.1/dom4j-1.6.1.jar
moved to https://repo1.maven.org/maven2/dom4j/dom4j/1.6.1/dom4j-1.6.1.jar

fail-with-message:

jaxen-jar-check:

jaxen-jar:
     [echo] Obtaining lib/jaxen-1.1-beta-6.jar

jaxen-jar-check:

jaxen-download-jar:

download-jar:
      [get] Getting: http://search.maven.org/remotecontent?filepath=jaxen/jaxen/1.1-beta-6/jaxen-1.1-beta-6.jar
      [get] To: <http://apacheflexbuild.cloudapp.net:8080/job/flex-flexunit/ws/FlexUnit4AntTasks/lib/jaxen-1.1-beta-6.jar>
      [get] http://search.maven.org/remotecontent?filepath=jaxen/jaxen/1.1-beta-6/jaxen-1.1-beta-6.jar
moved to https://repo1.maven.org/maven2/jaxen/jaxen/1.1-beta-6/jaxen-1.1-beta-6.jar

fail-with-message:

main:
  [typedef] Could not load definitions from resource org/apache/maven/artifact/ant/antlib.xml.
It could not be found.
  [taskdef] Could not load definitions from resource net/sf/antcontrib/antcontrib.properties.
It could not be found.

thirdparty-downloads:

prepare:
    [mkdir] Created dir: <http://apacheflexbuild.cloudapp.net:8080/job/flex-flexunit/ws/FlexUnit4/libs>

flexunit1lib-swc-check:

flexunit1lib-swc:
     [echo] Obtaining libs/FlexUnit1Lib.swc

flexunit1lib-swc-check:

flexunit1lib-download-swc:

download-swc:
      [get] Getting: https://github.com/flexunit/flexunit/raw/master/FlexUnit4Test/libs/FlexUnit1Lib.swc
      [get] To: <http://apacheflexbuild.cloudapp.net:8080/job/flex-flexunit/ws/FlexUnit4/libs/FlexUnit1Lib.swc>
      [get] https://github.com/flexunit/flexunit/raw/master/FlexUnit4Test/libs/FlexUnit1Lib.swc
moved to https://raw.githubusercontent.com/flexunit/flexunit/master/FlexUnit4Test/libs/FlexUnit1Lib.swc

fail-with-message:

hamcrest-swc-check:

hamcrest-swc:
     [echo] Obtaining lib/hamcrest-as3-flex-1.1.3.swc

download-zip:
    [mkdir] Created dir: <http://apacheflexbuild.cloudapp.net:8080/job/flex-flexunit/ws/FlexUnit4/in>
      [get] Getting: https://cloud.github.com/downloads/drewbourne/hamcrest-as3/hamcrest-as3-flex-1.1.3.zip
      [get] To: <http://apacheflexbuild.cloudapp.net:8080/job/flex-flexunit/ws/FlexUnit4/in/hamcrest-as3-flex-1.1.3.zip>
      [get] Error getting https://cloud.github.com/downloads/drewbourne/hamcrest-as3/hamcrest-as3-flex-1.1.3.zip
to <http://apacheflexbuild.cloudapp.net:8080/job/flex-flexunit/ws/FlexUnit4/in/hamcrest-as3-flex-1.1.3.zip>

BUILD FAILED
<http://apacheflexbuild.cloudapp.net:8080/job/flex-flexunit/ws/build.xml>:113: The following
error occurred while executing this line:
<http://apacheflexbuild.cloudapp.net:8080/job/flex-flexunit/ws/FlexUnit4/build.xml>:102:
The following error occurred while executing this line:
<http://apacheflexbuild.cloudapp.net:8080/job/flex-flexunit/ws/FlexUnit4/downloads.xml>:193:
The following error occurred while executing this line:
<http://apacheflexbuild.cloudapp.net:8080/job/flex-flexunit/ws/FlexUnit4/downloads.xml>:108:
javax.net.ssl.SSLHandshakeException: Received fatal alert: handshake_failure
	at sun.security.ssl.Alerts.getSSLException(Alerts.java:192)
	at sun.security.ssl.Alerts.getSSLException(Alerts.java:154)
	at sun.security.ssl.SSLSocketImpl.recvAlert(SSLSocketImpl.java:1959)
	at sun.security.ssl.SSLSocketImpl.readRecord(SSLSocketImpl.java:1077)
	at sun.security.ssl.SSLSocketImpl.performInitialHandshake(SSLSocketImpl.java:1312)
	at sun.security.ssl.SSLSocketImpl.startHandshake(SSLSocketImpl.java:1339)
	at sun.security.ssl.SSLSocketImpl.startHandshake(SSLSocketImpl.java:1323)
	at sun.net.www.protocol.https.HttpsClient.afterConnect(HttpsClient.java:563)
	at sun.net.www.protocol.https.AbstractDelegateHttpsURLConnection.connect(AbstractDelegateHttpsURLConnection.java:185)
	at sun.net.www.protocol.https.HttpsURLConnectionImpl.connect(HttpsURLConnectionImpl.java:153)
	at org.apache.tools.ant.taskdefs.Get$GetThread.openConnection(Get.java:690)
	at org.apache.tools.ant.taskdefs.Get$GetThread.get(Get.java:606)
	at org.apache.tools.ant.taskdefs.Get$GetThread.run(Get.java:596)

Total time: 15 seconds
Picked up JAVA_TOOL_OPTIONS: -Dfile.encoding=UTF8
Build step 'Invoke Ant' marked build as failure
Archiving artifacts
Recording test results
ERROR: Publisher hudson.tasks.junit.JUnitResultArchiver aborted due to exception
hudson.AbortException: No test report files were found. Configuration error?
	at hudson.tasks.junit.JUnitParser$ParseResultCallable.invoke(JUnitParser.java:116)
	at hudson.tasks.junit.JUnitParser$ParseResultCallable.invoke(JUnitParser.java:93)
	at hudson.FilePath$FileCallableWrapper.call(FilePath.java:2677)
	at hudson.remoting.UserRequest.perform(UserRequest.java:121)
	at hudson.remoting.UserRequest.perform(UserRequest.java:49)
	at hudson.remoting.Request$2.run(Request.java:324)
	at hudson.remoting.InterceptingExecutorService$1.call(InterceptingExecutorService.java:68)
	at java.util.concurrent.FutureTask.run(Unknown Source)
	at java.util.concurrent.ThreadPoolExecutor.runWorker(Unknown Source)
	at java.util.concurrent.ThreadPoolExecutor$Worker.run(Unknown Source)
	at hudson.remoting.Engine$1$1.run(Engine.java:63)
	at java.lang.Thread.run(Unknown Source)
	at ......remote call to flex_sdk_slave2(Native Method)
	at hudson.remoting.Channel.attachCallSiteStackTrace(Channel.java:1356)
	at hudson.remoting.UserResponse.retrieve(UserRequest.java:221)
	at hudson.remoting.Channel.call(Channel.java:752)
	at hudson.FilePath.act(FilePath.java:970)
	at hudson.FilePath.act(FilePath.java:959)
	at hudson.tasks.junit.JUnitParser.parseResult(JUnitParser.java:90)
	at hudson.tasks.junit.JUnitResultArchiver.parse(JUnitResultArchiver.java:120)
	at hudson.tasks.junit.JUnitResultArchiver.perform(JUnitResultArchiver.java:137)
	at hudson.tasks.BuildStepCompatibilityLayer.perform(BuildStepCompatibilityLayer.java:74)
	at hudson.tasks.BuildStepMonitor$1.perform(BuildStepMonitor.java:20)
	at hudson.model.AbstractBuild$AbstractBuildExecution.perform(AbstractBuild.java:770)
	at hudson.model.AbstractBuild$AbstractBuildExecution.performAllBuildSteps(AbstractBuild.java:734)
	at hudson.model.Build$BuildExecution.post2(Build.java:183)
	at hudson.model.AbstractBuild$AbstractBuildExecution.post(AbstractBuild.java:683)
	at hudson.model.Run.execute(Run.java:1784)
	at hudson.model.FreeStyleBuild.run(FreeStyleBuild.java:43)
	at hudson.model.ResourceController.execute(ResourceController.java:89)
	at hudson.model.Executor.run(Executor.java:240)

Mime
View raw message