flex-commits mailing list archives

Site index · List index
Message view « Date » · « Thread »
Top « Date » · « Thread »
From flex.ci.bui...@gmail.com
Subject Build failed in Jenkins: flex-asjs #849
Date Sat, 19 Dec 2015 01:42:46 GMT
See <http://apacheflexbuild.cloudapp.net:8080/job/flex-asjs/849/changes>

Changes:

[Alex Harui] try another way of handling 3rd party deps

------------------------------------------
[...truncated 558 lines...]
     [java] Compiling file: <http://apacheflexbuild.cloudapp.net:8080/job/flex-asjs/ws/frameworks/projects/Core/js/out/org/apache/flex/core/ValuesManager.js>
     [java] Compiling file: <http://apacheflexbuild.cloudapp.net:8080/job/flex-asjs/ws/frameworks/projects/Core/js/out/org/apache/flex/core/BrowserResizeListener.js>
     [java] Compiling file: <http://apacheflexbuild.cloudapp.net:8080/job/flex-asjs/ws/frameworks/projects/Core/js/out/org/apache/flex/core/ParentDocumentBead.js>
     [java] Found ignorable: org.apache.flex.core.IChild
     [java] Compiling file: <http://apacheflexbuild.cloudapp.net:8080/job/flex-asjs/ws/frameworks/projects/Core/js/out/org/apache/flex/core/IViewport.js>
     [java] Compiling file: <http://apacheflexbuild.cloudapp.net:8080/job/flex-asjs/ws/frameworks/projects/Core/js/out/org/apache/flex/core/IItemRenderer.js>
     [java] Compiling file: <http://apacheflexbuild.cloudapp.net:8080/job/flex-asjs/ws/frameworks/projects/Core/js/out/org/apache/flex/core/ISelectableItemRenderer.js>
     [java] Compiling file: <http://apacheflexbuild.cloudapp.net:8080/job/flex-asjs/ws/frameworks/projects/Core/js/out/org/apache/flex/core/Strand.js>
     [java] Compiling file: <http://apacheflexbuild.cloudapp.net:8080/job/flex-asjs/ws/frameworks/projects/Core/js/out/org/apache/flex/core/IItemRendererClassFactory.js>
     [java] Compiling file: <http://apacheflexbuild.cloudapp.net:8080/job/flex-asjs/ws/frameworks/projects/Core/js/out/org/apache/flex/core/IDocument.js>
     [java] Compiling file: <http://apacheflexbuild.cloudapp.net:8080/job/flex-asjs/ws/frameworks/projects/Core/js/out/org/apache/flex/core/ItemRendererClassFactory.js>
     [java] Compiling file: <http://apacheflexbuild.cloudapp.net:8080/job/flex-asjs/ws/frameworks/projects/Core/js/out/org/apache/flex/geom/Rectangle.js>
     [java] Compiling file: <http://apacheflexbuild.cloudapp.net:8080/job/flex-asjs/ws/frameworks/projects/Core/js/out/org/apache/flex/core/IItemRendererProvider.js>
     [java] Compiling file: <http://apacheflexbuild.cloudapp.net:8080/job/flex-asjs/ws/frameworks/projects/Core/js/out/org/apache/flex/core/SimpleCSSValuesImpl.js>
     [java] Compiling file: <http://apacheflexbuild.cloudapp.net:8080/job/flex-asjs/ws/frameworks/projects/Core/js/out/org/apache/flex/core/ListBaseStrandChildren.js>
     [java] Compiling file: <http://apacheflexbuild.cloudapp.net:8080/job/flex-asjs/ws/frameworks/projects/Core/js/out/org/apache/flex/core/IContentView.js>
     [java] Compiling file: <http://apacheflexbuild.cloudapp.net:8080/job/flex-asjs/ws/frameworks/projects/Core/js/out/org/apache/flex/states/SetProperty.js>
     [java] Compiling file: <http://apacheflexbuild.cloudapp.net:8080/job/flex-asjs/ws/frameworks/projects/Core/js/out/org/apache/flex/core/DataBindingBase.js>
     [java] Compiling file: <http://apacheflexbuild.cloudapp.net:8080/job/flex-asjs/ws/frameworks/projects/Core/js/out/org/apache/flex/core/IPopUp.js>
     [java] Compiling file: <http://apacheflexbuild.cloudapp.net:8080/job/flex-asjs/ws/frameworks/projects/Core/js/out/org/apache/flex/core/IContainerView.js>
     [java] Compiling file: <http://apacheflexbuild.cloudapp.net:8080/job/flex-asjs/ws/frameworks/projects/Core/js/out/org/apache/flex/core/IStatesImpl.js>
     [java] Compiling file: <http://apacheflexbuild.cloudapp.net:8080/job/flex-asjs/ws/frameworks/projects/Core/js/out/CoreClasses.js>
     [java] Compiling file: <http://apacheflexbuild.cloudapp.net:8080/job/flex-asjs/ws/frameworks/projects/Core/js/out/org/apache/flex/core/IBeadView.js>
     [java] Compiling file: <http://apacheflexbuild.cloudapp.net:8080/job/flex-asjs/ws/frameworks/projects/Core/js/out/org/apache/flex/core/IRangeModel.js>
     [java] Compiling file: <http://apacheflexbuild.cloudapp.net:8080/job/flex-asjs/ws/frameworks/projects/Core/js/out/org/apache/flex/core/IViewportModel.js>
     [java] Compiling file: <http://apacheflexbuild.cloudapp.net:8080/job/flex-asjs/ws/frameworks/projects/Core/js/out/org/apache/flex/events/CustomEvent.js>
     [java] Compiling file: <http://apacheflexbuild.cloudapp.net:8080/job/flex-asjs/ws/frameworks/projects/Core/js/out/org/apache/flex/core/IBeadController.js>
     [java] Compiling file: <http://apacheflexbuild.cloudapp.net:8080/job/flex-asjs/ws/frameworks/projects/Core/js/out/org/apache/flex/core/IRollOverModel.js>
     [java] Compiling file: <http://apacheflexbuild.cloudapp.net:8080/job/flex-asjs/ws/frameworks/projects/Core/js/out/org/apache/flex/core/SimpleStatesImpl.js>
     [java] Compiling file: <http://apacheflexbuild.cloudapp.net:8080/job/flex-asjs/ws/frameworks/projects/Core/js/out/org/apache/flex/events/utils/MouseUtils.js>
     [java] Compiling file: <http://apacheflexbuild.cloudapp.net:8080/job/flex-asjs/ws/frameworks/projects/Core/js/out/org/apache/flex/core/Application.js>
     [java] Compiling file: <http://apacheflexbuild.cloudapp.net:8080/job/flex-asjs/ws/frameworks/projects/Core/js/out/org/apache/flex/core/IComboBoxModel.js>
     [java] Compiling file: <http://apacheflexbuild.cloudapp.net:8080/job/flex-asjs/ws/frameworks/projects/Core/js/out/org/apache/flex/states/AddItems.js>
     [java] Compiling file: <http://apacheflexbuild.cloudapp.net:8080/job/flex-asjs/ws/frameworks/projects/Core/js/out/org/apache/flex/core/BrowserWindow.js>
     [java] Compiling file: <http://apacheflexbuild.cloudapp.net:8080/job/flex-asjs/ws/frameworks/projects/Core/js/out/org/apache/flex/utils/UIUtils.js>
     [java] Compiling file: <http://apacheflexbuild.cloudapp.net:8080/job/flex-asjs/ws/frameworks/projects/Core/js/out/org/apache/flex/utils/Language.js>
     [java] Found ignorable: goog.bind
     [java] Found ignorable: goog.global
     [java] Compiling file: <http://apacheflexbuild.cloudapp.net:8080/job/flex-asjs/ws/frameworks/projects/Core/js/out/org/apache/flex/core/FilledRectangle.js>
     [java] Compiling file: <http://apacheflexbuild.cloudapp.net:8080/job/flex-asjs/ws/frameworks/projects/Core/js/out/org/apache/flex/utils/CSSContainerUtils.js>
     [java] Compiling file: <http://apacheflexbuild.cloudapp.net:8080/job/flex-asjs/ws/frameworks/projects/Core/js/out/org/apache/flex/events/ElementEvents.js>
     [java] Compiling file: <http://apacheflexbuild.cloudapp.net:8080/job/flex-asjs/ws/frameworks/projects/Core/js/out/org/apache/flex/core/CallLaterBead.js>
     [java] Compiling file: <http://apacheflexbuild.cloudapp.net:8080/job/flex-asjs/ws/frameworks/projects/Core/js/out/org/apache/flex/core/ITitleBarModel.js>
     [java] Compiling file: <http://apacheflexbuild.cloudapp.net:8080/job/flex-asjs/ws/frameworks/projects/Core/js/out/org/apache/flex/core/IPanelModel.js>
     [java] Compiling file: <http://apacheflexbuild.cloudapp.net:8080/job/flex-asjs/ws/frameworks/projects/Core/js/out/org/apache/flex/core/IDataGridPresentationModel.js>
     [java] Compiling file: <http://apacheflexbuild.cloudapp.net:8080/job/flex-asjs/ws/frameworks/projects/Core/js/out/org/apache/flex/core/IItemRendererParent.js>
     [java] Compiling file: <http://apacheflexbuild.cloudapp.net:8080/job/flex-asjs/ws/frameworks/projects/Core/js/out/org/apache/flex/utils/MixinManager.js>
     [java] Compiling file: <http://apacheflexbuild.cloudapp.net:8080/job/flex-asjs/ws/frameworks/projects/Core/js/out/org/apache/flex/core/BeadViewBase.js>
     [java] Compiling file: <http://apacheflexbuild.cloudapp.net:8080/job/flex-asjs/ws/frameworks/projects/Core/js/out/org/apache/flex/core/SimpleCSSStyles.js>
     [java] Compiling file: <http://apacheflexbuild.cloudapp.net:8080/job/flex-asjs/ws/frameworks/projects/Core/js/out/org/apache/flex/states/SetEventHandler.js>
     [java] Compiling file: <http://apacheflexbuild.cloudapp.net:8080/job/flex-asjs/ws/frameworks/projects/Core/js/out/org/apache/flex/events/BrowserEvent.js>
     [java] Compiling file: <http://apacheflexbuild.cloudapp.net:8080/job/flex-asjs/ws/frameworks/projects/Core/js/out/org/apache/flex/core/WrappedHTMLElement.js>
     [java] Compiling file: <http://apacheflexbuild.cloudapp.net:8080/job/flex-asjs/ws/frameworks/projects/Core/js/out/org/apache/flex/events/ValueEvent.js>
     [java] Compiling file: <http://apacheflexbuild.cloudapp.net:8080/job/flex-asjs/ws/frameworks/projects/Core/js/out/org/apache/flex/utils/EffectTimer.js>
     [java] Compiling file: <http://apacheflexbuild.cloudapp.net:8080/job/flex-asjs/ws/frameworks/projects/Core/js/out/org/apache/flex/core/BrowserScroller.js>
     [java] Compiling file: <http://apacheflexbuild.cloudapp.net:8080/job/flex-asjs/ws/frameworks/projects/Core/js/out/org/apache/flex/geom/Size.js>
     [java] Compiling file: <http://apacheflexbuild.cloudapp.net:8080/job/flex-asjs/ws/frameworks/projects/Core/js/out/org/apache/flex/core/IImageModel.js>
     [java] Compiling file: <http://apacheflexbuild.cloudapp.net:8080/job/flex-asjs/ws/frameworks/projects/Core/js/out/org/apache/flex/core/IAlertModel.js>
     [java] Compiling file: <http://apacheflexbuild.cloudapp.net:8080/job/flex-asjs/ws/frameworks/projects/Core/js/out/org/apache/flex/utils/ViewSourceContextMenuOption.js>
     [java] <http://apacheflexbuild.cloudapp.net:8080/job/flex-asjs/ws/frameworks/projects/Core/as/src/org/apache/flex/utils/Language.as>:114
     [java] Use of the instanceof operator.  The instanceof operator is deprecated, use the
is operator instead.
     [java]             if (leftOperand instanceof rightOperand)
     [java]                 ^
     [java] 
     [java] Picked up JAVA_TOOL_OPTIONS: -Dfile.encoding=UTF8
     [java] Java Result: 2

compile-extern-swc:
     [echo] Compiling externs/Core.swc
     [echo] FLEX_HOME: <http://apacheflexbuild.cloudapp.net:8080/job/flex-asjs/ws/>
     [echo] FALCON_HOME: <http://apacheflexbuild.cloudapp.net:8080/job/flex-asjs/ws/../flex-falcon/compiler/generated/dist/sdk>
    [compc] Loading configuration: <http://apacheflexbuild.cloudapp.net:8080/job/flex-asjs/ws/frameworks/projects/Core/compile-asjs-config.xml>
    [compc] 
    [compc] 116968 bytes written to C:\Jenkins\workspace\flex-asjs\frameworks\externs\Core.swc
in 40.319 seconds
    [compc] <http://apacheflexbuild.cloudapp.net:8080/job/flex-asjs/ws/frameworks/projects/Core/as/src/org/apache/flex/utils/Language.as>:114
    [compc] Warning: Use of the instanceof operator.  The instanceof operator is deprecated,
use the is operator instead.
    [compc]             if (leftOperand instanceof rightOperand)
    [compc]                 ^
    [compc] 
    [compc] Picked up JAVA_TOOL_OPTIONS: -Dfile.encoding=UTF8

copy-js:
     [copy] Copying 116 files to <http://apacheflexbuild.cloudapp.net:8080/job/flex-asjs/ws/frameworks/js/FlexJS/libs>

compile:
     [echo] Compiling libs/Core.swc
     [echo] FLEX_HOME: <http://apacheflexbuild.cloudapp.net:8080/job/flex-asjs/ws/>
     [echo] FALCON_HOME: <http://apacheflexbuild.cloudapp.net:8080/job/flex-asjs/ws/../flex-falcon/compiler/generated/dist/sdk>
    [compc] Loading configuration: <http://apacheflexbuild.cloudapp.net:8080/job/flex-asjs/ws/frameworks/projects/Core/compile-config.xml>
    [compc] 
    [compc] 465854 bytes written to C:\Jenkins\workspace\flex-asjs\frameworks\libs\Core.swc
in 43.708 seconds
    [compc] Picked up JAVA_TOOL_OPTIONS: -Dfile.encoding=UTF8

test:
[available] DEPRECATED - <available> used to override an existing property.
[available]   Build file should not reuse the same property name for different values.

clean:

compile:
     [echo] Compiling FlexUnitFlexJSApplication.swf
     [echo] FLEX_HOME: <http://apacheflexbuild.cloudapp.net:8080/job/flex-asjs/ws/>
     [echo] FALCON_HOME: <http://apacheflexbuild.cloudapp.net:8080/job/flex-asjs/ws/../flex-falcon/compiler/generated/dist/sdk>
     [echo] FLEXUNIT_HOME: C:\jenkins\workspace\flex-flexunit
    [mxmlc] Loading configuration: <http://apacheflexbuild.cloudapp.net:8080/job/flex-asjs/ws/frameworks/flex-config.xml>
    [mxmlc] 
    [mxmlc] C:\jenkins\workspace\flex-flexunit\FlexUnit4\target\flexunit-4.3.0-20140410-as3_4.12.0.swc
    [mxmlc] Warning: The definition mx.utils.StringUtil depended on by flexunit.framework.AsyncTestHelper
in the SWC C:\jenkins\workspace\flex-flexunit\FlexUnit4\target\flexunit-4.3.0-20140410-as3_4.12.0.swc
could not be found
    [mxmlc] 
    [mxmlc] C:\jenkins\workspace\flex-flexunit\FlexUnit4\target\flexunit-4.3.0-20140410-as3_4.12.0.swc
    [mxmlc] Warning: The definition mx.utils.ObjectUtil depended on by flexunit.framework.Assert
in the SWC C:\jenkins\workspace\flex-flexunit\FlexUnit4\target\flexunit-4.3.0-20140410-as3_4.12.0.swc
could not be found
    [mxmlc] 
    [mxmlc] C:\jenkins\workspace\flex-flexunit\FlexUnit4\target\flexunit-4.3.0-20140410-as3_4.12.0.swc
    [mxmlc] Warning: The definition mx.utils.StringUtil depended on by flexunit.framework.Assert
in the SWC C:\jenkins\workspace\flex-flexunit\FlexUnit4\target\flexunit-4.3.0-20140410-as3_4.12.0.swc
could not be found
    [mxmlc] 
    [mxmlc] C:\jenkins\workspace\flex-flexunit\FlexUnit4\target\flexunit-4.3.0-20140410-as3_4.12.0.swc
    [mxmlc] Warning: The definition mx.utils.ObjectUtil depended on by org.flexunit.runner.Description
in the SWC C:\jenkins\workspace\flex-flexunit\FlexUnit4\target\flexunit-4.3.0-20140410-as3_4.12.0.swc
could not be found
    [mxmlc] 
    [mxmlc] Picked up JAVA_TOOL_OPTIONS: -Dfile.encoding=UTF8
    [mxmlc] 129019 bytes written to C:\Jenkins\workspace\flex-asjs\frameworks\projects\Core\as\tests\FlexUnitFlexJSApplication.swf
in 29.249 seconds

test:
 [flexunit] Validating task attributes ...
 [flexunit] Generating default values ...
 [flexunit] Using the following settings for the test run:
 [flexunit] 	FLEX_HOME: [<http://apacheflexbuild.cloudapp.net:8080/job/flex-asjs/ws/]>
 [flexunit] 	haltonfailure: [false]
 [flexunit] 	headless: [false]
 [flexunit] 	display: [99]
 [flexunit] 	localTrusted: [true]
 [flexunit] 	player: [flash]
 [flexunit] 	command: [C:\Program Files (x86)\Mozilla Firefox\firefox.exe]
 [flexunit] 	port: [1024]
 [flexunit] 	swf: [<http://apacheflexbuild.cloudapp.net:8080/job/flex-asjs/ws/frameworks/projects/Core/as/tests/FlexUnitFlexJSApplication.swf]>
 [flexunit] 	timeout: [90000ms]
 [flexunit] 	toDir: [<http://apacheflexbuild.cloudapp.net:8080/job/flex-asjs/ws/frameworks/projects/Core/as/tests/out]>
 [flexunit] Setting up server process ...
 [flexunit] Starting server ...
 [flexunit] Opening server socket on port [1024].
 [flexunit] Waiting for client connection ...
 [flexunit] Entry [<http://apacheflexbuild.cloudapp.net:8080/job/flex-asjs/ws/frameworks/projects/Core/as/tests]>
already available in local trust file at [C:\Users\apacheflexbuild\AppData\Roaming\Macromedia\Flash
Player\#Security\FlashPlayerTrust\flexUnit.cfg].
 [flexunit] Executing 'C:\Program Files (x86)\Mozilla Firefox\firefox.exe' with arguments:
 [flexunit] '<http://apacheflexbuild.cloudapp.net:8080/job/flex-asjs/ws/frameworks/projects/Core/as/tests/FlexUnitFlexJSApplication.swf'>
 [flexunit] 
 [flexunit] The ' characters around the executable and arguments are
 [flexunit] not part of the command.
 [flexunit] 
 [flexunit] 
 [flexunit] Stopping server ...
 [flexunit] End of test data reached, sending acknowledgement to player ...
 [flexunit] Closing client connection ...
 [flexunit] Closing server on port [1024] ...

BUILD FAILED
<http://apacheflexbuild.cloudapp.net:8080/job/flex-asjs/ws/build.xml>:431: The following
error occurred while executing this line:
<http://apacheflexbuild.cloudapp.net:8080/job/flex-asjs/ws/frameworks/build.xml>:79:
The following error occurred while executing this line:
<http://apacheflexbuild.cloudapp.net:8080/job/flex-asjs/ws/frameworks/build.xml>:166:
The following error occurred while executing this line:
<http://apacheflexbuild.cloudapp.net:8080/job/flex-asjs/ws/frameworks/projects/Core/build.xml>:36:
The following error occurred while executing this line:
<http://apacheflexbuild.cloudapp.net:8080/job/flex-asjs/ws/frameworks/projects/Core/as/tests/build.xml>:152:
java.util.concurrent.ExecutionException: Socket timeout waiting for flexunit report
	at java.util.concurrent.FutureTask.report(FutureTask.java:122)
	at java.util.concurrent.FutureTask.get(FutureTask.java:188)
	at org.flexunit.ant.tasks.TestRun.run(Unknown Source)
	at org.flexunit.ant.tasks.FlexUnitTask.execute(Unknown Source)
	at org.apache.tools.ant.UnknownElement.execute(UnknownElement.java:292)
	at sun.reflect.GeneratedMethodAccessor4.invoke(Unknown Source)
	at sun.reflect.DelegatingMethodAccessorImpl.invoke(DelegatingMethodAccessorImpl.java:43)
	at java.lang.reflect.Method.invoke(Method.java:606)
	at org.apache.tools.ant.dispatch.DispatchUtils.execute(DispatchUtils.java:106)
	at org.apache.tools.ant.Task.perform(Task.java:348)
	at org.apache.tools.ant.Target.execute(Target.java:435)
	at org.apache.tools.ant.Target.performTasks(Target.java:456)
	at org.apache.tools.ant.Project.executeSortedTargets(Project.java:1393)
	at org.apache.tools.ant.helper.SingleCheckExecutor.executeTargets(SingleCheckExecutor.java:38)
	at org.apache.tools.ant.Project.executeTargets(Project.java:1248)
	at org.apache.tools.ant.taskdefs.Ant.execute(Ant.java:440)
	at org.apache.tools.ant.UnknownElement.execute(UnknownElement.java:292)
	at sun.reflect.GeneratedMethodAccessor4.invoke(Unknown Source)
	at sun.reflect.DelegatingMethodAccessorImpl.invoke(DelegatingMethodAccessorImpl.java:43)
	at java.lang.reflect.Method.invoke(Method.java:606)
	at org.apache.tools.ant.dispatch.DispatchUtils.execute(DispatchUtils.java:106)
	at org.apache.tools.ant.Task.perform(Task.java:348)
	at org.apache.tools.ant.Target.execute(Target.java:435)
	at org.apache.tools.ant.Target.performTasks(Target.java:456)
	at org.apache.tools.ant.Project.executeSortedTargets(Project.java:1393)
	at org.apache.tools.ant.helper.SingleCheckExecutor.executeTargets(SingleCheckExecutor.java:38)
	at org.apache.tools.ant.Project.executeTargets(Project.java:1248)
	at org.apache.tools.ant.taskdefs.Ant.execute(Ant.java:440)
	at org.apache.tools.ant.UnknownElement.execute(UnknownElement.java:292)
	at sun.reflect.GeneratedMethodAccessor4.invoke(Unknown Source)
	at sun.reflect.DelegatingMethodAccessorImpl.invoke(DelegatingMethodAccessorImpl.java:43)
	at java.lang.reflect.Method.invoke(Method.java:606)
	at org.apache.tools.ant.dispatch.DispatchUtils.execute(DispatchUtils.java:106)
	at org.apache.tools.ant.Task.perform(Task.java:348)
	at org.apache.tools.ant.Target.execute(Target.java:435)
	at org.apache.tools.ant.Target.performTasks(Target.java:456)
	at org.apache.tools.ant.Project.executeSortedTargets(Project.java:1393)
	at org.apache.tools.ant.helper.SingleCheckExecutor.executeTargets(SingleCheckExecutor.java:38)
	at org.apache.tools.ant.Project.executeTargets(Project.java:1248)
	at org.apache.tools.ant.taskdefs.Ant.execute(Ant.java:440)
	at org.apache.tools.ant.taskdefs.CallTarget.execute(CallTarget.java:105)
	at org.apache.tools.ant.UnknownElement.execute(UnknownElement.java:292)
	at sun.reflect.GeneratedMethodAccessor4.invoke(Unknown Source)
	at sun.reflect.DelegatingMethodAccessorImpl.invoke(DelegatingMethodAccessorImpl.java:43)
	at java.lang.reflect.Method.invoke(Method.java:606)
	at org.apache.tools.ant.dispatch.DispatchUtils.execute(DispatchUtils.java:106)
	at org.apache.tools.ant.Task.perform(Task.java:348)
	at org.apache.tools.ant.Target.execute(Target.java:435)
	at org.apache.tools.ant.Target.performTasks(Target.java:456)
	at org.apache.tools.ant.Project.executeSortedTargets(Project.java:1393)
	at org.apache.tools.ant.helper.SingleCheckExecutor.executeTargets(SingleCheckExecutor.java:38)
	at org.apache.tools.ant.Project.executeTargets(Project.java:1248)
	at org.apache.tools.ant.taskdefs.Ant.execute(Ant.java:440)
	at org.apache.tools.ant.UnknownElement.execute(UnknownElement.java:292)
	at sun.reflect.GeneratedMethodAccessor4.invoke(Unknown Source)
	at sun.reflect.DelegatingMethodAccessorImpl.invoke(DelegatingMethodAccessorImpl.java:43)
	at java.lang.reflect.Method.invoke(Method.java:606)
	at org.apache.tools.ant.dispatch.DispatchUtils.execute(DispatchUtils.java:106)
	at org.apache.tools.ant.Task.perform(Task.java:348)
	at org.apache.tools.ant.Target.execute(Target.java:435)
	at org.apache.tools.ant.Target.performTasks(Target.java:456)
	at org.apache.tools.ant.Project.executeSortedTargets(Project.java:1393)
	at org.apache.tools.ant.Project.executeTarget(Project.java:1364)
	at org.apache.tools.ant.helper.DefaultExecutor.executeTargets(DefaultExecutor.java:41)
	at org.apache.tools.ant.Project.executeTargets(Project.java:1248)
	at org.apache.tools.ant.Main.runBuild(Main.java:851)
	at org.apache.tools.ant.Main.startAnt(Main.java:235)
	at org.apache.tools.ant.launch.Launcher.run(Launcher.java:280)
	at org.apache.tools.ant.launch.Launcher.main(Launcher.java:109)
Caused by: Socket timeout waiting for flexunit report
	at org.flexunit.ant.FlexUnitSocketServer.start(Unknown Source)
	at org.flexunit.ant.FlexUnitSocketThread.call(Unknown Source)
	at java.util.concurrent.FutureTask.run(FutureTask.java:262)
	at java.util.concurrent.ThreadPoolExecutor.runWorker(ThreadPoolExecutor.java:1145)
	at java.util.concurrent.ThreadPoolExecutor$Worker.run(ThreadPoolExecutor.java:615)
	at java.lang.Thread.run(Thread.java:745)
Caused by: java.net.SocketTimeoutException: Accept timed out
	at java.net.DualStackPlainSocketImpl.waitForNewConnection(Native Method)
	at java.net.DualStackPlainSocketImpl.socketAccept(DualStackPlainSocketImpl.java:135)
	at java.net.AbstractPlainSocketImpl.accept(AbstractPlainSocketImpl.java:398)
	at java.net.PlainSocketImpl.accept(PlainSocketImpl.java:198)
	at java.net.ServerSocket.implAccept(ServerSocket.java:530)
	at java.net.ServerSocket.accept(ServerSocket.java:498)
	at org.flexunit.ant.FlexUnitSocketServer.openClientSocket(Unknown Source)
	... 6 more

Total time: 5 minutes 3 seconds
Picked up JAVA_TOOL_OPTIONS: -Dfile.encoding=UTF8
Build step 'Invoke Ant' marked build as failure
Skipped archiving because build is not successful

Mime
View raw message