flex-commits mailing list archives

Site index · List index
Message view « Date » · « Thread »
Top « Date » · « Thread »
From flex.ci.bui...@gmail.com
Subject Build failed in Jenkins: flex-asjs #801
Date Fri, 20 Nov 2015 01:29:52 GMT
See <http://apacheflexbuild.cloudapp.net:8080/job/flex-asjs/801/>

------------------------------------------
[...truncated 668 lines...]
 [flexunit] Setting inbound buffer size to [262144] bytes.
 [flexunit] Receiving data ...
 [flexunit] Sending acknowledgement to player to start sending test data ...
 [flexunit] 
 [flexunit] 
 [flexunit] Stopping server ...
 [flexunit] End of test data reached, sending acknowledgement to player ...
 [flexunit] Closing client connection ...
 [flexunit] Closing server on port [1024] ...
 [flexunit] Analyzing reports ...
 [flexunit] 
 [flexunit] Suite: flexUnitTests.StrandTesterTest
 [flexunit] Tests run: 1, Failures: 0, Errors: 0, Skipped: 0, Time elapsed: 0.488 sec
 [flexunit] 
 [flexunit] Results :
 [flexunit] 
 [flexunit] Tests run: 1, Failures: 0, Errors: 0, Skipped: 0, Time elapsed: 0.488 sec
 [flexunit] 
[junitreport] Processing <http://apacheflexbuild.cloudapp.net:8080/job/flex-asjs/ws/frameworks/projects/Core/as/tests/out/TESTS-TestSuites.xml>
to C:\Users\APACHE~1\AppData\Local\Temp\2\null131554873
[junitreport] Loading stylesheet jar:file:/C:/Jenkins/tools/hudson.tasks.Ant_AntInstallation/c_apache-ant-1.9.3/lib/ant-junit.jar!/org/apache/tools/ant/taskdefs/optional/junit/xsl/junit-frames.xsl
[junitreport] Transform time: 2948ms
[junitreport] Deleting: C:\Users\APACHE~1\AppData\Local\Temp\2\null131554873

main:

main:

Graphics:

clean:

compile:
     [echo] Compiling libs/Graphics.swc
     [echo] FLEX_HOME: <http://apacheflexbuild.cloudapp.net:8080/job/flex-asjs/ws/>
     [echo] FALCON_HOME: <http://apacheflexbuild.cloudapp.net:8080/job/flex-asjs/ws/../flex-falcon/compiler/generated/dist/sdk>
    [compc] Loading configuration: <http://apacheflexbuild.cloudapp.net:8080/job/flex-asjs/ws/frameworks/projects/Graphics/compile-config.xml>
    [compc] 
    [compc] 103030 bytes written to C:\Jenkins\workspace\flex-asjs\frameworks\libs\Graphics.swc
in 29.649 seconds
    [compc] Picked up JAVA_TOOL_OPTIONS: -Dfile.encoding=UTF8

test:

main:

Binding:

clean:

compile:
     [echo] Compiling libs/Binding.swc
     [echo] FLEX_HOME: <http://apacheflexbuild.cloudapp.net:8080/job/flex-asjs/ws/>
     [echo] FALCON_HOME: <http://apacheflexbuild.cloudapp.net:8080/job/flex-asjs/ws/../flex-falcon/compiler/generated/dist/sdk>
    [compc] Loading configuration: <http://apacheflexbuild.cloudapp.net:8080/job/flex-asjs/ws/frameworks/projects/Binding/compile-config.xml>
    [compc] 
    [compc] 64250 bytes written to C:\Jenkins\workspace\flex-asjs\frameworks\libs\Binding.swc
in 15.753 seconds
    [compc] Picked up JAVA_TOOL_OPTIONS: -Dfile.encoding=UTF8

test:

main:

Collections:

clean:

compile:
     [echo] Compiling libs/Collections.swc
     [echo] FLEX_HOME: <http://apacheflexbuild.cloudapp.net:8080/job/flex-asjs/ws/>
     [echo] FALCON_HOME: <http://apacheflexbuild.cloudapp.net:8080/job/flex-asjs/ws/../flex-falcon/compiler/generated/dist/sdk>
    [compc] Loading configuration: <http://apacheflexbuild.cloudapp.net:8080/job/flex-asjs/ws/frameworks/projects/Collections/compile-config.xml>
    [compc] 
    [compc] 19502 bytes written to C:\Jenkins\workspace\flex-asjs\frameworks\libs\Collections.swc
in 10.277 seconds
    [compc] Picked up JAVA_TOOL_OPTIONS: -Dfile.encoding=UTF8

test:

main:

HTML:

clean:

compile:
     [echo] Compiling libs/HTML.swc
     [echo] FLEX_HOME: <http://apacheflexbuild.cloudapp.net:8080/job/flex-asjs/ws/>
     [echo] FALCON_HOME: <http://apacheflexbuild.cloudapp.net:8080/job/flex-asjs/ws/../flex-falcon/compiler/generated/dist/sdk>
    [compc] Loading configuration: <http://apacheflexbuild.cloudapp.net:8080/job/flex-asjs/ws/frameworks/projects/HTML/compile-config.xml>
    [compc] 
    [compc] 578782 bytes written to C:\Jenkins\workspace\flex-asjs\frameworks\libs\HTML.swc
in 59.316 seconds
    [compc] Picked up JAVA_TOOL_OPTIONS: -Dfile.encoding=UTF8

test:
[available] DEPRECATED - <available> used to override an existing property.
[available]   Build file should not reuse the same property name for different values.

clean:

compile:
     [echo] Compiling FlexUnitFlexJSApplication.swf
     [echo] FLEX_HOME: <http://apacheflexbuild.cloudapp.net:8080/job/flex-asjs/ws/>
     [echo] FALCON_HOME: <http://apacheflexbuild.cloudapp.net:8080/job/flex-asjs/ws/../flex-falcon/compiler/generated/dist/sdk>
     [echo] FLEXUNIT_HOME: C:\jenkins\workspace\flex-flexunit
     [echo] playerglobal.version: 11.7
    [mxmlc] Loading configuration: <http://apacheflexbuild.cloudapp.net:8080/job/flex-asjs/ws/frameworks/flex-config.xml>
    [mxmlc] 
    [mxmlc] 135841 bytes written to C:\Jenkins\workspace\flex-asjs\frameworks\projects\HTML\asjs\tests\FlexUnitFlexJSApplication.swf
in 32.336 seconds
    [mxmlc] C:\jenkins\workspace\flex-flexunit\FlexUnit4\target\flexunit-4.3.0-20140410-as3_4.12.0.swc
    [mxmlc] Warning: The definition mx.utils.StringUtil depended on by flexunit.framework.AsyncTestHelper
in the SWC C:\jenkins\workspace\flex-flexunit\FlexUnit4\target\flexunit-4.3.0-20140410-as3_4.12.0.swc
could not be found
    [mxmlc] 
    [mxmlc] C:\jenkins\workspace\flex-flexunit\FlexUnit4\target\flexunit-4.3.0-20140410-as3_4.12.0.swc
    [mxmlc] Warning: The definition mx.utils.ObjectUtil depended on by flexunit.framework.Assert
in the SWC C:\jenkins\workspace\flex-flexunit\FlexUnit4\target\flexunit-4.3.0-20140410-as3_4.12.0.swc
could not be found
    [mxmlc] 
    [mxmlc] C:\jenkins\workspace\flex-flexunit\FlexUnit4\target\flexunit-4.3.0-20140410-as3_4.12.0.swc
    [mxmlc] Warning: The definition mx.utils.StringUtil depended on by flexunit.framework.Assert
in the SWC C:\jenkins\workspace\flex-flexunit\FlexUnit4\target\flexunit-4.3.0-20140410-as3_4.12.0.swc
could not be found
    [mxmlc] 
    [mxmlc] C:\jenkins\workspace\flex-flexunit\FlexUnit4\target\flexunit-4.3.0-20140410-as3_4.12.0.swc
    [mxmlc] Warning: The definition mx.utils.ObjectUtil depended on by org.flexunit.runner.Description
in the SWC C:\jenkins\workspace\flex-flexunit\FlexUnit4\target\flexunit-4.3.0-20140410-as3_4.12.0.swc
could not be found
    [mxmlc] 
    [mxmlc] Picked up JAVA_TOOL_OPTIONS: -Dfile.encoding=UTF8

test:
 [flexunit] Validating task attributes ...
 [flexunit] Generating default values ...
 [flexunit] Using the following settings for the test run:
 [flexunit] 	FLEX_HOME: [<http://apacheflexbuild.cloudapp.net:8080/job/flex-asjs/ws/]>
 [flexunit] 	haltonfailure: [false]
 [flexunit] 	headless: [false]
 [flexunit] 	display: [99]
 [flexunit] 	localTrusted: [true]
 [flexunit] 	player: [flash]
 [flexunit] 	command: [C:\Program Files (x86)\Mozilla Firefox\firefox.exe]
 [flexunit] 	port: [1024]
 [flexunit] 	swf: [<http://apacheflexbuild.cloudapp.net:8080/job/flex-asjs/ws/frameworks/projects/HTML/asjs/tests/FlexUnitFlexJSApplication.swf]>
 [flexunit] 	timeout: [90000ms]
 [flexunit] 	toDir: [<http://apacheflexbuild.cloudapp.net:8080/job/flex-asjs/ws/frameworks/projects/HTML/asjs/tests/out]>
 [flexunit] Setting up server process ...
 [flexunit] Entry [<http://apacheflexbuild.cloudapp.net:8080/job/flex-asjs/ws/frameworks/projects/HTML/asjs/tests]>
already available in local trust file at [C:\Users\apacheflexbuild\AppData\Roaming\Macromedia\Flash
Player\#Security\FlashPlayerTrust\flexUnit.cfg].
 [flexunit] Executing 'C:\Program Files (x86)\Mozilla Firefox\firefox.exe' with arguments:
 [flexunit] '<http://apacheflexbuild.cloudapp.net:8080/job/flex-asjs/ws/frameworks/projects/HTML/asjs/tests/FlexUnitFlexJSApplication.swf'>
 [flexunit] 
 [flexunit] The ' characters around the executable and arguments are
 [flexunit] not part of the command.
 [flexunit] 
 [flexunit] Starting server ...
 [flexunit] Opening server socket on port [1024].
 [flexunit] Waiting for client connection ...
 [flexunit] 
 [flexunit] Stopping server ...
 [flexunit] End of test data reached, sending acknowledgement to player ...
 [flexunit] Closing client connection ...
 [flexunit] Closing server on port [1024] ...

BUILD FAILED
<http://apacheflexbuild.cloudapp.net:8080/job/flex-asjs/ws/build.xml>:431: The following
error occurred while executing this line:
<http://apacheflexbuild.cloudapp.net:8080/job/flex-asjs/ws/frameworks/build.xml>:83:
The following error occurred while executing this line:
<http://apacheflexbuild.cloudapp.net:8080/job/flex-asjs/ws/frameworks/build.xml>:261:
The following error occurred while executing this line:
<http://apacheflexbuild.cloudapp.net:8080/job/flex-asjs/ws/frameworks/projects/HTML/build.xml>:47:
The following error occurred while executing this line:
<http://apacheflexbuild.cloudapp.net:8080/job/flex-asjs/ws/frameworks/projects/HTML/asjs/tests/build.xml>:146:
java.util.concurrent.ExecutionException: Socket timeout waiting for flexunit report
	at java.util.concurrent.FutureTask.report(FutureTask.java:122)
	at java.util.concurrent.FutureTask.get(FutureTask.java:188)
	at org.flexunit.ant.tasks.TestRun.run(Unknown Source)
	at org.flexunit.ant.tasks.FlexUnitTask.execute(Unknown Source)
	at org.apache.tools.ant.UnknownElement.execute(UnknownElement.java:292)
	at sun.reflect.GeneratedMethodAccessor4.invoke(Unknown Source)
	at sun.reflect.DelegatingMethodAccessorImpl.invoke(DelegatingMethodAccessorImpl.java:43)
	at java.lang.reflect.Method.invoke(Method.java:606)
	at org.apache.tools.ant.dispatch.DispatchUtils.execute(DispatchUtils.java:106)
	at org.apache.tools.ant.Task.perform(Task.java:348)
	at org.apache.tools.ant.Target.execute(Target.java:435)
	at org.apache.tools.ant.Target.performTasks(Target.java:456)
	at org.apache.tools.ant.Project.executeSortedTargets(Project.java:1393)
	at org.apache.tools.ant.helper.SingleCheckExecutor.executeTargets(SingleCheckExecutor.java:38)
	at org.apache.tools.ant.Project.executeTargets(Project.java:1248)
	at org.apache.tools.ant.taskdefs.Ant.execute(Ant.java:440)
	at org.apache.tools.ant.UnknownElement.execute(UnknownElement.java:292)
	at sun.reflect.GeneratedMethodAccessor4.invoke(Unknown Source)
	at sun.reflect.DelegatingMethodAccessorImpl.invoke(DelegatingMethodAccessorImpl.java:43)
	at java.lang.reflect.Method.invoke(Method.java:606)
	at org.apache.tools.ant.dispatch.DispatchUtils.execute(DispatchUtils.java:106)
	at org.apache.tools.ant.Task.perform(Task.java:348)
	at org.apache.tools.ant.Target.execute(Target.java:435)
	at org.apache.tools.ant.Target.performTasks(Target.java:456)
	at org.apache.tools.ant.Project.executeSortedTargets(Project.java:1393)
	at org.apache.tools.ant.helper.SingleCheckExecutor.executeTargets(SingleCheckExecutor.java:38)
	at org.apache.tools.ant.Project.executeTargets(Project.java:1248)
	at org.apache.tools.ant.taskdefs.Ant.execute(Ant.java:440)
	at org.apache.tools.ant.UnknownElement.execute(UnknownElement.java:292)
	at sun.reflect.GeneratedMethodAccessor4.invoke(Unknown Source)
	at sun.reflect.DelegatingMethodAccessorImpl.invoke(DelegatingMethodAccessorImpl.java:43)
	at java.lang.reflect.Method.invoke(Method.java:606)
	at org.apache.tools.ant.dispatch.DispatchUtils.execute(DispatchUtils.java:106)
	at org.apache.tools.ant.Task.perform(Task.java:348)
	at org.apache.tools.ant.Target.execute(Target.java:435)
	at org.apache.tools.ant.Target.performTasks(Target.java:456)
	at org.apache.tools.ant.Project.executeSortedTargets(Project.java:1393)
	at org.apache.tools.ant.helper.SingleCheckExecutor.executeTargets(SingleCheckExecutor.java:38)
	at org.apache.tools.ant.Project.executeTargets(Project.java:1248)
	at org.apache.tools.ant.taskdefs.Ant.execute(Ant.java:440)
	at org.apache.tools.ant.taskdefs.CallTarget.execute(CallTarget.java:105)
	at org.apache.tools.ant.UnknownElement.execute(UnknownElement.java:292)
	at sun.reflect.GeneratedMethodAccessor4.invoke(Unknown Source)
	at sun.reflect.DelegatingMethodAccessorImpl.invoke(DelegatingMethodAccessorImpl.java:43)
	at java.lang.reflect.Method.invoke(Method.java:606)
	at org.apache.tools.ant.dispatch.DispatchUtils.execute(DispatchUtils.java:106)
	at org.apache.tools.ant.Task.perform(Task.java:348)
	at org.apache.tools.ant.Target.execute(Target.java:435)
	at org.apache.tools.ant.Target.performTasks(Target.java:456)
	at org.apache.tools.ant.Project.executeSortedTargets(Project.java:1393)
	at org.apache.tools.ant.helper.SingleCheckExecutor.executeTargets(SingleCheckExecutor.java:38)
	at org.apache.tools.ant.Project.executeTargets(Project.java:1248)
	at org.apache.tools.ant.taskdefs.Ant.execute(Ant.java:440)
	at org.apache.tools.ant.UnknownElement.execute(UnknownElement.java:292)
	at sun.reflect.GeneratedMethodAccessor4.invoke(Unknown Source)
	at sun.reflect.DelegatingMethodAccessorImpl.invoke(DelegatingMethodAccessorImpl.java:43)
	at java.lang.reflect.Method.invoke(Method.java:606)
	at org.apache.tools.ant.dispatch.DispatchUtils.execute(DispatchUtils.java:106)
	at org.apache.tools.ant.Task.perform(Task.java:348)
	at org.apache.tools.ant.Target.execute(Target.java:435)
	at org.apache.tools.ant.Target.performTasks(Target.java:456)
	at org.apache.tools.ant.Project.executeSortedTargets(Project.java:1393)
	at org.apache.tools.ant.Project.executeTarget(Project.java:1364)
	at org.apache.tools.ant.helper.DefaultExecutor.executeTargets(DefaultExecutor.java:41)
	at org.apache.tools.ant.Project.executeTargets(Project.java:1248)
	at org.apache.tools.ant.Main.runBuild(Main.java:851)
	at org.apache.tools.ant.Main.startAnt(Main.java:235)
	at org.apache.tools.ant.launch.Launcher.run(Launcher.java:280)
	at org.apache.tools.ant.launch.Launcher.main(Launcher.java:109)
Caused by: Socket timeout waiting for flexunit report
	at org.flexunit.ant.FlexUnitSocketServer.start(Unknown Source)
	at org.flexunit.ant.FlexUnitSocketThread.call(Unknown Source)
	at java.util.concurrent.FutureTask.run(FutureTask.java:262)
	at java.util.concurrent.ThreadPoolExecutor.runWorker(ThreadPoolExecutor.java:1145)
	at java.util.concurrent.ThreadPoolExecutor$Worker.run(ThreadPoolExecutor.java:615)
	at java.lang.Thread.run(Thread.java:745)
Caused by: java.net.SocketTimeoutException: Accept timed out
	at java.net.DualStackPlainSocketImpl.waitForNewConnection(Native Method)
	at java.net.DualStackPlainSocketImpl.socketAccept(DualStackPlainSocketImpl.java:135)
	at java.net.AbstractPlainSocketImpl.accept(AbstractPlainSocketImpl.java:398)
	at java.net.PlainSocketImpl.accept(PlainSocketImpl.java:198)
	at java.net.ServerSocket.implAccept(ServerSocket.java:530)
	at java.net.ServerSocket.accept(ServerSocket.java:498)
	at org.flexunit.ant.FlexUnitSocketServer.openClientSocket(Unknown Source)
	... 6 more

Total time: 6 minutes 25 seconds
Picked up JAVA_TOOL_OPTIONS: -Dfile.encoding=UTF8
Process leaked file descriptors. See http://wiki.jenkins-ci.org/display/JENKINS/Spawning+processes+from+build
for more information
Build step 'Invoke Ant' marked build as failure
Skipped archiving because build is not successful

Mime
View raw message