flex-commits mailing list archives

Site index · List index
Message view « Date » · « Thread »
Top « Date » · « Thread »
From flex.ci.bui...@gmail.com
Subject Build failed in Jenkins: flex-falcon #658
Date Thu, 29 Oct 2015 05:03:29 GMT
See <http://apacheflexbuild.cloudapp.net:8080/job/flex-falcon/658/>

------------------------------------------
[...truncated 146 lines...]
     [copy] Copying 238 files to <http://apacheflexbuild.cloudapp.net:8080/job/flex-falcon/ws/temp/debugger>
     [copy] Copying 98 files to <http://apacheflexbuild.cloudapp.net:8080/job/flex-falcon/ws/temp/flex-compiler-oem>
    [mkdir] Created dir: <http://apacheflexbuild.cloudapp.net:8080/job/flex-falcon/ws/temp/swfutils>
     [copy] Copying 150 files to <http://apacheflexbuild.cloudapp.net:8080/job/flex-falcon/ws/temp/swfutils>

stage-externs:
     [copy] Copying 12 files to <http://apacheflexbuild.cloudapp.net:8080/job/flex-falcon/ws/temp/externs>

bin-legacy:
    [mkdir] Created dir: <http://apacheflexbuild.cloudapp.net:8080/job/flex-falcon/ws/compiler/generated/dist/sdk/bin-legacy>
     [copy] Copying 30 files to <http://apacheflexbuild.cloudapp.net:8080/job/flex-falcon/ws/compiler/generated/dist/sdk/bin-legacy>

set.flex.config.xml.available:

stage.sdk:
     [echo] Copying SDK
     [copy] Copying 14 files to <http://apacheflexbuild.cloudapp.net:8080/job/flex-falcon/ws/compiler/generated/dist/sdk/bin>
    [mkdir] Created dir: <http://apacheflexbuild.cloudapp.net:8080/job/flex-falcon/ws/compiler/generated/dist/sdk/frameworks>
     [copy] Copying 1 file to <http://apacheflexbuild.cloudapp.net:8080/job/flex-falcon/ws/compiler/generated/dist/sdk/frameworks>
    [mkdir] Created dir: <http://apacheflexbuild.cloudapp.net:8080/job/flex-falcon/ws/temp/compiler/generated/dist/sdk>
     [copy] Copying 45 files to <http://apacheflexbuild.cloudapp.net:8080/job/flex-falcon/ws/temp/compiler/generated/dist/sdk>
     [copy] Copied 4 empty directories to 1 empty directory under <http://apacheflexbuild.cloudapp.net:8080/job/flex-falcon/ws/temp/compiler/generated/dist/sdk>

source-package-zip:
    [mkdir] Created dir: <http://apacheflexbuild.cloudapp.net:8080/job/flex-falcon/ws/out>
      [zip] Building zip: <http://apacheflexbuild.cloudapp.net:8080/job/flex-falcon/658/artifact/out/apache-flex-falcon-0.5.0-src.zip>

source-package-tgz:
      [tar] Building tar: <http://apacheflexbuild.cloudapp.net:8080/job/flex-falcon/658/artifact/out/apache-flex-falcon-0.5.0-src.tar.gz>

stage-source-jx:
     [copy] Copying 1 file to <http://apacheflexbuild.cloudapp.net:8080/job/flex-falcon/ws/temp>
     [copy] Copying 1 file to <http://apacheflexbuild.cloudapp.net:8080/job/flex-falcon/ws/temp>
     [copy] Copying 4 files to <http://apacheflexbuild.cloudapp.net:8080/job/flex-falcon/ws/temp>
     [copy] Copying 188 files to <http://apacheflexbuild.cloudapp.net:8080/job/flex-falcon/ws/temp/compiler.jx>
     [copy] Copying 234 files to <http://apacheflexbuild.cloudapp.net:8080/job/flex-falcon/ws/temp/compiler.jx.tests>
    [mkdir] Created dir: <http://apacheflexbuild.cloudapp.net:8080/job/flex-falcon/ws/temp/externs/GCL/src>
     [copy] Copying 14 files to <http://apacheflexbuild.cloudapp.net:8080/job/flex-falcon/ws/temp/externs/GCL/src>

source-package-jx-zip:
      [zip] Building zip: <http://apacheflexbuild.cloudapp.net:8080/job/flex-falcon/658/artifact/out/apache-flex-falconjx-0.5.0-src.zip>

source-package-jx-tgz:
      [tar] Building tar: <http://apacheflexbuild.cloudapp.net:8080/job/flex-falcon/658/artifact/out/apache-flex-falconjx-0.5.0-src.tar.gz>

source-package:

source-release:

setup-binary-release:

compiler.binary.release:

release-binaries:

download:

prepare:
     [echo] Making lib directory <http://apacheflexbuild.cloudapp.net:8080/job/flex-falcon/ws/compiler/lib>
    [mkdir] Created dir: <http://apacheflexbuild.cloudapp.net:8080/job/flex-falcon/ws/compiler/lib>

all:

check-dependency:

download-dependency:

echo-project-jar:

download-apache-license:

download-other-license:
      [get] Getting: http://www.antlr.org/license.html
      [get] To: <http://apacheflexbuild.cloudapp.net:8080/job/flex-falcon/ws/compiler/lib/antlr-LICENSE.html>

download-dependency-jar:

check-cache:

download-jar:

get-if-not-cached:
      [get] Getting: http://search.maven.org/remotecontent?filepath=/org/antlr/antlr-complete/3.5.2/antlr-complete-3.5.2.jar
      [get] To: <http://apacheflexbuild.cloudapp.net:8080/job/flex-falcon/ws/compiler/lib/antlr.jar>
      [get] http://search.maven.org/remotecontent?filepath=/org/antlr/antlr-complete/3.5.2/antlr-complete-3.5.2.jar
moved to https://repo1.maven.org/maven2//org/antlr/antlr-complete/3.5.2/antlr-complete-3.5.2.jar

check-sum:

put-in-cache:

copy-if-cached:

download-dependency-zip:

check-dependency:

download-dependency:

echo-project-jar:

download-apache-license:

download-other-license:

download-dependency-jar:

download-dependency-zip:

check-cache:

download-zip:
    [mkdir] Created dir: <http://apacheflexbuild.cloudapp.net:8080/job/flex-falcon/ws/compiler/in>

get-if-not-cached:
      [get] Getting: http://archive.apache.org/dist/commons/cli/binaries/commons-cli-1.2-bin.tar.gz
      [get] To: <http://apacheflexbuild.cloudapp.net:8080/job/flex-falcon/ws/compiler/in/commons-cli-1.2-bin.tar.gz>

check-sum:

put-in-cache:

copy-if-cached:

untar-file:
    [untar] Expanding: <http://apacheflexbuild.cloudapp.net:8080/job/flex-falcon/ws/compiler/in/commons-cli-1.2-bin.tar.gz>
into <http://apacheflexbuild.cloudapp.net:8080/job/flex-falcon/ws/compiler/in/temp>

unzip-file:

copy-downloaded-jar:
     [copy] Copying 1 file to <http://apacheflexbuild.cloudapp.net:8080/job/flex-falcon/ws/compiler/lib>
     [copy] Copying <http://apacheflexbuild.cloudapp.net:8080/job/flex-falcon/ws/compiler/in/temp/commons-cli-1.2/commons-cli-1.2.jar>
to <http://apacheflexbuild.cloudapp.net:8080/job/flex-falcon/ws/compiler/lib/commons-cli.jar>
     [copy] Copying 1 file to <http://apacheflexbuild.cloudapp.net:8080/job/flex-falcon/ws/compiler/lib>

check-dependency:

download-dependency:

echo-project-jar:

download-apache-license:

download-other-license:

download-dependency-jar:

download-dependency-zip:

check-cache:

download-zip:

get-if-not-cached:
      [get] Getting: http://archive.apache.org/dist/commons/io/binaries/commons-io-2.4-bin.tar.gz
      [get] To: <http://apacheflexbuild.cloudapp.net:8080/job/flex-falcon/ws/compiler/in/commons-io-2.4-bin.tar.gz>

check-sum:

put-in-cache:

copy-if-cached:

untar-file:
    [untar] Expanding: <http://apacheflexbuild.cloudapp.net:8080/job/flex-falcon/ws/compiler/in/commons-io-2.4-bin.tar.gz>
into <http://apacheflexbuild.cloudapp.net:8080/job/flex-falcon/ws/compiler/in/temp>

unzip-file:

copy-downloaded-jar:
     [copy] Copying 1 file to <http://apacheflexbuild.cloudapp.net:8080/job/flex-falcon/ws/compiler/lib>
     [copy] Copying <http://apacheflexbuild.cloudapp.net:8080/job/flex-falcon/ws/compiler/in/temp/commons-io-2.4/commons-io-2.4.jar>
to <http://apacheflexbuild.cloudapp.net:8080/job/flex-falcon/ws/compiler/lib/commons-io.jar>
     [copy] Copying 1 file to <http://apacheflexbuild.cloudapp.net:8080/job/flex-falcon/ws/compiler/lib>

check-dependency:

download-dependency:

echo-project-jar:

download-apache-license:
      [get] Getting: http://www.apache.org/licenses/LICENSE-2.0
      [get] To: <http://apacheflexbuild.cloudapp.net:8080/job/flex-falcon/ws/compiler/lib/guava-LICENSE.html>
      [get] Error getting http://www.apache.org/licenses/LICENSE-2.0 to <http://apacheflexbuild.cloudapp.net:8080/job/flex-falcon/ws/compiler/lib/guava-LICENSE.html>

BUILD FAILED
<http://apacheflexbuild.cloudapp.net:8080/job/flex-falcon/ws/build.xml>:78: The following
error occurred while executing this line:
<http://apacheflexbuild.cloudapp.net:8080/job/flex-falcon/ws/compiler/build.xml>:901:
The following error occurred while executing this line:
<http://apacheflexbuild.cloudapp.net:8080/job/flex-falcon/ws/compiler/build.xml>:232:
The following error occurred while executing this line:
<http://apacheflexbuild.cloudapp.net:8080/job/flex-falcon/ws/compiler/downloads.xml>:132:
The following error occurred while executing this line:
<http://apacheflexbuild.cloudapp.net:8080/job/flex-falcon/ws/compiler/downloads.xml>:278:
The following error occurred while executing this line:
<http://apacheflexbuild.cloudapp.net:8080/job/flex-falcon/ws/compiler/downloads.xml>:312:
java.net.ConnectException: Connection timed out: connect
	at java.net.DualStackPlainSocketImpl.connect0(Native Method)
	at java.net.DualStackPlainSocketImpl.socketConnect(DualStackPlainSocketImpl.java:79)
	at java.net.AbstractPlainSocketImpl.doConnect(AbstractPlainSocketImpl.java:339)
	at java.net.AbstractPlainSocketImpl.connectToAddress(AbstractPlainSocketImpl.java:200)
	at java.net.AbstractPlainSocketImpl.connect(AbstractPlainSocketImpl.java:182)
	at java.net.PlainSocketImpl.connect(PlainSocketImpl.java:172)
	at java.net.SocksSocketImpl.connect(SocksSocketImpl.java:392)
	at java.net.Socket.connect(Socket.java:579)
	at java.net.Socket.connect(Socket.java:528)
	at sun.net.NetworkClient.doConnect(NetworkClient.java:180)
	at sun.net.www.http.HttpClient.openServer(HttpClient.java:432)
	at sun.net.www.http.HttpClient.openServer(HttpClient.java:527)
	at sun.net.www.http.HttpClient.<init>(HttpClient.java:211)
	at sun.net.www.http.HttpClient.New(HttpClient.java:308)
	at sun.net.www.http.HttpClient.New(HttpClient.java:326)
	at sun.net.www.protocol.http.HttpURLConnection.getNewHttpClient(HttpURLConnection.java:996)
	at sun.net.www.protocol.http.HttpURLConnection.plainConnect(HttpURLConnection.java:932)
	at sun.net.www.protocol.http.HttpURLConnection.connect(HttpURLConnection.java:850)
	at org.apache.tools.ant.taskdefs.Get$GetThread.openConnection(Get.java:690)
	at org.apache.tools.ant.taskdefs.Get$GetThread.get(Get.java:606)
	at org.apache.tools.ant.taskdefs.Get$GetThread.run(Get.java:596)

Total time: 3 minutes 11 seconds
Picked up JAVA_TOOL_OPTIONS: -Dfile.encoding=UTF8
Build step 'Invoke Ant' marked build as failure
Skipped archiving because build is not successful
Recording test results
ERROR: Publisher hudson.tasks.junit.JUnitResultArchiver aborted due to exception
hudson.AbortException: No test report files were found. Configuration error?
	at hudson.tasks.junit.JUnitParser$ParseResultCallable.invoke(JUnitParser.java:116)
	at hudson.tasks.junit.JUnitParser$ParseResultCallable.invoke(JUnitParser.java:93)
	at hudson.FilePath$FileCallableWrapper.call(FilePath.java:2677)
	at hudson.remoting.UserRequest.perform(UserRequest.java:121)
	at hudson.remoting.UserRequest.perform(UserRequest.java:49)
	at hudson.remoting.Request$2.run(Request.java:324)
	at hudson.remoting.InterceptingExecutorService$1.call(InterceptingExecutorService.java:68)
	at java.util.concurrent.FutureTask.run(Unknown Source)
	at java.util.concurrent.ThreadPoolExecutor.runWorker(Unknown Source)
	at java.util.concurrent.ThreadPoolExecutor$Worker.run(Unknown Source)
	at hudson.remoting.Engine$1$1.run(Engine.java:63)
	at java.lang.Thread.run(Unknown Source)
	at ......remote call to flex_sdk_slave2(Native Method)
	at hudson.remoting.Channel.attachCallSiteStackTrace(Channel.java:1356)
	at hudson.remoting.UserResponse.retrieve(UserRequest.java:221)
	at hudson.remoting.Channel.call(Channel.java:752)
	at hudson.FilePath.act(FilePath.java:970)
	at hudson.FilePath.act(FilePath.java:959)
	at hudson.tasks.junit.JUnitParser.parseResult(JUnitParser.java:90)
	at hudson.tasks.junit.JUnitResultArchiver.parse(JUnitResultArchiver.java:120)
	at hudson.tasks.junit.JUnitResultArchiver.perform(JUnitResultArchiver.java:137)
	at hudson.tasks.BuildStepCompatibilityLayer.perform(BuildStepCompatibilityLayer.java:74)
	at hudson.tasks.BuildStepMonitor$1.perform(BuildStepMonitor.java:20)
	at hudson.model.AbstractBuild$AbstractBuildExecution.perform(AbstractBuild.java:770)
	at hudson.model.AbstractBuild$AbstractBuildExecution.performAllBuildSteps(AbstractBuild.java:734)
	at hudson.model.Build$BuildExecution.post2(Build.java:183)
	at hudson.model.AbstractBuild$AbstractBuildExecution.post(AbstractBuild.java:683)
	at hudson.model.Run.execute(Run.java:1784)
	at hudson.model.FreeStyleBuild.run(FreeStyleBuild.java:43)
	at hudson.model.ResourceController.execute(ResourceController.java:89)
	at hudson.model.Executor.run(Executor.java:240)

Mime
View raw message