flex-commits mailing list archives

Site index · List index
Message view « Date » · « Thread »
Top « Date » · « Thread »
From flex.ci.bui...@gmail.com
Subject Build failed in Jenkins: flex-asjs #752
Date Thu, 22 Oct 2015 02:00:16 GMT
See <http://apacheflexbuild.cloudapp.net:8080/job/flex-asjs/752/>

------------------------------------------
[...truncated 523 lines...]
frameworks-as:

check-compile-env:

check-playerglobal-home:

check-air-home:

check-falcon-home:

check-falconjx-home:

check-compile-env:
     [echo] OS: Windows Server 2008 R2 / 6.1 / amd64
     [echo] VM: Java HotSpot(TM) 64-Bit Server VM / 24.55-b03
     [echo] Java: 1.7.0_55
     [echo] Ant: Apache Ant(TM) version 1.9.3 compiled on December 23 2013 Ant Java Version:
1.7

clean:

clean:

clean:

clean:

clean:

clean:

clean:

clean:

clean:

clean:

clean:

clean:

clean:

clean:

clean:

clean:

clean:

clean:

thirdparty-downloads:

swfobject-check:

swfobject-download:
      [get] Getting: https://codeload.github.com/swfobject/swfobject/zip/2.2
      [get] To: <http://apacheflexbuild.cloudapp.net:8080/job/flex-asjs/ws/in/swfobject_2_2.zip>
    [unzip] Expanding: <http://apacheflexbuild.cloudapp.net:8080/job/flex-asjs/ws/in/swfobject_2_2.zip>
into <http://apacheflexbuild.cloudapp.net:8080/job/flex-asjs/ws/templates/swfobject>
    [mkdir] Created dir: <http://apacheflexbuild.cloudapp.net:8080/job/flex-asjs/ws/templates/swfobject/history>

flat-ui-check:

flat-ui-download:

check-goog-home:
     [echo] GOOG_HOME is C:\google\closure\Library

gcl-download:

main:
     [echo] Use thirdparty-clean or super-clean to remove these.

prepare:

compile:

Core:

clean:

compile:
     [echo] Compiling libs/Core.swc
     [echo] FLEX_HOME: <http://apacheflexbuild.cloudapp.net:8080/job/flex-asjs/ws/>
     [echo] FALCON_HOME: <http://apacheflexbuild.cloudapp.net:8080/job/flex-asjs/ws/../flex-falcon/compiler/generated/dist/sdk>
    [compc] Loading configuration: <http://apacheflexbuild.cloudapp.net:8080/job/flex-asjs/ws/frameworks/projects/Core/compile-config.xml>
    [compc] 
    [compc] 408485 bytes written to C:\Jenkins\workspace\flex-asjs\frameworks\libs\Core.swc
in 41.801 seconds
    [compc] Picked up JAVA_TOOL_OPTIONS: -Dfile.encoding=UTF8

test:
[available] DEPRECATED - <available> used to override an existing property.
[available]   Build file should not reuse the same property name for different values.

clean:

compile:
     [echo] Compiling FlexUnitFlexJSApplication.swf
     [echo] FLEX_HOME: <http://apacheflexbuild.cloudapp.net:8080/job/flex-asjs/ws/>
     [echo] FALCON_HOME: <http://apacheflexbuild.cloudapp.net:8080/job/flex-asjs/ws/../flex-falcon/compiler/generated/dist/sdk>
     [echo] FLEXUNIT_HOME: C:\jenkins\workspace\flex-flexunit
    [mxmlc] Loading configuration: <http://apacheflexbuild.cloudapp.net:8080/job/flex-asjs/ws/frameworks/flex-config.xml>
    [mxmlc] 
    [mxmlc] 135329 bytes written to C:\Jenkins\workspace\flex-asjs\frameworks\projects\Core\as\tests\FlexUnitFlexJSApplication.swf
in 30.967 seconds
    [mxmlc] C:\jenkins\workspace\flex-flexunit\FlexUnit4\target\flexunit-4.3.0-20140410-as3_4.12.0.swc
    [mxmlc] Warning: The definition mx.utils.ObjectUtil depended on by flexunit.framework.Assert
in the SWC C:\jenkins\workspace\flex-flexunit\FlexUnit4\target\flexunit-4.3.0-20140410-as3_4.12.0.swc
could not be found
    [mxmlc] 
    [mxmlc] C:\jenkins\workspace\flex-flexunit\FlexUnit4\target\flexunit-4.3.0-20140410-as3_4.12.0.swc
    [mxmlc] Warning: The definition mx.utils.StringUtil depended on by flexunit.framework.Assert
in the SWC C:\jenkins\workspace\flex-flexunit\FlexUnit4\target\flexunit-4.3.0-20140410-as3_4.12.0.swc
could not be found
    [mxmlc] 
    [mxmlc] C:\jenkins\workspace\flex-flexunit\FlexUnit4\target\flexunit-4.3.0-20140410-as3_4.12.0.swc
    [mxmlc] Warning: The definition mx.utils.ObjectUtil depended on by org.flexunit.runner.Description
in the SWC C:\jenkins\workspace\flex-flexunit\FlexUnit4\target\flexunit-4.3.0-20140410-as3_4.12.0.swc
could not be found
    [mxmlc] 
    [mxmlc] C:\jenkins\workspace\flex-flexunit\FlexUnit4\target\flexunit-4.3.0-20140410-as3_4.12.0.swc
    [mxmlc] Warning: The definition mx.utils.StringUtil depended on by flexunit.framework.AsyncTestHelper
in the SWC C:\jenkins\workspace\flex-flexunit\FlexUnit4\target\flexunit-4.3.0-20140410-as3_4.12.0.swc
could not be found
    [mxmlc] 
    [mxmlc] Picked up JAVA_TOOL_OPTIONS: -Dfile.encoding=UTF8

test:
 [flexunit] Validating task attributes ...
 [flexunit] Generating default values ...
 [flexunit] Using the following settings for the test run:
 [flexunit] 	FLEX_HOME: [<http://apacheflexbuild.cloudapp.net:8080/job/flex-asjs/ws/]>
 [flexunit] 	haltonfailure: [false]
 [flexunit] 	headless: [false]
 [flexunit] 	display: [99]
 [flexunit] 	localTrusted: [true]
 [flexunit] 	player: [flash]
 [flexunit] 	command: [C:\Program Files (x86)\Mozilla Firefox\firefox.exe]
 [flexunit] 	port: [1024]
 [flexunit] 	swf: [<http://apacheflexbuild.cloudapp.net:8080/job/flex-asjs/ws/frameworks/projects/Core/as/tests/FlexUnitFlexJSApplication.swf]>
 [flexunit] 	timeout: [90000ms]
 [flexunit] 	toDir: [<http://apacheflexbuild.cloudapp.net:8080/job/flex-asjs/ws/frameworks/projects/Core/as/tests/out]>
 [flexunit] Setting up server process ...
 [flexunit] Starting server ...
 [flexunit] Opening server socket on port [1024].
 [flexunit] Waiting for client connection ...
 [flexunit] Entry [<http://apacheflexbuild.cloudapp.net:8080/job/flex-asjs/ws/frameworks/projects/Core/as/tests]>
already available in local trust file at [C:\Users\apacheflexbuild\AppData\Roaming\Macromedia\Flash
Player\#Security\FlashPlayerTrust\flexUnit.cfg].
 [flexunit] Executing 'C:\Program Files (x86)\Mozilla Firefox\firefox.exe' with arguments:
 [flexunit] '<http://apacheflexbuild.cloudapp.net:8080/job/flex-asjs/ws/frameworks/projects/Core/as/tests/FlexUnitFlexJSApplication.swf'>
 [flexunit] 
 [flexunit] The ' characters around the executable and arguments are
 [flexunit] not part of the command.
 [flexunit] 
 [flexunit] 
 [flexunit] Stopping server ...
 [flexunit] End of test data reached, sending acknowledgement to player ...
 [flexunit] Closing client connection ...
 [flexunit] Closing server on port [1024] ...

BUILD FAILED
<http://apacheflexbuild.cloudapp.net:8080/job/flex-asjs/ws/build.xml>:431: The following
error occurred while executing this line:
<http://apacheflexbuild.cloudapp.net:8080/job/flex-asjs/ws/frameworks/build.xml>:79:
The following error occurred while executing this line:
<http://apacheflexbuild.cloudapp.net:8080/job/flex-asjs/ws/frameworks/build.xml>:225:
The following error occurred while executing this line:
<http://apacheflexbuild.cloudapp.net:8080/job/flex-asjs/ws/frameworks/projects/Core/build.xml>:44:
The following error occurred while executing this line:
<http://apacheflexbuild.cloudapp.net:8080/job/flex-asjs/ws/frameworks/projects/Core/as/tests/build.xml>:150:
java.util.concurrent.ExecutionException: Socket timeout waiting for flexunit report
	at java.util.concurrent.FutureTask.report(FutureTask.java:122)
	at java.util.concurrent.FutureTask.get(FutureTask.java:188)
	at org.flexunit.ant.tasks.TestRun.run(Unknown Source)
	at org.flexunit.ant.tasks.FlexUnitTask.execute(Unknown Source)
	at org.apache.tools.ant.UnknownElement.execute(UnknownElement.java:292)
	at sun.reflect.GeneratedMethodAccessor4.invoke(Unknown Source)
	at sun.reflect.DelegatingMethodAccessorImpl.invoke(DelegatingMethodAccessorImpl.java:43)
	at java.lang.reflect.Method.invoke(Method.java:606)
	at org.apache.tools.ant.dispatch.DispatchUtils.execute(DispatchUtils.java:106)
	at org.apache.tools.ant.Task.perform(Task.java:348)
	at org.apache.tools.ant.Target.execute(Target.java:435)
	at org.apache.tools.ant.Target.performTasks(Target.java:456)
	at org.apache.tools.ant.Project.executeSortedTargets(Project.java:1393)
	at org.apache.tools.ant.helper.SingleCheckExecutor.executeTargets(SingleCheckExecutor.java:38)
	at org.apache.tools.ant.Project.executeTargets(Project.java:1248)
	at org.apache.tools.ant.taskdefs.Ant.execute(Ant.java:440)
	at org.apache.tools.ant.UnknownElement.execute(UnknownElement.java:292)
	at sun.reflect.GeneratedMethodAccessor4.invoke(Unknown Source)
	at sun.reflect.DelegatingMethodAccessorImpl.invoke(DelegatingMethodAccessorImpl.java:43)
	at java.lang.reflect.Method.invoke(Method.java:606)
	at org.apache.tools.ant.dispatch.DispatchUtils.execute(DispatchUtils.java:106)
	at org.apache.tools.ant.Task.perform(Task.java:348)
	at org.apache.tools.ant.Target.execute(Target.java:435)
	at org.apache.tools.ant.Target.performTasks(Target.java:456)
	at org.apache.tools.ant.Project.executeSortedTargets(Project.java:1393)
	at org.apache.tools.ant.helper.SingleCheckExecutor.executeTargets(SingleCheckExecutor.java:38)
	at org.apache.tools.ant.Project.executeTargets(Project.java:1248)
	at org.apache.tools.ant.taskdefs.Ant.execute(Ant.java:440)
	at org.apache.tools.ant.UnknownElement.execute(UnknownElement.java:292)
	at sun.reflect.GeneratedMethodAccessor4.invoke(Unknown Source)
	at sun.reflect.DelegatingMethodAccessorImpl.invoke(DelegatingMethodAccessorImpl.java:43)
	at java.lang.reflect.Method.invoke(Method.java:606)
	at org.apache.tools.ant.dispatch.DispatchUtils.execute(DispatchUtils.java:106)
	at org.apache.tools.ant.Task.perform(Task.java:348)
	at org.apache.tools.ant.Target.execute(Target.java:435)
	at org.apache.tools.ant.Target.performTasks(Target.java:456)
	at org.apache.tools.ant.Project.executeSortedTargets(Project.java:1393)
	at org.apache.tools.ant.helper.SingleCheckExecutor.executeTargets(SingleCheckExecutor.java:38)
	at org.apache.tools.ant.Project.executeTargets(Project.java:1248)
	at org.apache.tools.ant.taskdefs.Ant.execute(Ant.java:440)
	at org.apache.tools.ant.taskdefs.CallTarget.execute(CallTarget.java:105)
	at org.apache.tools.ant.UnknownElement.execute(UnknownElement.java:292)
	at sun.reflect.GeneratedMethodAccessor4.invoke(Unknown Source)
	at sun.reflect.DelegatingMethodAccessorImpl.invoke(DelegatingMethodAccessorImpl.java:43)
	at java.lang.reflect.Method.invoke(Method.java:606)
	at org.apache.tools.ant.dispatch.DispatchUtils.execute(DispatchUtils.java:106)
	at org.apache.tools.ant.Task.perform(Task.java:348)
	at org.apache.tools.ant.Target.execute(Target.java:435)
	at org.apache.tools.ant.Target.performTasks(Target.java:456)
	at org.apache.tools.ant.Project.executeSortedTargets(Project.java:1393)
	at org.apache.tools.ant.helper.SingleCheckExecutor.executeTargets(SingleCheckExecutor.java:38)
	at org.apache.tools.ant.Project.executeTargets(Project.java:1248)
	at org.apache.tools.ant.taskdefs.Ant.execute(Ant.java:440)
	at org.apache.tools.ant.UnknownElement.execute(UnknownElement.java:292)
	at sun.reflect.GeneratedMethodAccessor4.invoke(Unknown Source)
	at sun.reflect.DelegatingMethodAccessorImpl.invoke(DelegatingMethodAccessorImpl.java:43)
	at java.lang.reflect.Method.invoke(Method.java:606)
	at org.apache.tools.ant.dispatch.DispatchUtils.execute(DispatchUtils.java:106)
	at org.apache.tools.ant.Task.perform(Task.java:348)
	at org.apache.tools.ant.Target.execute(Target.java:435)
	at org.apache.tools.ant.Target.performTasks(Target.java:456)
	at org.apache.tools.ant.Project.executeSortedTargets(Project.java:1393)
	at org.apache.tools.ant.Project.executeTarget(Project.java:1364)
	at org.apache.tools.ant.helper.DefaultExecutor.executeTargets(DefaultExecutor.java:41)
	at org.apache.tools.ant.Project.executeTargets(Project.java:1248)
	at org.apache.tools.ant.Main.runBuild(Main.java:851)
	at org.apache.tools.ant.Main.startAnt(Main.java:235)
	at org.apache.tools.ant.launch.Launcher.run(Launcher.java:280)
	at org.apache.tools.ant.launch.Launcher.main(Launcher.java:109)
Caused by: Socket timeout waiting for flexunit report
	at org.flexunit.ant.FlexUnitSocketServer.start(Unknown Source)
	at org.flexunit.ant.FlexUnitSocketThread.call(Unknown Source)
	at java.util.concurrent.FutureTask.run(FutureTask.java:262)
	at java.util.concurrent.ThreadPoolExecutor.runWorker(ThreadPoolExecutor.java:1145)
	at java.util.concurrent.ThreadPoolExecutor$Worker.run(ThreadPoolExecutor.java:615)
	at java.lang.Thread.run(Thread.java:745)
Caused by: java.net.SocketTimeoutException: Accept timed out
	at java.net.DualStackPlainSocketImpl.waitForNewConnection(Native Method)
	at java.net.DualStackPlainSocketImpl.socketAccept(DualStackPlainSocketImpl.java:135)
	at java.net.AbstractPlainSocketImpl.accept(AbstractPlainSocketImpl.java:398)
	at java.net.PlainSocketImpl.accept(PlainSocketImpl.java:198)
	at java.net.ServerSocket.implAccept(ServerSocket.java:530)
	at java.net.ServerSocket.accept(ServerSocket.java:498)
	at org.flexunit.ant.FlexUnitSocketServer.openClientSocket(Unknown Source)
	... 6 more

Total time: 3 minutes 54 seconds
Picked up JAVA_TOOL_OPTIONS: -Dfile.encoding=UTF8
Build step 'Invoke Ant' marked build as failure
Skipped archiving because build is not successful

Mime
View raw message