flex-commits mailing list archives

Site index · List index
Message view « Date » · « Thread »
Top « Date » · « Thread »
From flex.ci.bui...@gmail.com
Subject Build failed in Jenkins: flex-tlf #302
Date Sat, 24 Jan 2015 08:13:15 GMT
See <http://apacheflexbuild.cloudapp.net:8080/job/flex-tlf/302/changes>

Changes:

[Alex Harui] disable tests broken by removing questionable IP

------------------------------------------
Started by user Alex Harui
Building remotely on flex_sdk_slave2 in workspace <http://apacheflexbuild.cloudapp.net:8080/job/flex-tlf/ws/>
 > C:\Program Files (x86)\Git\cmd\git.exe rev-parse --is-inside-work-tree # timeout=10
Fetching changes from the remote Git repository
 > C:\Program Files (x86)\Git\cmd\git.exe config remote.origin.url https://git-wip-us.apache.org/repos/asf/flex-tlf.git
# timeout=10
Fetching upstream changes from https://git-wip-us.apache.org/repos/asf/flex-tlf.git
 > C:\Program Files (x86)\Git\cmd\git.exe --version # timeout=10
 > C:\Program Files (x86)\Git\cmd\git.exe fetch --tags --progress https://git-wip-us.apache.org/repos/asf/flex-tlf.git
+refs/heads/*:refs/remotes/origin/*
 > C:\Program Files (x86)\Git\cmd\git.exe rev-parse "origin/develop^{commit}" # timeout=10
Checking out Revision 392058fc1f0ca44ba73edb2139155606b9d8df41 (origin/develop)
 > C:\Program Files (x86)\Git\cmd\git.exe config core.sparsecheckout # timeout=10
 > C:\Program Files (x86)\Git\cmd\git.exe checkout -f 392058fc1f0ca44ba73edb2139155606b9d8df41
 > C:\Program Files (x86)\Git\cmd\git.exe rev-list 59810165fe0b744f5a25c2e29275a0f92ee5f1eb
# timeout=10
[flex-tlf] $ cmd.exe /C '"c:\Jenkins\tools\hudson.tasks.Ant_AntInstallation\c_apache-ant-1.9.3\bin\ant.bat
-file build.xml all && exit %%ERRORLEVEL%%"'
Buildfile: <http://apacheflexbuild.cloudapp.net:8080/job/flex-tlf/ws/build.xml>
     [echo] FLEX_HOME is <http://apacheflexbuild.cloudapp.net:8080/job/flex-tlf/ws/../flex-sdk>
     [echo] Minimal test is set false

clean:
   [delete] Deleting directory <http://apacheflexbuild.cloudapp.net:8080/job/flex-tlf/ws/bin>

textLayout:
    [compc] Loading configuration file C:\Jenkins\workspace\flex-sdk\frameworks\flex-config.xml
    [compc] C:\Jenkins\workspace\flex-tlf\bin\textLayout.swc (548680 bytes)
    [compc] Picked up JAVA_TOOL_OPTIONS: -Dfile.encoding=UTF8

main:

asTestApps:
     [echo] FLEX_HOME is <http://apacheflexbuild.cloudapp.net:8080/job/flex-tlf/ws/../flex-sdk>
     [echo] Minimal test is set false

asTestApp:
    [mxmlc] Loading configuration file C:\Jenkins\workspace\flex-sdk\frameworks\flex-config.xml
    [mxmlc] C:\Jenkins\workspace\flex-tlf\bin\apps\asTestApps\bin\ExplicitFormField.swf (519803
bytes)
    [mxmlc] Picked up JAVA_TOOL_OPTIONS: -Dfile.encoding=UTF8
     [echo] FLEX_HOME is <http://apacheflexbuild.cloudapp.net:8080/job/flex-tlf/ws/../flex-sdk>
     [echo] Minimal test is set false

asTestApp:
    [mxmlc] Loading configuration file C:\Jenkins\workspace\flex-sdk\frameworks\flex-config.xml
    [mxmlc] C:\Jenkins\workspace\flex-tlf\bin\apps\asTestApps\bin\TCMTestFocus2.swf (527003
bytes)
    [mxmlc] Picked up JAVA_TOOL_OPTIONS: -Dfile.encoding=UTF8
     [echo] FLEX_HOME is <http://apacheflexbuild.cloudapp.net:8080/job/flex-tlf/ws/../flex-sdk>
     [echo] Minimal test is set false

asTestApp:
    [mxmlc] Loading configuration file C:\Jenkins\workspace\flex-sdk\frameworks\flex-config.xml
    [mxmlc] C:\Jenkins\workspace\flex-tlf\bin\apps\asTestApps\bin\KeyLogger.swf (2165 bytes)
    [mxmlc] Picked up JAVA_TOOL_OPTIONS: -Dfile.encoding=UTF8
     [echo] FLEX_HOME is <http://apacheflexbuild.cloudapp.net:8080/job/flex-tlf/ws/../flex-sdk>
     [echo] Minimal test is set false

asTestApp:
    [mxmlc] Loading configuration file C:\Jenkins\workspace\flex-sdk\frameworks\flex-config.xml
    [mxmlc] Picked up JAVA_TOOL_OPTIONS: -Dfile.encoding=UTF8
    [mxmlc] C:\Jenkins\workspace\flex-tlf\bin\apps\asTestApps\bin\OpHammer.swf (530203 bytes)

textLayout_editBar:
    [compc] Loading configuration file C:\Jenkins\workspace\flex-sdk\frameworks\flex-config.xml
    [compc] Picked up JAVA_TOOL_OPTIONS: -Dfile.encoding=UTF8
    [compc] C:\Jenkins\workspace\flex-tlf\bin\apps\testApps\bin\textLayout_editBar.swc (23177
bytes)

textLayout_ui:
    [compc] Loading configuration file C:\Jenkins\workspace\flex-sdk\frameworks\flex-config.xml
    [compc] C:\Jenkins\workspace\flex-tlf\bin\apps\testApps\bin\textLayout_ui.swc (112807
bytes)
    [compc] Picked up JAVA_TOOL_OPTIONS: -Dfile.encoding=UTF8

testApps:
    [mxmlc] Loading configuration file C:\Jenkins\workspace\flex-sdk\frameworks\flex-config.xml
    [mxmlc] C:\Jenkins\workspace\flex-tlf\bin\apps\automation_apps\bin\Flow.swf (2185127 bytes)
    [mxmlc] Picked up JAVA_TOOL_OPTIONS: -Dfile.encoding=UTF8

automation_core:
    [compc] Loading configuration file C:\Jenkins\workspace\flex-sdk\frameworks\flex-config.xml
    [compc] C:\Jenkins\workspace\flex-tlf\bin\apps\automation_apps\bin\automation_core.swc
(34053 bytes)
    [compc] Picked up JAVA_TOOL_OPTIONS: -Dfile.encoding=UTF8

automation_tests:
    [compc] Loading configuration file C:\Jenkins\workspace\flex-sdk\frameworks\flex-config.xml
    [compc] C:\Jenkins\workspace\flex-tlf\bin\apps\automation_apps\bin\automation_tests.swc
(184345 bytes)
    [compc] Picked up JAVA_TOOL_OPTIONS: -Dfile.encoding=UTF8

automation_apps:
    [mxmlc] Loading configuration file C:\Jenkins\workspace\flex-sdk\frameworks\flex-config.xml
    [mxmlc] Picked up JAVA_TOOL_OPTIONS: -Dfile.encoding=UTF8
    [mxmlc] C:\Jenkins\workspace\flex-tlf\bin\apps\automation_apps\bin\VellumUnit.swf (2237802
bytes)
     [copy] Copying 144 files to <http://apacheflexbuild.cloudapp.net:8080/job/flex-tlf/ws/bin/apps/test>

flexunnit_tests:
 [flexunit] Validating task attributes ...
 [flexunit] Generating default values ...
 [flexunit] Using default working dir [<http://apacheflexbuild.cloudapp.net:8080/job/flex-tlf/ws/]>
 [flexunit] Using the following settings for the test run:
 [flexunit] 	FLEX_HOME: [<http://apacheflexbuild.cloudapp.net:8080/job/flex-tlf/ws/../flex-sdk]>
 [flexunit] 	haltonfailure: [true]
 [flexunit] 	headless: [false]
 [flexunit] 	display: [99]
 [flexunit] 	localTrusted: [true]
 [flexunit] 	player: [flash]
 [flexunit] 	port: [1024]
 [flexunit] 	swf: [<http://apacheflexbuild.cloudapp.net:8080/job/flex-tlf/ws/bin/apps/automation_apps/bin/VellumUnit.swf]>
 [flexunit] 	timeout: [60000ms]
 [flexunit] 	toDir: [<http://apacheflexbuild.cloudapp.net:8080/job/flex-tlf/ws/bin/apps/automation_apps]>
 [flexunit] Setting up server process ...
 [flexunit] Entry [<http://apacheflexbuild.cloudapp.net:8080/job/flex-tlf/ws/bin/apps/automation_apps/bin]>
already available in local trust file at [C:\Users\apacheflexbuild\AppData\Roaming\Macromedia\Flash
Player\#Security\FlashPlayerTrust\flexUnit.cfg].
 [flexunit] Executing 'rundll32' with arguments:
 [flexunit] 'url.dll,FileProtocolHandler'
 [flexunit] '<http://apacheflexbuild.cloudapp.net:8080/job/flex-tlf/ws/bin/apps/automation_apps/bin/VellumUnit.swf'>
 [flexunit] 
 [flexunit] The ' characters around the executable and arguments are
 [flexunit] not part of the command.
 [flexunit] 
 [flexunit] Starting server ...
 [flexunit] Opening server socket on port [1024].
 [flexunit] Waiting for client connection ...
 [flexunit] 
 [flexunit] Stopping server ...
 [flexunit] End of test data reached, sending acknowledgement to player ...
 [flexunit] Closing client connection ...
 [flexunit] Closing server on port [1024] ...

BUILD FAILED
<http://apacheflexbuild.cloudapp.net:8080/job/flex-tlf/ws/build.xml>:314: java.util.concurrent.ExecutionException:
Socket timeout waiting for flexunit report
	at java.util.concurrent.FutureTask.report(FutureTask.java:122)
	at java.util.concurrent.FutureTask.get(FutureTask.java:188)
	at org.flexunit.ant.tasks.TestRun.run(Unknown Source)
	at org.flexunit.ant.tasks.FlexUnitTask.execute(Unknown Source)
	at org.apache.tools.ant.UnknownElement.execute(UnknownElement.java:292)
	at sun.reflect.GeneratedMethodAccessor4.invoke(Unknown Source)
	at sun.reflect.DelegatingMethodAccessorImpl.invoke(DelegatingMethodAccessorImpl.java:43)
	at java.lang.reflect.Method.invoke(Method.java:606)
	at org.apache.tools.ant.dispatch.DispatchUtils.execute(DispatchUtils.java:106)
	at org.apache.tools.ant.Task.perform(Task.java:348)
	at org.apache.tools.ant.Target.execute(Target.java:435)
	at org.apache.tools.ant.Target.performTasks(Target.java:456)
	at org.apache.tools.ant.Project.executeSortedTargets(Project.java:1393)
	at org.apache.tools.ant.Project.executeTarget(Project.java:1364)
	at org.apache.tools.ant.helper.DefaultExecutor.executeTargets(DefaultExecutor.java:41)
	at org.apache.tools.ant.Project.executeTargets(Project.java:1248)
	at org.apache.tools.ant.Main.runBuild(Main.java:851)
	at org.apache.tools.ant.Main.startAnt(Main.java:235)
	at org.apache.tools.ant.launch.Launcher.run(Launcher.java:280)
	at org.apache.tools.ant.launch.Launcher.main(Launcher.java:109)
Caused by: Socket timeout waiting for flexunit report
	at org.flexunit.ant.FlexUnitSocketServer.start(Unknown Source)
	at org.flexunit.ant.FlexUnitSocketThread.call(Unknown Source)
	at java.util.concurrent.FutureTask.run(FutureTask.java:262)
	at java.util.concurrent.ThreadPoolExecutor.runWorker(ThreadPoolExecutor.java:1145)
	at java.util.concurrent.ThreadPoolExecutor$Worker.run(ThreadPoolExecutor.java:615)
	at java.lang.Thread.run(Thread.java:745)
Caused by: java.net.SocketTimeoutException: Accept timed out
	at java.net.DualStackPlainSocketImpl.waitForNewConnection(Native Method)
	at java.net.DualStackPlainSocketImpl.socketAccept(DualStackPlainSocketImpl.java:135)
	at java.net.AbstractPlainSocketImpl.accept(AbstractPlainSocketImpl.java:398)
	at java.net.PlainSocketImpl.accept(PlainSocketImpl.java:198)
	at java.net.ServerSocket.implAccept(ServerSocket.java:530)
	at java.net.ServerSocket.accept(ServerSocket.java:498)
	at org.flexunit.ant.FlexUnitSocketServer.openClientSocket(Unknown Source)
	... 6 more

Total time: 4 minutes 36 seconds
Picked up JAVA_TOOL_OPTIONS: -Dfile.encoding=UTF8
Build step 'Invoke Ant' marked build as failure
Archiving artifacts
Recording test results
ERROR: Publisher hudson.tasks.junit.JUnitResultArchiver aborted due to exception
hudson.AbortException: No test report files were found. Configuration error?
	at hudson.tasks.junit.JUnitParser$ParseResultCallable.invoke(JUnitParser.java:116)
	at hudson.tasks.junit.JUnitParser$ParseResultCallable.invoke(JUnitParser.java:93)
	at hudson.FilePath$FileCallableWrapper.call(FilePath.java:2677)
	at hudson.remoting.UserRequest.perform(UserRequest.java:121)
	at hudson.remoting.UserRequest.perform(UserRequest.java:49)
	at hudson.remoting.Request$2.run(Request.java:324)
	at hudson.remoting.InterceptingExecutorService$1.call(InterceptingExecutorService.java:68)
	at java.util.concurrent.FutureTask.run(Unknown Source)
	at java.util.concurrent.ThreadPoolExecutor.runWorker(Unknown Source)
	at java.util.concurrent.ThreadPoolExecutor$Worker.run(Unknown Source)
	at hudson.remoting.Engine$1$1.run(Engine.java:63)
	at java.lang.Thread.run(Unknown Source)
	at ......remote call to flex_sdk_slave2(Native Method)
	at hudson.remoting.Channel.attachCallSiteStackTrace(Channel.java:1356)
	at hudson.remoting.UserResponse.retrieve(UserRequest.java:221)
	at hudson.remoting.Channel.call(Channel.java:752)
	at hudson.FilePath.act(FilePath.java:970)
	at hudson.FilePath.act(FilePath.java:959)
	at hudson.tasks.junit.JUnitParser.parseResult(JUnitParser.java:90)
	at hudson.tasks.junit.JUnitResultArchiver.parse(JUnitResultArchiver.java:120)
	at hudson.tasks.junit.JUnitResultArchiver.perform(JUnitResultArchiver.java:137)
	at hudson.tasks.BuildStepCompatibilityLayer.perform(BuildStepCompatibilityLayer.java:74)
	at hudson.tasks.BuildStepMonitor$1.perform(BuildStepMonitor.java:20)
	at hudson.model.AbstractBuild$AbstractBuildExecution.perform(AbstractBuild.java:770)
	at hudson.model.AbstractBuild$AbstractBuildExecution.performAllBuildSteps(AbstractBuild.java:734)
	at hudson.model.Build$BuildExecution.post2(Build.java:183)
	at hudson.model.AbstractBuild$AbstractBuildExecution.post(AbstractBuild.java:683)
	at hudson.model.Run.execute(Run.java:1784)
	at hudson.model.FreeStyleBuild.run(FreeStyleBuild.java:43)
	at hudson.model.ResourceController.execute(ResourceController.java:89)
	at hudson.model.Executor.run(Executor.java:240)

Mime
View raw message