flex-commits mailing list archives

Site index · List index
Message view « Date » · « Thread »
Top « Date » · « Thread »
From flex.ci.bui...@gmail.com
Subject Build failed in Jenkins: flex-falcon #288
Date Mon, 15 Dec 2014 05:01:14 GMT
See <http://apacheflexbuild.cloudapp.net:8080/job/flex-falcon/288/>

------------------------------------------
[...truncated 131 lines...]
all:

check-dependency:

download-dependency:

echo-project-jar:

download-apache-license:

download-other-license:
      [get] Getting: http://www.antlr.org/license.html
      [get] To: <http://apacheflexbuild.cloudapp.net:8080/job/flex-falcon/ws/compiler/lib/antlr-LICENSE.html>

download-dependency-jar:

check-cache:

download-jar:

get-if-not-cached:
      [get] Getting: http://search.maven.org/remotecontent?filepath=/org/antlr/antlr-complete/3.5.2/antlr-complete-3.5.2.jar
      [get] To: <http://apacheflexbuild.cloudapp.net:8080/job/flex-falcon/ws/compiler/lib/antlr.jar>
      [get] http://search.maven.org/remotecontent?filepath=/org/antlr/antlr-complete/3.5.2/antlr-complete-3.5.2.jar
moved to https://repo1.maven.org/maven2//org/antlr/antlr-complete/3.5.2/antlr-complete-3.5.2.jar

check-sum:

put-in-cache:

copy-if-cached:

download-dependency-zip:

check-dependency:

download-dependency:

echo-project-jar:

download-apache-license:

download-other-license:

download-dependency-jar:

download-dependency-zip:

check-cache:

download-zip:
    [mkdir] Created dir: <http://apacheflexbuild.cloudapp.net:8080/job/flex-falcon/ws/compiler/in>

get-if-not-cached:
      [get] Getting: http://archive.apache.org/dist/commons/cli/binaries/commons-cli-1.2-bin.tar.gz
      [get] To: <http://apacheflexbuild.cloudapp.net:8080/job/flex-falcon/ws/compiler/in/commons-cli-1.2-bin.tar.gz>

check-sum:

put-in-cache:

copy-if-cached:

untar-file:
    [untar] Expanding: <http://apacheflexbuild.cloudapp.net:8080/job/flex-falcon/ws/compiler/in/commons-cli-1.2-bin.tar.gz>
into <http://apacheflexbuild.cloudapp.net:8080/job/flex-falcon/ws/compiler/in/temp>

unzip-file:

copy-downloaded-jar:
     [copy] Copying 1 file to <http://apacheflexbuild.cloudapp.net:8080/job/flex-falcon/ws/compiler/lib>
     [copy] Copying <http://apacheflexbuild.cloudapp.net:8080/job/flex-falcon/ws/compiler/in/temp/commons-cli-1.2/commons-cli-1.2.jar>
to <http://apacheflexbuild.cloudapp.net:8080/job/flex-falcon/ws/compiler/lib/commons-cli.jar>
     [copy] Copying 1 file to <http://apacheflexbuild.cloudapp.net:8080/job/flex-falcon/ws/compiler/lib>

check-dependency:

download-dependency:

echo-project-jar:

download-apache-license:

download-other-license:

download-dependency-jar:

download-dependency-zip:

check-cache:

download-zip:

get-if-not-cached:
      [get] Getting: http://archive.apache.org/dist/commons/io/binaries/commons-io-2.4-bin.tar.gz
      [get] To: <http://apacheflexbuild.cloudapp.net:8080/job/flex-falcon/ws/compiler/in/commons-io-2.4-bin.tar.gz>

check-sum:

put-in-cache:

copy-if-cached:

untar-file:
    [untar] Expanding: <http://apacheflexbuild.cloudapp.net:8080/job/flex-falcon/ws/compiler/in/commons-io-2.4-bin.tar.gz>
into <http://apacheflexbuild.cloudapp.net:8080/job/flex-falcon/ws/compiler/in/temp>

unzip-file:

copy-downloaded-jar:
     [copy] Copying 1 file to <http://apacheflexbuild.cloudapp.net:8080/job/flex-falcon/ws/compiler/lib>
     [copy] Copying <http://apacheflexbuild.cloudapp.net:8080/job/flex-falcon/ws/compiler/in/temp/commons-io-2.4/commons-io-2.4.jar>
to <http://apacheflexbuild.cloudapp.net:8080/job/flex-falcon/ws/compiler/lib/commons-io.jar>
     [copy] Copying 1 file to <http://apacheflexbuild.cloudapp.net:8080/job/flex-falcon/ws/compiler/lib>

check-dependency:

download-dependency:

echo-project-jar:

download-apache-license:
      [get] Getting: http://www.apache.org/licenses/LICENSE-2.0
      [get] To: <http://apacheflexbuild.cloudapp.net:8080/job/flex-falcon/ws/compiler/lib/guava-LICENSE.html>

download-other-license:

download-dependency-jar:

check-cache:

download-jar:

get-if-not-cached:
      [get] Getting: http://search.maven.org/remotecontent?filepath=/com/google/guava/guava/17.0/guava-17.0.jar
      [get] To: <http://apacheflexbuild.cloudapp.net:8080/job/flex-falcon/ws/compiler/lib/guava.jar>
      [get] http://search.maven.org/remotecontent?filepath=/com/google/guava/guava/17.0/guava-17.0.jar
moved to https://repo1.maven.org/maven2//com/google/guava/guava/17.0/guava-17.0.jar

check-sum:

put-in-cache:

copy-if-cached:

download-dependency-zip:

check-dependency:

download-dependency:

echo-project-jar:

download-apache-license:

download-other-license:

download-dependency-jar:

download-dependency-zip:

check-cache:

download-zip:

get-if-not-cached:
      [get] Getting: http://downloads.sourceforge.net/project/jburg/jburg-1.10.1.tar.gz
      [get] To: <http://apacheflexbuild.cloudapp.net:8080/job/flex-falcon/ws/compiler/in/jburg-1.10.1.tar.gz>
      [get] http://downloads.sourceforge.net/project/jburg/jburg-1.10.1.tar.gz moved to http://superb-dca2.dl.sourceforge.net/project/jburg/jburg-1.10.1.tar.gz

check-sum:

put-in-cache:

copy-if-cached:

untar-file:
    [untar] Expanding: <http://apacheflexbuild.cloudapp.net:8080/job/flex-falcon/ws/compiler/in/jburg-1.10.1.tar.gz>
into <http://apacheflexbuild.cloudapp.net:8080/job/flex-falcon/ws/compiler/in/temp>

unzip-file:

copy-downloaded-jar:
     [copy] Copying 1 file to <http://apacheflexbuild.cloudapp.net:8080/job/flex-falcon/ws/compiler/lib>
     [copy] Copying <http://apacheflexbuild.cloudapp.net:8080/job/flex-falcon/ws/compiler/in/temp/lib/jburg.jar>
to <http://apacheflexbuild.cloudapp.net:8080/job/flex-falcon/ws/compiler/lib/jburg.jar>
     [copy] Copying 1 file to <http://apacheflexbuild.cloudapp.net:8080/job/flex-falcon/ws/compiler/lib>

check-dependency:

download-dependency:

echo-project-jar:

download-apache-license:

download-other-license:

download-dependency-jar:

download-dependency-zip:

check-cache:

download-zip:

get-if-not-cached:
      [get] Getting: http://jflex.de/./jflex-1.6.0.tar.gz
      [get] To: <http://apacheflexbuild.cloudapp.net:8080/job/flex-falcon/ws/compiler/in/jflex-1.6.0.tar.gz>

check-sum:

put-in-cache:

copy-if-cached:

untar-file:
    [untar] Expanding: <http://apacheflexbuild.cloudapp.net:8080/job/flex-falcon/ws/compiler/in/jflex-1.6.0.tar.gz>
into <http://apacheflexbuild.cloudapp.net:8080/job/flex-falcon/ws/compiler/in/temp>

unzip-file:

copy-downloaded-jar:
     [copy] Copying 1 file to <http://apacheflexbuild.cloudapp.net:8080/job/flex-falcon/ws/compiler/lib>
     [copy] Copying <http://apacheflexbuild.cloudapp.net:8080/job/flex-falcon/ws/compiler/in/temp/jflex-1.6.0/lib/jflex-1.6.0.jar>
to <http://apacheflexbuild.cloudapp.net:8080/job/flex-falcon/ws/compiler/lib/jflex.jar>
     [copy] Copying 1 file to <http://apacheflexbuild.cloudapp.net:8080/job/flex-falcon/ws/compiler/lib>

check-dependency:

download-dependency:

echo-project-jar:

download-apache-license:

download-other-license:
      [get] Getting: http://www.7-zip.org/sdk.html
      [get] To: <http://apacheflexbuild.cloudapp.net:8080/job/flex-falcon/ws/compiler/lib/lzma-sdk-LICENSE.html>
      [get] Error opening connection java.io.IOException: Server returned HTTP response code:
503 for URL: http://www.7-zip.org/sdk.html
      [get] Error opening connection java.io.IOException: Server returned HTTP response code:
503 for URL: http://www.7-zip.org/sdk.html
      [get] Error opening connection java.io.IOException: Server returned HTTP response code:
503 for URL: http://www.7-zip.org/sdk.html
      [get] Can't get http://www.7-zip.org/sdk.html to <http://apacheflexbuild.cloudapp.net:8080/job/flex-falcon/ws/compiler/lib/lzma-sdk-LICENSE.html>

BUILD FAILED
<http://apacheflexbuild.cloudapp.net:8080/job/flex-falcon/ws/build.xml>:78: The following
error occurred while executing this line:
<http://apacheflexbuild.cloudapp.net:8080/job/flex-falcon/ws/compiler/build.xml>:863:
The following error occurred while executing this line:
<http://apacheflexbuild.cloudapp.net:8080/job/flex-falcon/ws/compiler/build.xml>:227:
The following error occurred while executing this line:
<http://apacheflexbuild.cloudapp.net:8080/job/flex-falcon/ws/compiler/downloads.xml>:206:
The following error occurred while executing this line:
<http://apacheflexbuild.cloudapp.net:8080/job/flex-falcon/ws/compiler/downloads.xml>:279:
The following error occurred while executing this line:
<http://apacheflexbuild.cloudapp.net:8080/job/flex-falcon/ws/compiler/downloads.xml>:316:
Can't get http://www.7-zip.org/sdk.html to <http://apacheflexbuild.cloudapp.net:8080/job/flex-falcon/ws/compiler/lib/lzma-sdk-LICENSE.html>

Total time: 1 minute 30 seconds
Build step 'Invoke Ant' marked build as failure
Archiving artifacts
No JDK named ‘(Default)’ found
Recording test results
No JDK named ‘(Default)’ found
No JDK named ‘(Default)’ found

Mime
View raw message