flex-commits mailing list archives

Site index · List index
Message view « Date » · « Thread »
Top « Date » · « Thread »
From flex.ci.bui...@gmail.com
Subject Build failed in Jenkins: flex-flexunit #228
Date Tue, 30 Dec 2014 07:16:42 GMT
See <http://apacheflexbuild.cloudapp.net:8080/job/flex-flexunit/228/>

------------------------------------------
[...truncated 1407 lines...]
 [flexunit] Tests run: 5, Failures: 0, Errors: 0, Skipped: 0, Time elapsed: 0.004 sec
 [flexunit] Suite: flexUnitTests.flexUnit4.suites.frameworkSuite.parameterizedSuite.TestJUnitParameterizedExternalLoader
 [flexunit] Tests run: 4, Failures: 0, Errors: 0, Skipped: 0, Time elapsed: 0.001 sec
 [flexunit] Suite: tests.flex.lang.reflect.field.FieldWithValidData
 [flexunit] Tests run: 24, Failures: 0, Errors: 0, Skipped: 0, Time elapsed: 0.098 sec
 [flexunit] Suite: tests.org.flexunit.assert.bool.AssertFailNotTrue
 [flexunit] Tests run: 3, Failures: 0, Errors: 0, Skipped: 0, Time elapsed: 0.002 sec
 [flexunit] Suite: org.hamcrest.CustomMatcherTest
 [flexunit] Tests run: 1, Failures: 0, Errors: 0, Skipped: 0, Time elapsed: 0.001 sec
 [flexunit] Suite: flexUnitTests.flexUnit4.suites.frameworkSuite.parameterizedSuite.TestJUnitParameterizedBasicFunctionality
 [flexunit] Tests run: 9, Failures: 0, Errors: 0, Skipped: 3, Time elapsed: 0.031 sec
 [flexunit] Suite: tests.org.flexunit.assert.equals.AssertStrictlyEqualsClassCase
 [flexunit] Tests run: 4, Failures: 0, Errors: 0, Skipped: 0, Time elapsed: 0.000 sec
 [flexunit] Suite: org.hamcrest.core.ThrowsTest
 [flexunit] Tests run: 4, Failures: 0, Errors: 0, Skipped: 0, Time elapsed: 0.002 sec
 [flexunit] Suite: org.hamcrest.mxml.text.EndsWithTest
 [flexunit] Tests run: 5, Failures: 0, Errors: 0, Skipped: 0, Time elapsed: 0.031 sec
 [flexunit] Suite: org.flexunit.internals.builders.cases.FlexUnit1BuilderCase
 [flexunit] Tests run: 6, Failures: 0, Errors: 0, Skipped: 1, Time elapsed: 0.002 sec
 [flexunit] Suite: tests.flex.lang.reflect.field.FieldAsAVariable
 [flexunit] Tests run: 5, Failures: 0, Errors: 0, Skipped: 0, Time elapsed: 0.020 sec
 [flexunit] Suite: org.hamcrest.mxml.collection.HasItemsTest
 [flexunit] Tests run: 5, Failures: 0, Errors: 0, Skipped: 0, Time elapsed: 0.005 sec
 [flexunit] Suite: org.hamcrest.mxml.number.GreaterThanOrEqualToTest
 [flexunit] Tests run: 5, Failures: 0, Errors: 0, Skipped: 0, Time elapsed: 0.013 sec
 [flexunit] Suite: org.flexunit.events.rule.cases.AsyncEventTesting
 [flexunit] Tests run: 17, Failures: 0, Errors: 0, Skipped: 0, Time elapsed: 1.842 sec
 [flexunit] Suite: org.flexunit.runner.notification.async.cases.AsyncListenerWatcherCase
 [flexunit] Tests run: 14, Failures: 0, Errors: 0, Skipped: 3, Time elapsed: 0.021 sec
 [flexunit] Suite: org.hamcrest.filter.FilterFunctionTest
 [flexunit] Tests run: 3, Failures: 0, Errors: 0, Skipped: 0, Time elapsed: 0.004 sec
 [flexunit] Suite: org.hamcrest.mxml.date.DateEqualToTest
 [flexunit] Tests run: 5, Failures: 0, Errors: 0, Skipped: 0, Time elapsed: 0.027 sec
 [flexunit] Suite: tests.org.flexunit.assert.nullHandling.AssertNullFunctionCase
 [flexunit] Tests run: 4, Failures: 0, Errors: 0, Skipped: 0, Time elapsed: 0.000 sec
 [flexunit] Suite: org.hamcrest.MatcherAssertTest
 [flexunit] Tests run: 4, Failures: 0, Errors: 0, Skipped: 0, Time elapsed: 0.002 sec
 [flexunit] Suite: org.flexunit.cases.AssertThatCase
 [flexunit] Tests run: 1, Failures: 0, Errors: 0, Skipped: 0, Time elapsed: 0.000 sec
 [flexunit] Suite: org.flexunit.internals.runners.statements.cases.RunBeforesClassCase
 [flexunit] Tests run: 3, Failures: 0, Errors: 0, Skipped: 0, Time elapsed: 0.004 sec
 [flexunit] Suite: org.flexunit.runner.notification.cases.RunListenerCase
 [flexunit] Tests run: 8, Failures: 0, Errors: 0, Skipped: 0, Time elapsed: 0.357 sec
 [flexunit] Suite: tests.org.flexunit.assert.equals.AssertEqualsClassCase
 [flexunit] Tests run: 10, Failures: 0, Errors: 0, Skipped: 0, Time elapsed: 0.003 sec
 [flexunit] Suite: tests.flex.lang.reflect.metadata.metaDataArgument.ArgumentWithValidData
 [flexunit] Tests run: 10, Failures: 0, Errors: 0, Skipped: 0, Time elapsed: 0.105 sec
 [flexunit] Suite: org.flexunit.internals.builders.cases.MetaDataBuilderCase
 [flexunit] Tests run: 6, Failures: 0, Errors: 0, Skipped: 3, Time elapsed: 0.031 sec
 [flexunit] Suite: org.flexunit.runner.cases.DescriptionCase
 [flexunit] Tests run: 27, Failures: 0, Errors: 0, Skipped: 0, Time elapsed: 0.171 sec
 [flexunit] Suite: org.flexunit.cases.AssertCase
 [flexunit] Tests run: 41, Failures: 0, Errors: 0, Skipped: 0, Time elapsed: 0.017 sec
 [flexunit] Suite: org.hamcrest.mxml.text.ContainsStringTest
 [flexunit] Tests run: 5, Failures: 0, Errors: 0, Skipped: 0, Time elapsed: 0.024 sec
 [flexunit] Suite: tests.org.flexunit.async.AsyncNativeTestResponderCase
 [flexunit] Tests run: 2, Failures: 0, Errors: 0, Skipped: 0, Time elapsed: 0.021 sec
 [flexunit] Suite: org.hamcrest.mxml.object.HasPropertyTest
 [flexunit] Tests run: 5, Failures: 0, Errors: 0, Skipped: 0, Time elapsed: 0.008 sec
 [flexunit] Suite: org.hamcrest.mxml.date.DateAfterTest
 [flexunit] Tests run: 5, Failures: 0, Errors: 0, Skipped: 0, Time elapsed: 0.007 sec
 [flexunit] Suite: org.flexunit.internals.runners.statements.cases.FailCase
 [flexunit] Tests run: 1, Failures: 0, Errors: 0, Skipped: 0, Time elapsed: 0.011 sec
 [flexunit] Suite: flexUnitTests.flexUnit4.suites.frameworkSuite.parameterizedSuite.TestNGParameterizedWithAsync
 [flexunit] Tests run: 3, Failures: 0, Errors: 0, Skipped: 0, Time elapsed: 1.894 sec
 [flexunit] Suite: org.hamcrest.mxml.object.SameInstanceTest
 [flexunit] Tests run: 5, Failures: 0, Errors: 0, Skipped: 0, Time elapsed: 0.079 sec
 [flexunit] Suite: flexUnitTests.flexUnit4.suites.frameworkSuite.cases.TestBeforeAfterClassOrderAsync
 [flexunit] Tests run: 2, Failures: 0, Errors: 0, Skipped: 0, Time elapsed: 0.031 sec
 [flexunit] Suite: org.hamcrest.core.AnyOfTest
 [flexunit] Tests run: 3, Failures: 0, Errors: 0, Skipped: 0, Time elapsed: 0.001 sec
 [flexunit] Suite: flexUnitTests.flexUnit4.suites.frameworkSuite.rulesSuite.TestRulesErrorWrapping
 [flexunit] Tests run: 2, Failures: 0, Errors: 0, Skipped: 0, Time elapsed: 0.003 sec
 [flexunit] Suite: org.flexunit.events.rule.cases.SyncEventQuantityTesting
 [flexunit] Tests run: 32, Failures: 0, Errors: 0, Skipped: 0, Time elapsed: 0.061 sec
 [flexunit] Suite: flexUnitTests.flexUnit4.suites.frameworkSuite.theorySuite.ExternalTheorySuite
 [flexunit] Tests run: 3, Failures: 0, Errors: 0, Skipped: 0, Time elapsed: 0.100 sec
 [flexunit] Suite: flexUnitTests.flexUnit4.suites.frameworkSuite.cases.TestAsynchronousAS
 [flexunit] Tests run: 17, Failures: 0, Errors: 0, Skipped: 2, Time elapsed: 1.639 sec
 [flexunit] Suite: org.hamcrest.mxml.object.IsFalseTest
 [flexunit] Tests run: 5, Failures: 0, Errors: 0, Skipped: 0, Time elapsed: 0.005 sec
 [flexunit] Suite: flexUnitTests.flexUnit1.framework.TestAssert
 [flexunit] Tests run: 22, Failures: 0, Errors: 0, Skipped: 0, Time elapsed: 0.018 sec
 [flexunit] Suite: flexUnitTests.flexUnit4.suites.frameworkSuite.parameterizedSuite.TestNGParameterizedWithBeforeAfter
 [flexunit] Tests run: 3, Failures: 0, Errors: 0, Skipped: 0, Time elapsed: 0.003 sec
 [flexunit] Suite: flexUnitTests.flexUnit4.suites.frameworkSuite.parameterizedSuite.TestJUnitParameterizedFuncVsArrayDataProvider
 [flexunit] Tests run: 9, Failures: 0, Errors: 0, Skipped: 0, Time elapsed: 0.018 sec
 [flexunit] Suite: flexUnitTests.flexUnit1.framework.TestAsynchronous
 [flexunit] Tests run: 12, Failures: 0, Errors: 0, Skipped: 0, Time elapsed: 12.340 sec
 [flexunit] Suite: org.flexunit.runner.notification.cases.FailureCase
 [flexunit] Tests run: 6, Failures: 0, Errors: 0, Skipped: 1, Time elapsed: 0.007 sec
 [flexunit] Suite: flexUnitTests.flexUnit4.suites.frameworkSuite.theorySuite.AsyncTheorySuite
 [flexunit] Tests run: 2, Failures: 0, Errors: 0, Skipped: 0, Time elapsed: 9.398 sec
 [flexunit] Suite: org.flexunit.internals.runners.statements.cases.InvokeMethodCase
 [flexunit] Tests run: 3, Failures: 0, Errors: 0, Skipped: 2, Time elapsed: 0.007 sec
 [flexunit] Suite: org.hamcrest.mxml.collection.ArrayTest
 [flexunit] Tests run: 6, Failures: 0, Errors: 0, Skipped: 0, Time elapsed: 0.081 sec
 [flexunit] Suite: tests.flex.lang.reflect.constructor.ConstructorParamsWithUnresolvedData
 [flexunit] Tests run: 1, Failures: 0, Errors: 0, Skipped: 0, Time elapsed: 0.003 sec
 [flexunit] Suite: org.hamcrest.BaseMatcherTest
 [flexunit] Tests run: 1, Failures: 0, Errors: 0, Skipped: 0, Time elapsed: 0.002 sec
 [flexunit] Suite: tests.org.flexunit.assert.equals.AssertFailNotStrictlyEqual
 [flexunit] Tests run: 4, Failures: 0, Errors: 0, Skipped: 0, Time elapsed: 0.002 sec
 [flexunit] Suite: org.hamcrest.mxml.collection.EveryItemTest
 [flexunit] Tests run: 5, Failures: 0, Errors: 0, Skipped: 0, Time elapsed: 0.006 sec
 [flexunit] Suite: org.hamcrest.mxml.core.AnyOfTest
 [flexunit] Tests run: 5, Failures: 0, Errors: 0, Skipped: 0, Time elapsed: 0.023 sec
 [flexunit] Suite: org.flexunit.internals.runners.statements.cases.StackAndFrameManagementCase
 [flexunit] Tests run: 3, Failures: 0, Errors: 0, Skipped: 2, Time elapsed: 0.006 sec
 [flexunit] Suite: org.flexunit.internals.runners.model.cases.EachTestNotifierCase
 [flexunit] Tests run: 6, Failures: 0, Errors: 0, Skipped: 0, Time elapsed: 0.026 sec
 [flexunit] Suite: org.hamcrest.mxml.number.CloseToTest
 [flexunit] Tests run: 5, Failures: 0, Errors: 0, Skipped: 0, Time elapsed: 0.035 sec
 [flexunit] Suite: org.hamcrest.mxml.core.NotTest
 [flexunit] Tests run: 5, Failures: 0, Errors: 0, Skipped: 0, Time elapsed: 0.017 sec
 [flexunit] Suite: org.flexunit.internals.builders.cases.IgnoredBuilderCase
 [flexunit] Tests run: 3, Failures: 0, Errors: 0, Skipped: 0, Time elapsed: 0.018 sec
 [flexunit] Suite: flexUnitTests.flexUnit4.suites.frameworkSuite.theorySuite.FunctionalTheorySuite
 [flexunit] Tests run: 3, Failures: 0, Errors: 0, Skipped: 0, Time elapsed: 0.090 sec
 [flexunit] Suite: org.hamcrest.mxml.text.EmptyStringTest
 [flexunit] Tests run: 5, Failures: 0, Errors: 0, Skipped: 0, Time elapsed: 0.001 sec
 [flexunit] Suite: org.hamcrest.mxml.collection.ArrayWithSizeTest
 [flexunit] Tests run: 5, Failures: 0, Errors: 0, Skipped: 0, Time elapsed: 0.006 sec
 [flexunit] Suite: org.hamcrest.mxml.core.DescribedAsTest
 [flexunit] Tests run: 5, Failures: 0, Errors: 0, Skipped: 0, Time elapsed: 0.007 sec
 [flexunit] Suite: tests.org.flexunit.token.AsyncTestTokenCase
 [flexunit] Tests run: 10, Failures: 0, Errors: 0, Skipped: 0, Time elapsed: 0.420 sec
 [flexunit] Suite: tests.flex.lang.reflect.method.MethodWithInvalidData
 [flexunit] Tests run: 10, Failures: 0, Errors: 0, Skipped: 0, Time elapsed: 0.023 sec
 [flexunit] Suite: org.hamcrest.core.IsNotTest
 [flexunit] Tests run: 2, Failures: 0, Errors: 0, Skipped: 0, Time elapsed: 0.000 sec
 [flexunit] Suite: flexUnitTests.flexUnit4.suites.frameworkSuite.cases.TestAsynchronousSetUpTearDown
 [flexunit] Tests run: 1, Failures: 0, Errors: 0, Skipped: 0, Time elapsed: 0.314 sec
 [flexunit] Suite: org.flexunit.cases.AssertionErrorCase
 [flexunit] Tests run: 3, Failures: 0, Errors: 0, Skipped: 0, Time elapsed: 0.023 sec
 [flexunit] Suite: org.flexunit.experimental.theories.cases.ParameterSignatureCase
 [flexunit] Tests run: 18, Failures: 0, Errors: 0, Skipped: 0, Time elapsed: 0.828 sec
 [flexunit] Suite: tests.org.flexunit.events.cases.AsyncEventCase
 [flexunit] Tests run: 5, Failures: 0, Errors: 0, Skipped: 0, Time elapsed: 0.018 sec
 [flexunit] Suite: tests.org.flexunit.assert.equals.AssertEqualsFunctionCase
 [flexunit] Tests run: 10, Failures: 0, Errors: 0, Skipped: 0, Time elapsed: 0.003 sec
 [flexunit] Suite: flexUnitTests.flexUnit4.suites.frameworkSuite.rulesSuite.TestRulesBasicImplementation
 [flexunit] Tests run: 4, Failures: 0, Errors: 0, Skipped: 0, Time elapsed: 0.023 sec
 [flexunit] Suite: org.flexunit.internals.builders.cases.FlexUnit4BuilderCase
 [flexunit] Tests run: 1, Failures: 0, Errors: 0, Skipped: 0, Time elapsed: 0.000 sec
 [flexunit] Suite: flexUnitTests.flexUnit4.suites.frameworkSuite.cases.TestSynchronousSetUpTearDown
 [flexunit] Tests run: 4, Failures: 0, Errors: 0, Skipped: 0, Time elapsed: 0.019 sec
 [flexunit] Suite: org.hamcrest.core.AllOfTest
 [flexunit] Tests run: 4, Failures: 0, Errors: 0, Skipped: 0, Time elapsed: 0.049 sec
 [flexunit] Suite: flexUnitTests.flexUnit4.suites.frameworkSuite.theorySuite.TestTheoriesWithBeforeAfter
 [flexunit] Tests run: 1, Failures: 0, Errors: 0, Skipped: 0, Time elapsed: 0.031 sec
 [flexunit] Suite: org.hamcrest.mxml.number.BetweenTest
 [flexunit] Tests run: 5, Failures: 0, Errors: 0, Skipped: 0, Time elapsed: 0.021 sec
 [flexunit] Suite: tests.flex.lang.reflect.constructor.ConstructorParamsWithResolvedData
 [flexunit] Tests run: 6, Failures: 0, Errors: 0, Skipped: 0, Time elapsed: 0.001 sec
 [flexunit] Suite: org.flexunit.cases.AssumeThatCase
 [flexunit] Tests run: 1, Failures: 0, Errors: 0, Skipped: 0, Time elapsed: 0.001 sec
 [flexunit] Suite: org.hamcrest.date.DateBetweenTest
 [flexunit] Tests run: 3, Failures: 0, Errors: 0, Skipped: 0, Time elapsed: 0.001 sec
 [flexunit] Suite: org.hamcrest.mxml.object.EqualToTest
 [flexunit] Tests run: 5, Failures: 0, Errors: 0, Skipped: 0, Time elapsed: 0.003 sec
 [flexunit] Suite: org.hamcrest.mxml.collection.InArrayTest
 [flexunit] Tests run: 5, Failures: 0, Errors: 0, Skipped: 0, Time elapsed: 0.008 sec
 [flexunit] Suite: org.flexunit.internals.runners.model.cases.MultipleFailureExceptionCase
 [flexunit] Tests run: 3, Failures: 0, Errors: 0, Skipped: 0, Time elapsed: 0.001 sec
 [flexunit] Suite: tests.org.flexunit.assert.bool.AssertFalseClassCase
 [flexunit] Tests run: 4, Failures: 0, Errors: 0, Skipped: 0, Time elapsed: 0.005 sec
 [flexunit] Suite: org.hamcrest.object.HasPropertyWithValueTest
 [flexunit] Tests run: 8, Failures: 0, Errors: 0, Skipped: 1, Time elapsed: 0.027 sec
 [flexunit] Suite: org.flexunit.internals.runners.statements.cases.RunAftersCase
 [flexunit] Tests run: 3, Failures: 0, Errors: 0, Skipped: 0, Time elapsed: 0.005 sec
 [flexunit] Suite: org.flexunit.internals.requests.cases.FilterRequestCase
 [flexunit] Tests run: 3, Failures: 0, Errors: 0, Skipped: 1, Time elapsed: 0.006 sec
 [flexunit] Suite: org.flexunit.internals.cases.TraceListenerCase
 [flexunit] Tests run: 5, Failures: 0, Errors: 0, Skipped: 0, Time elapsed: 0.102 sec
 [flexunit] Suite: flexUnitTests.flexUnit4.suites.frameworkSuite.cases.TestBeforeAfterOrderAsync
 [flexunit] Tests run: 2, Failures: 0, Errors: 0, Skipped: 0, Time elapsed: 0.499 sec
 [flexunit] Suite: org.flexunit.reporting.cases.FailureFormatterASCase
 [flexunit] Tests run: 6, Failures: 0, Errors: 0, Skipped: 0, Time elapsed: 0.029 sec
 [flexunit] Suite: tests.org.flexunit.assert.that.AssertThatCase
 [flexunit] Tests run: 2, Failures: 0, Errors: 0, Skipped: 0, Time elapsed: 0.126 sec
 [flexunit] Suite: tests.org.flexunit.assert.equals.AssertFailNotEquals
 [flexunit] Tests run: 4, Failures: 0, Errors: 0, Skipped: 0, Time elapsed: 0.002 sec
 [flexunit] Suite: tests.org.flexunit.assert.equals.AssertStrictlyEqualsFunctionCase
 [flexunit] Tests run: 4, Failures: 0, Errors: 0, Skipped: 0, Time elapsed: 0.063 sec
 [flexunit] Suite: tests.flex.lang.reflect.metadata.metaDataAnnotation.AnnotationWithInvalidData
 [flexunit] Tests run: 6, Failures: 0, Errors: 0, Skipped: 0, Time elapsed: 0.001 sec
 [flexunit] Suite: tests.org.flexunit.runner.util.DescriptionUtilTest
 [flexunit] Tests run: 4, Failures: 0, Errors: 0, Skipped: 0, Time elapsed: 0.025 sec
 [flexunit] Suite: tests.org.flexunit.assert.error.AssertionErrorCase
 [flexunit] Tests run: 3, Failures: 0, Errors: 0, Skipped: 0, Time elapsed: 0.000 sec
 [flexunit] Suite: org.flexunit.experimental.theories.cases.PotentialAssignmentCase
 [flexunit] Tests run: 5, Failures: 0, Errors: 0, Skipped: 0, Time elapsed: 0.031 sec
 [flexunit] Suite: org.flexunit.internals.requests.cases.ClassRequestCase
 [flexunit] Tests run: 1, Failures: 0, Errors: 0, Skipped: 0, Time elapsed: 0.002 sec
 [flexunit] Suite: tests.org.flexunit.assert.nullHandling.AssertNullClassCase
 [flexunit] Tests run: 4, Failures: 0, Errors: 0, Skipped: 0, Time elapsed: 0.002 sec
 [flexunit] Suite: org.hamcrest.object.IsSameTest
 [flexunit] Tests run: 3, Failures: 0, Errors: 0, Skipped: 0, Time elapsed: 0.062 sec
 [flexunit] Suite: flexUnitTests.flexUnit4.suites.frameworkSuite.parameterizedSuite.TestJUnitParameterizedWithAsync
 [flexunit] Tests run: 3, Failures: 0, Errors: 0, Skipped: 0, Time elapsed: 1.955 sec
 [flexunit] Suite: org.hamcrest.mxml.object.HasPropertyWithValueTest
 [flexunit] Tests run: 5, Failures: 0, Errors: 0, Skipped: 0, Time elapsed: 0.030 sec
 [flexunit] Suite: org.hamcrest.object.HasPropertyChainTest
 [flexunit] Tests run: 11, Failures: 0, Errors: 0, Skipped: 0, Time elapsed: 0.006 sec
 [flexunit] 
 [flexunit] Results :
 [flexunit] 
 [flexunit] Tests run: 1,506, Failures: 0, Errors: 0, Skipped: 48, Time elapsed: 55.522 sec
 [flexunit] 
[junitreport] Processing <http://apacheflexbuild.cloudapp.net:8080/job/flex-flexunit/ws/FlexUnit4Test/target/report/xunit/as3/TESTS-TestSuites.xml>
to C:\Users\APACHE~1\AppData\Local\Temp\2\null1601577575
[junitreport] Loading stylesheet jar:file:/C:/Jenkins/tools/hudson.tasks.Ant_AntInstallation/c_apache-ant-1.9.3/lib/ant-junit.jar!/org/apache/tools/ant/taskdefs/optional/junit/xsl/junit-frames.xsl
[junitreport] Transform time: 1776ms
[junitreport] Deleting: C:\Users\APACHE~1\AppData\Local\Temp\2\null1601577575

test-and-instrument:

test:

uilistener:
  [typedef] Could not load definitions from resource org/apache/maven/artifact/ant/antlib.xml.
It could not be found.
  [taskdef] Could not load definitions from resource net/sf/antcontrib/antcontrib.properties.
It could not be found.

init:
     [copy] Copying 1 file to <http://apacheflexbuild.cloudapp.net:8080/job/flex-flexunit/ws/FlexUnit4UIListener/libs>

identify-sdk:
     [echo] Found: Version 4.15.0 build 0

compile-flex3:

compile-flex4:
     [java] Loading configuration file C:\Jenkins\workspace\flex-sdk\frameworks\flex-config.xml
     [java] Apache Flex compc (Component Compiler)
     [java] Version 4.15.0 build 0
     [java] Copyright 2014 The Apache Software Foundation.
     [java] 
     [java] command line: Error: unable to open 'C:\Jenkins\workspace\flex-sdk/frameworks/themes/Halo/halo.swc'
     [java] 
     [java] Use 'compc -help' for information about using the command line.

BUILD FAILED
<http://apacheflexbuild.cloudapp.net:8080/job/flex-flexunit/ws/build.xml>:178: The following
error occurred while executing this line:
<http://apacheflexbuild.cloudapp.net:8080/job/flex-flexunit/ws/FlexUnit4UIListener/build.xml>:116:
Java returned: 1

Total time: 6 minutes 6 seconds
Build step 'Invoke Ant' marked build as failure
Archiving artifacts
Recording test results

Mime
View raw message