flex-commits mailing list archives

Site index · List index
Message view « Date » · « Thread »
Top « Date » · « Thread »
From flex.ci.bui...@gmail.com
Subject Build failed in Jenkins: flex-tlf #260
Date Tue, 30 Dec 2014 11:04:25 GMT
See <http://apacheflexbuild.cloudapp.net:8080/job/flex-tlf/260/changes>

Changes:

[harbs] Ignore bad tab test

[harbs] Fixed another Operation test

[harbs] Fixed case where terminator span was incorrectly being dropped

------------------------------------------
[...truncated 74 lines...]
textLayout_editBar:
    [compc] Loading configuration file C:\Jenkins\workspace\flex-sdk\frameworks\flex-config.xml
    [compc] C:\Jenkins\workspace\flex-tlf\bin\apps\testApps\bin\textLayout_editBar.swc (23171
bytes)

textLayout_ui:
    [compc] Loading configuration file C:\Jenkins\workspace\flex-sdk\frameworks\flex-config.xml
    [compc] C:\Jenkins\workspace\flex-tlf\bin\apps\testApps\bin\textLayout_ui.swc (112804
bytes)

testApps:
    [mxmlc] Loading configuration file C:\Jenkins\workspace\flex-sdk\frameworks\flex-config.xml
    [mxmlc] C:\Jenkins\workspace\flex-tlf\bin\apps\automation_apps\bin\Flow.swf (2184624 bytes)

automation_core:
    [compc] Loading configuration file C:\Jenkins\workspace\flex-sdk\frameworks\flex-config.xml
    [compc] C:\Jenkins\workspace\flex-tlf\bin\apps\automation_apps\bin\automation_core.swc
(34056 bytes)

automation_tests:
    [compc] Loading configuration file C:\Jenkins\workspace\flex-sdk\frameworks\flex-config.xml
    [compc] C:\Jenkins\workspace\flex-tlf\bin\apps\automation_apps\bin\automation_tests.swc
(225145 bytes)

automation_apps:
    [mxmlc] Loading configuration file C:\Jenkins\workspace\flex-sdk\frameworks\flex-config.xml
    [mxmlc] C:\Jenkins\workspace\flex-tlf\bin\apps\automation_apps\bin\VellumUnit.swf (2279699
bytes)
     [copy] Copying 155 files to <http://apacheflexbuild.cloudapp.net:8080/job/flex-tlf/ws/bin/apps/test>

flexunnit_tests:
 [flexunit] Validating task attributes ...
 [flexunit] Generating default values ...
 [flexunit] Using default working dir [<http://apacheflexbuild.cloudapp.net:8080/job/flex-tlf/ws/]>
 [flexunit] Using the following settings for the test run:
 [flexunit] 	FLEX_HOME: [<http://apacheflexbuild.cloudapp.net:8080/job/flex-tlf/ws/../flex-sdk]>
 [flexunit] 	haltonfailure: [true]
 [flexunit] 	headless: [false]
 [flexunit] 	display: [99]
 [flexunit] 	localTrusted: [true]
 [flexunit] 	player: [flash]
 [flexunit] 	port: [1024]
 [flexunit] 	swf: [<http://apacheflexbuild.cloudapp.net:8080/job/flex-tlf/ws/bin/apps/automation_apps/bin/VellumUnit.swf]>
 [flexunit] 	timeout: [60000ms]
 [flexunit] 	toDir: [<http://apacheflexbuild.cloudapp.net:8080/job/flex-tlf/ws/bin/apps/automation_apps/bin]>
 [flexunit] Setting up server process ...
 [flexunit] Entry [<http://apacheflexbuild.cloudapp.net:8080/job/flex-tlf/ws/bin/apps/automation_apps/bin]>
already available in local trust file at [C:\Users\apacheflexbuild\AppData\Roaming\Macromedia\Flash
Player\#Security\FlashPlayerTrust\flexUnit.cfg].
 [flexunit] Executing 'rundll32' with arguments:
 [flexunit] 'url.dll,FileProtocolHandler'
 [flexunit] '<http://apacheflexbuild.cloudapp.net:8080/job/flex-tlf/ws/bin/apps/automation_apps/bin/VellumUnit.swf'>
 [flexunit] 
 [flexunit] The ' characters around the executable and arguments are
 [flexunit] not part of the command.
 [flexunit] 
 [flexunit] Starting server ...
 [flexunit] Opening server socket on port [1024].
 [flexunit] Waiting for client connection ...
 [flexunit] Client connected.
 [flexunit] Setting inbound buffer size to [262144] bytes.
 [flexunit] Receiving data ...
 [flexunit] Sending acknowledgement to player to start sending test data ...
 [flexunit] 
 [flexunit] FlexUnit test contentWidthCheckLongFloat in suite UnitTest.Tests.FloatTest was
ignored.
 [flexunit] FlexUnit test checkColumnGapOnWidthChangeTest ([object Object]) in suite UnitTest.Tests.ContainerAttributeTest
was ignored.
 [flexunit] FlexUnit test paddingBottomTest ([object Object]) in suite UnitTest.Tests.ContainerAttributeTest
failed.
 [flexunit] FlexUnit test checkColumnGapOnWidthChangeTest ([object Object]) in suite UnitTest.Tests.ContainerAttributeTest
was ignored.
 [flexunit] FlexUnit test ShortTextMouseEventRLRTLTest in suite UnitTest.Tests.AllEventTest
was ignored.
 [flexunit] FlexUnit test ShortTextMouseEventRLLTRTest in suite UnitTest.Tests.AllEventTest
was ignored.
 [flexunit] FlexUnit test ShortTextMouseEventTBRTLTest in suite UnitTest.Tests.AllEventTest
was ignored.
 [flexunit] FlexUnit test ShortTextMouseEventTBLTRTest in suite UnitTest.Tests.AllEventTest
was ignored.
 [flexunit] FlexUnit test draggingSelectioinMultiFlows in suite UnitTest.Tests.ContainerTypeTest
was ignored.
 [flexunit] FlexUnit test simpleWithPaddingBottomRight in suite UnitTest.Tests.BoundsAndAlignmentTest
was ignored.
 [flexunit] FlexUnit test simpleMultiParagraphNoTextIndent in suite UnitTest.Tests.BoundsAndAlignmentTest
was ignored.
 [flexunit] FlexUnit test longSimpleMultiParagraph in suite UnitTest.Tests.BoundsAndAlignmentTest
was ignored.
 [flexunit] FlexUnit test simpleMultiParagraph in suite UnitTest.Tests.BoundsAndAlignmentTest
was ignored.
 [flexunit] FlexUnit test simpleMultiParagraphNegTextIndent in suite UnitTest.Tests.BoundsAndAlignmentTest
was ignored.
 [flexunit] FlexUnit test simpleWithPaddingTopLeft in suite UnitTest.Tests.BoundsAndAlignmentTest
was ignored.
 [flexunit] FlexUnit test arrowUp in suite UnitTest.Tests.GeneralFunctionsTest was ignored.
 [flexunit] FlexUnit test arrowDown in suite UnitTest.Tests.GeneralFunctionsTest was ignored.
 [flexunit] FlexUnit test errorThrowing in suite UnitTest.Tests.GeneralFunctionsTest was ignored.
 [flexunit] FlexUnit test testAllEnumProps in suite UnitTest.Tests.AllParaAttributeTest was
ignored.
 [flexunit] FlexUnit test partialCompositionTest (simple in suite UnitTest.Tests.CompositionTest
was ignored.
 [flexunit] FlexUnit test deleteAtContainerStart (simple in suite UnitTest.Tests.CompositionTest
was ignored.
 [flexunit] FlexUnit test partialCompositionTest (asknot in suite UnitTest.Tests.CompositionTest
was ignored.
 [flexunit] FlexUnit test deleteAtContainerStart (asknot in suite UnitTest.Tests.CompositionTest
was ignored.
 [flexunit] FlexUnit test scrollMultipleLinesTest in suite UnitTest.Tests.ScrollingTest was
ignored.
 [flexunit] FlexUnit test twoColumnsTest in suite UnitTest.Tests.ScrollingTest was ignored.
 [flexunit] FlexUnit test applyFormatToElementTest in suite UnitTest.Tests.OperationTest was
ignored.
 [flexunit] FlexUnit test insertTextTest in suite UnitTest.Tests.OperationTest failed.
 [flexunit] FlexUnit test deletePreviousWordTest in suite UnitTest.Tests.OperationTest was
ignored.
 [flexunit] FlexUnit test setFontSizeOutOfBounds in suite UnitTest.Tests.AttributeTest was
ignored.
 [flexunit] FlexUnit test deletePreviousWordDerivedTest in suite UnitTest.Tests.EventOverrideTest
was ignored.
 [flexunit] FlexUnit test keyDownDerivedTest in suite UnitTest.Tests.EventOverrideTest was
ignored.
 [flexunit] FlexUnit test mouseDownDerivedTest in suite UnitTest.Tests.EventOverrideTest was
ignored.
 [flexunit] FlexUnit test mouseMoveDerivedTest in suite UnitTest.Tests.EventOverrideTest was
ignored.
 [flexunit] FlexUnit test deleteNextWordDerivedTest in suite UnitTest.Tests.EventOverrideTest
was ignored.
 [flexunit] FlexUnit test deleteNextDerivedTest in suite UnitTest.Tests.EventOverrideTest
was ignored.
 [flexunit] FlexUnit test deletePreviousDerivedTest in suite UnitTest.Tests.EventOverrideTest
was ignored.
 [flexunit] FlexUnit test textEventDerivedTest in suite UnitTest.Tests.EventOverrideTest was
ignored.
 [flexunit] FlexUnit test focusInDerivedTest in suite UnitTest.Tests.EventOverrideTest was
ignored.
 [flexunit] FlexUnit test activateDerivedTest in suite UnitTest.Tests.EventOverrideTest was
ignored.
 [flexunit] FlexUnit test focusOutDerivedTest in suite UnitTest.Tests.EventOverrideTest was
ignored.
 [flexunit] FlexUnit test deactivateDerivedTest in suite UnitTest.Tests.EventOverrideTest
was ignored.
 [flexunit] FlexUnit test spanElementReplaceTextInvalidPos in suite UnitTest.Tests.ElementOperationTest
was ignored.
 [flexunit] FlexUnit test endTabLongStringTest in suite UnitTest.Tests.TabTest was ignored.
 [flexunit] FlexUnit test noTabStop in suite UnitTest.Tests.TabTest was ignored.
 [flexunit] 
 [flexunit] Stopping server ...
 [flexunit] End of test data reached, sending acknowledgement to player ...
 [flexunit] Closing client connection ...
 [flexunit] Closing server on port [1024] ...
 [flexunit] Analyzing reports ...
 [flexunit] 
 [flexunit] Suite: UnitTest.Tests.OperationTest
 [flexunit] Tests run: 47, Failures: 1, Errors: 0, Skipped: 2, Time elapsed: 16.814 sec
 [flexunit] Suite: UnitTest.Tests.GeneralFunctionsTest
 [flexunit] Tests run: 36, Failures: 0, Errors: 0, Skipped: 3, Time elapsed: 7.287 sec
 [flexunit] Suite: UnitTest.Tests.CrossContainerTest
 [flexunit] Tests run: 1, Failures: 0, Errors: 0, Skipped: 0, Time elapsed: 0.096 sec
 [flexunit] Suite: UnitTest.Tests.AllParaAttributeTest
 [flexunit] Tests run: 6, Failures: 0, Errors: 0, Skipped: 1, Time elapsed: 5.185 sec
 [flexunit] Suite: UnitTest.Tests.TabTest
 [flexunit] Tests run: 19, Failures: 0, Errors: 0, Skipped: 2, Time elapsed: 1.792 sec
 [flexunit] Suite: UnitTest.Tests.EventOverrideTest
 [flexunit] Tests run: 12, Failures: 0, Errors: 0, Skipped: 12, Time elapsed: 0.929 sec
 [flexunit] Suite: UnitTest.Tests.AllContAttributeTest
 [flexunit] Tests run: 6, Failures: 0, Errors: 0, Skipped: 0, Time elapsed: 10.518 sec
 [flexunit] Suite: UnitTest.Tests.AccessibilityMethodsTest
 [flexunit] Tests run: 5, Failures: 0, Errors: 0, Skipped: 0, Time elapsed: 0.488 sec
 [flexunit] Suite: UnitTest.Tests.FactoryImportTest
 [flexunit] Tests run: 1, Failures: 0, Errors: 0, Skipped: 0, Time elapsed: 0.035 sec
 [flexunit] Suite: UnitTest.Tests.AllEventTest
 [flexunit] Tests run: 13, Failures: 0, Errors: 0, Skipped: 4, Time elapsed: 2.038 sec
 [flexunit] Suite: UnitTest.Tests.BoundsAndAlignmentTest
 [flexunit] Tests run: 6, Failures: 0, Errors: 0, Skipped: 6, Time elapsed: 0.432 sec
 [flexunit] Suite: UnitTest.Tests.TextFlowEditTest
 [flexunit] Tests run: 3, Failures: 0, Errors: 0, Skipped: 0, Time elapsed: 0.391 sec
 [flexunit] Suite: UnitTest.Tests.AttributeTest
 [flexunit] Tests run: 44, Failures: 0, Errors: 0, Skipped: 1, Time elapsed: 4.210 sec
 [flexunit] Suite: UnitTest.Tests.FloatTest
 [flexunit] Tests run: 56, Failures: 0, Errors: 0, Skipped: 1, Time elapsed: 74.883 sec
 [flexunit] Suite: UnitTest.Tests.ContainerTypeTest
 [flexunit] Tests run: 22, Failures: 0, Errors: 0, Skipped: 1, Time elapsed: 0.848 sec
 [flexunit] Suite: UnitTest.Tests.ElementOperationTest
 [flexunit] Tests run: 25, Failures: 0, Errors: 0, Skipped: 1, Time elapsed: 4.287 sec
 [flexunit] Suite: UnitTest.Tests.WritingModeTest
 [flexunit] Tests run: 13, Failures: 0, Errors: 0, Skipped: 0, Time elapsed: 1.629 sec
 [flexunit] Suite: UnitTest.Tests.FlowModelTest
 [flexunit] Tests run: 23, Failures: 0, Errors: 0, Skipped: 0, Time elapsed: 3.571 sec
 [flexunit] Suite: UnitTest.Tests.UndoRedoTest
 [flexunit] Tests run: 1, Failures: 0, Errors: 0, Skipped: 0, Time elapsed: 0.104 sec
 [flexunit] Suite: UnitTest.Tests.AllCharAttributeTest
 [flexunit] Tests run: 6, Failures: 0, Errors: 0, Skipped: 0, Time elapsed: 32.602 sec
 [flexunit] Suite: UnitTest.Tests.ScrollingTest
 [flexunit] Tests run: 15, Failures: 0, Errors: 0, Skipped: 2, Time elapsed: 18.378 sec
 [flexunit] Suite: UnitTest.Tests.BoxTest
 [flexunit] Tests run: 13, Failures: 0, Errors: 0, Skipped: 0, Time elapsed: 3.470 sec
 [flexunit] Suite: UnitTest.Tests.ContainerAttributeTest
 [flexunit] Tests run: 31, Failures: 1, Errors: 0, Skipped: 2, Time elapsed: 410.176 sec
 [flexunit] Suite: UnitTest.Tests.CompositionTest
 [flexunit] Tests run: 24, Failures: 0, Errors: 0, Skipped: 4, Time elapsed: 8.486 sec
 [flexunit] 
 [flexunit] Results :
 [flexunit] 
 [flexunit] Tests run: 428, Failures: 2, Errors: 0, Skipped: 42, Time elapsed: 608.649 sec
 [flexunit] 

BUILD FAILED
<http://apacheflexbuild.cloudapp.net:8080/job/flex-tlf/ws/build.xml>:312: FlexUnit tests
failed during the test run.

Total time: 14 minutes 4 seconds
Build step 'Invoke Ant' marked build as failure
Recording test results
ERROR: Publisher hudson.tasks.junit.JUnitResultArchiver aborted due to exception
java.io.IOException: remote file operation failed: <http://apacheflexbuild.cloudapp.net:8080/job/flex-tlf/ws/>
at hudson.remoting.Channel@174ea1b:flex_sdk_slave2: java.io.IOException: Failed to read <http://apacheflexbuild.cloudapp.net:8080/job/flex-tlf/ws/automation_tests/src/UnitTest/Tests/TabTest.as>
Is this really a JUnit report file? Your configuration must be matching too many files
	at hudson.FilePath.act(FilePath.java:977)
	at hudson.FilePath.act(FilePath.java:959)
	at hudson.tasks.junit.JUnitParser.parseResult(JUnitParser.java:90)
	at hudson.tasks.junit.JUnitResultArchiver.parse(JUnitResultArchiver.java:120)
	at hudson.tasks.junit.JUnitResultArchiver.perform(JUnitResultArchiver.java:137)
	at hudson.tasks.BuildStepCompatibilityLayer.perform(BuildStepCompatibilityLayer.java:74)
	at hudson.tasks.BuildStepMonitor$1.perform(BuildStepMonitor.java:20)
	at hudson.model.AbstractBuild$AbstractBuildExecution.perform(AbstractBuild.java:770)
	at hudson.model.AbstractBuild$AbstractBuildExecution.performAllBuildSteps(AbstractBuild.java:734)
	at hudson.model.Build$BuildExecution.post2(Build.java:183)
	at hudson.model.AbstractBuild$AbstractBuildExecution.post(AbstractBuild.java:683)
	at hudson.model.Run.execute(Run.java:1784)
	at hudson.model.FreeStyleBuild.run(FreeStyleBuild.java:43)
	at hudson.model.ResourceController.execute(ResourceController.java:89)
	at hudson.model.Executor.run(Executor.java:240)
Caused by: java.io.IOException: Failed to read <http://apacheflexbuild.cloudapp.net:8080/job/flex-tlf/ws/automation_tests/src/UnitTest/Tests/TabTest.as>
Is this really a JUnit report file? Your configuration must be matching too many files
	at hudson.tasks.junit.TestResult.parse(TestResult.java:290)
	at hudson.tasks.junit.TestResult.parsePossiblyEmpty(TestResult.java:228)
	at hudson.tasks.junit.TestResult.parse(TestResult.java:163)
	at hudson.tasks.junit.TestResult.parse(TestResult.java:146)
	at hudson.tasks.junit.TestResult.<init>(TestResult.java:122)
	at hudson.tasks.junit.JUnitParser$ParseResultCallable.invoke(JUnitParser.java:119)
	at hudson.tasks.junit.JUnitParser$ParseResultCallable.invoke(JUnitParser.java:93)
	at hudson.FilePath$FileCallableWrapper.call(FilePath.java:2677)
	at hudson.remoting.UserRequest.perform(UserRequest.java:118)
	at hudson.remoting.UserRequest.perform(UserRequest.java:48)
	at hudson.remoting.Request$2.run(Request.java:328)
	at hudson.remoting.InterceptingExecutorService$1.call(InterceptingExecutorService.java:72)
	at java.util.concurrent.FutureTask.run(Unknown Source)
	at java.util.concurrent.ThreadPoolExecutor.runWorker(Unknown Source)
	at java.util.concurrent.ThreadPoolExecutor$Worker.run(Unknown Source)
	at hudson.remoting.Engine$1$1.run(Engine.java:63)
	at java.lang.Thread.run(Unknown Source)
	at ......remote call to flex_sdk_slave2(Native Method)
	at hudson.remoting.Channel.attachCallSiteStackTrace(Channel.java:1356)
	at hudson.remoting.UserResponse.retrieve(UserRequest.java:221)
	at hudson.remoting.Channel.call(Channel.java:752)
	at hudson.FilePath.act(FilePath.java:970)
	... 14 more
Caused by: org.dom4j.DocumentException: Error on line 1 of document file:///c:/Jenkins/workspace/flex-tlf/automation_tests/src/UnitTest/Tests/TabTest.as
: Content is not allowed in prolog. Nested exception: Content is not allowed in prolog.
	at org.dom4j.io.SAXReader.read(SAXReader.java:482)
	at org.dom4j.io.SAXReader.read(SAXReader.java:264)
	at hudson.tasks.junit.SuiteResult.parse(SuiteResult.java:123)
	at hudson.tasks.junit.TestResult.parse(TestResult.java:282)
	at hudson.tasks.junit.TestResult.parsePossiblyEmpty(TestResult.java:228)
	at hudson.tasks.junit.TestResult.parse(TestResult.java:163)
	at hudson.tasks.junit.TestResult.parse(TestResult.java:146)
	at hudson.tasks.junit.TestResult.<init>(TestResult.java:122)
	at hudson.tasks.junit.JUnitParser$ParseResultCallable.invoke(JUnitParser.java:119)
	at hudson.tasks.junit.JUnitParser$ParseResultCallable.invoke(JUnitParser.java:93)
	at hudson.FilePath$FileCallableWrapper.call(FilePath.java:2677)
	at hudson.remoting.UserRequest.perform(UserRequest.java:118)
	at hudson.remoting.UserRequest.perform(UserRequest.java:48)
	at hudson.remoting.Request$2.run(Request.java:328)
	at hudson.remoting.InterceptingExecutorService$1.call(InterceptingExecutorService.java:72)
	at java.util.concurrent.FutureTask.run(Unknown Source)
	at java.util.concurrent.ThreadPoolExecutor.runWorker(Unknown Source)
	at java.util.concurrent.ThreadPoolExecutor$Worker.run(Unknown Source)
	at hudson.remoting.Engine$1$1.run(Engine.java:63)
	at java.lang.Thread.run(Unknown Source)
Caused by: org.xml.sax.SAXParseException; systemId: file:///c:/Jenkins/workspace/flex-tlf/automation_tests/src/UnitTest/Tests/TabTest.as;
lineNumber: 1; columnNumber: 1; Content is not allowed in prolog.
	at com.sun.org.apache.xerces.internal.util.ErrorHandlerWrapper.createSAXParseException(Unknown
Source)
	at com.sun.org.apache.xerces.internal.util.ErrorHandlerWrapper.fatalError(Unknown Source)
	at com.sun.org.apache.xerces.internal.impl.XMLErrorReporter.reportError(Unknown Source)
	at com.sun.org.apache.xerces.internal.impl.XMLErrorReporter.reportError(Unknown Source)
	at com.sun.org.apache.xerces.internal.impl.XMLScanner.reportFatalError(Unknown Source)
	at com.sun.org.apache.xerces.internal.impl.XMLDocumentScannerImpl$PrologDriver.next(Unknown
Source)
	at com.sun.org.apache.xerces.internal.impl.XMLDocumentScannerImpl.next(Unknown Source)
	at com.sun.org.apache.xerces.internal.impl.XMLNSDocumentScannerImpl.next(Unknown Source)
	at com.sun.org.apache.xerces.internal.impl.XMLDocumentFragmentScannerImpl.scanDocument(Unknown
Source)
	at com.sun.org.apache.xerces.internal.parsers.XML11Configuration.parse(Unknown Source)
	at com.sun.org.apache.xerces.internal.parsers.XML11Configuration.parse(Unknown Source)
	at com.sun.org.apache.xerces.internal.parsers.XMLParser.parse(Unknown Source)
	at com.sun.org.apache.xerces.internal.parsers.AbstractSAXParser.parse(Unknown Source)
	at com.sun.org.apache.xerces.internal.jaxp.SAXParserImpl$JAXPSAXParser.parse(Unknown Source)
	at org.dom4j.io.SAXReader.read(SAXReader.java:465)
	... 19 more

Mime
View raw message