flex-commits mailing list archives

Site index · List index
Message view « Date » · « Thread »
Top « Date » · « Thread »
From flex.ci.bui...@gmail.com
Subject Build failed in Jenkins: (release-candidate)_flex-sdk #3
Date Wed, 08 Oct 2014 07:31:59 GMT
See <http://apacheflexbuild.cloudapp.net:8080/job/(release-candidate)_flex-sdk/3/>

------------------------------------------
[...truncated 2455 lines...]

samples:

main:

main:

ide:

create-config-files:
     [copy] Copying 3 files to <http://apacheflexbuild.cloudapp.net:8080/job/(release-candidate)_flex-sdk/ws/ide/flashbuilder/config>

expand-config-tokens:
     [echo] expanding {airHome} and {playerglobalHome} tokens

main:

post-build:

main:
     [echo] ant main target completed on 10/08/2014 07:28:11 AM

frameworks-rsls:
     [echo] build.number is 20141008
    [unzip] Expanding: <http://apacheflexbuild.cloudapp.net:8080/job/(release-candidate)_flex-sdk/ws/frameworks/libs/textLayout.swc>
into <http://apacheflexbuild.cloudapp.net:8080/job/(release-candidate)_flex-sdk/ws/frameworks/rsls>
     [java] Loading configuration file C:\Jenkins\workspace\(release-candidate)_flex-sdk\frameworks\flex-config.xml
     [java] <http://apacheflexbuild.cloudapp.net:8080/job/(release-candidate)_flex-sdk/ws/frameworks/rsls/library.swf>
(492116 bytes)
     [java] <http://apacheflexbuild.cloudapp.net:8080/job/(release-candidate)_flex-sdk/ws/frameworks/rsls/textLayout_4.13.0.20141008.swf>
(342323 bytes)
   [delete] Deleting: <http://apacheflexbuild.cloudapp.net:8080/job/(release-candidate)_flex-sdk/ws/frameworks/rsls/library.swf>
     [java] Digest information was updated in C:\Jenkins\workspace\(release-candidate)_flex-sdk\frameworks\libs\textLayout.swc
    [unzip] Expanding: <http://apacheflexbuild.cloudapp.net:8080/job/(release-candidate)_flex-sdk/ws/frameworks/libs/framework.swc>
into <http://apacheflexbuild.cloudapp.net:8080/job/(release-candidate)_flex-sdk/ws/frameworks/rsls>
     [java] Loading configuration file C:\Jenkins\workspace\(release-candidate)_flex-sdk\frameworks\flex-config.xml
     [java] <http://apacheflexbuild.cloudapp.net:8080/job/(release-candidate)_flex-sdk/ws/frameworks/rsls/library.swf>
(799428 bytes)
     [java] <http://apacheflexbuild.cloudapp.net:8080/job/(release-candidate)_flex-sdk/ws/frameworks/rsls/framework_4.13.0.20141008.swf>
(559805 bytes)
   [delete] Deleting: <http://apacheflexbuild.cloudapp.net:8080/job/(release-candidate)_flex-sdk/ws/frameworks/rsls/library.swf>
     [java] Digest information was updated in C:\Jenkins\workspace\(release-candidate)_flex-sdk\frameworks\libs\framework.swc
    [unzip] Expanding: <http://apacheflexbuild.cloudapp.net:8080/job/(release-candidate)_flex-sdk/ws/frameworks/libs/mx/mx.swc>
into <http://apacheflexbuild.cloudapp.net:8080/job/(release-candidate)_flex-sdk/ws/frameworks/rsls>
     [java] Loading configuration file C:\Jenkins\workspace\(release-candidate)_flex-sdk\frameworks\flex-config.xml
     [java] <http://apacheflexbuild.cloudapp.net:8080/job/(release-candidate)_flex-sdk/ws/frameworks/rsls/library.swf>
(811862 bytes)
     [java] <http://apacheflexbuild.cloudapp.net:8080/job/(release-candidate)_flex-sdk/ws/frameworks/rsls/mx_4.13.0.20141008.swf>
(530251 bytes)
   [delete] Deleting: <http://apacheflexbuild.cloudapp.net:8080/job/(release-candidate)_flex-sdk/ws/frameworks/rsls/library.swf>
     [java] Digest information was updated in C:\Jenkins\workspace\(release-candidate)_flex-sdk\frameworks\libs\mx\mx.swc
    [unzip] Expanding: <http://apacheflexbuild.cloudapp.net:8080/job/(release-candidate)_flex-sdk/ws/frameworks/libs/rpc.swc>
into <http://apacheflexbuild.cloudapp.net:8080/job/(release-candidate)_flex-sdk/ws/frameworks/rsls>
     [java] Loading configuration file C:\Jenkins\workspace\(release-candidate)_flex-sdk\frameworks\flex-config.xml
     [java] <http://apacheflexbuild.cloudapp.net:8080/job/(release-candidate)_flex-sdk/ws/frameworks/rsls/library.swf>
(299698 bytes)
     [java] <http://apacheflexbuild.cloudapp.net:8080/job/(release-candidate)_flex-sdk/ws/frameworks/rsls/rpc_4.13.0.20141008.swf>
(209060 bytes)
   [delete] Deleting: <http://apacheflexbuild.cloudapp.net:8080/job/(release-candidate)_flex-sdk/ws/frameworks/rsls/library.swf>
     [java] Digest information was updated in C:\Jenkins\workspace\(release-candidate)_flex-sdk\frameworks\libs\rpc.swc
    [unzip] Expanding: <http://apacheflexbuild.cloudapp.net:8080/job/(release-candidate)_flex-sdk/ws/frameworks/libs/spark.swc>
into <http://apacheflexbuild.cloudapp.net:8080/job/(release-candidate)_flex-sdk/ws/frameworks/rsls>
     [java] Loading configuration file C:\Jenkins\workspace\(release-candidate)_flex-sdk\frameworks\flex-config.xml
     [java] <http://apacheflexbuild.cloudapp.net:8080/job/(release-candidate)_flex-sdk/ws/frameworks/rsls/library.swf>
(1275337 bytes)
     [java] <http://apacheflexbuild.cloudapp.net:8080/job/(release-candidate)_flex-sdk/ws/frameworks/rsls/spark_4.13.0.20141008.swf>
(838721 bytes)
   [delete] Deleting: <http://apacheflexbuild.cloudapp.net:8080/job/(release-candidate)_flex-sdk/ws/frameworks/rsls/library.swf>
     [java] Digest information was updated in C:\Jenkins\workspace\(release-candidate)_flex-sdk\frameworks\libs\spark.swc
    [unzip] Expanding: <http://apacheflexbuild.cloudapp.net:8080/job/(release-candidate)_flex-sdk/ws/frameworks/libs/sparkskins.swc>
into <http://apacheflexbuild.cloudapp.net:8080/job/(release-candidate)_flex-sdk/ws/frameworks/rsls>
     [java] Loading configuration file C:\Jenkins\workspace\(release-candidate)_flex-sdk\frameworks\flex-config.xml
     [java] <http://apacheflexbuild.cloudapp.net:8080/job/(release-candidate)_flex-sdk/ws/frameworks/rsls/library.swf>
(110382 bytes)
     [java] <http://apacheflexbuild.cloudapp.net:8080/job/(release-candidate)_flex-sdk/ws/frameworks/rsls/sparkskins_4.13.0.20141008.swf>
(68896 bytes)
   [delete] Deleting: <http://apacheflexbuild.cloudapp.net:8080/job/(release-candidate)_flex-sdk/ws/frameworks/rsls/library.swf>
     [java] Digest information was updated in C:\Jenkins\workspace\(release-candidate)_flex-sdk\frameworks\libs\sparkskins.swc
    [unzip] Expanding: <http://apacheflexbuild.cloudapp.net:8080/job/(release-candidate)_flex-sdk/ws/frameworks/libs/charts.swc>
into <http://apacheflexbuild.cloudapp.net:8080/job/(release-candidate)_flex-sdk/ws/frameworks/rsls>
     [java] Loading configuration file C:\Jenkins\workspace\(release-candidate)_flex-sdk\frameworks\flex-config.xml
     [java] <http://apacheflexbuild.cloudapp.net:8080/job/(release-candidate)_flex-sdk/ws/frameworks/rsls/library.swf>
(381370 bytes)
     [java] <http://apacheflexbuild.cloudapp.net:8080/job/(release-candidate)_flex-sdk/ws/frameworks/rsls/charts_4.13.0.20141008.swf>
(255418 bytes)
   [delete] Deleting: <http://apacheflexbuild.cloudapp.net:8080/job/(release-candidate)_flex-sdk/ws/frameworks/rsls/library.swf>
     [java] Digest information was updated in C:\Jenkins\workspace\(release-candidate)_flex-sdk\frameworks\libs\charts.swc
    [unzip] Expanding: <http://apacheflexbuild.cloudapp.net:8080/job/(release-candidate)_flex-sdk/ws/frameworks/libs/advancedgrids.swc>
into <http://apacheflexbuild.cloudapp.net:8080/job/(release-candidate)_flex-sdk/ws/frameworks/rsls>
     [java] Loading configuration file C:\Jenkins\workspace\(release-candidate)_flex-sdk\frameworks\flex-config.xml
     [java] <http://apacheflexbuild.cloudapp.net:8080/job/(release-candidate)_flex-sdk/ws/frameworks/rsls/library.swf>
(342413 bytes)
     [java] <http://apacheflexbuild.cloudapp.net:8080/job/(release-candidate)_flex-sdk/ws/frameworks/rsls/advancedgrids_4.13.0.20141008.swf>
(245901 bytes)
   [delete] Deleting: <http://apacheflexbuild.cloudapp.net:8080/job/(release-candidate)_flex-sdk/ws/frameworks/rsls/library.swf>
     [java] Digest information was updated in C:\Jenkins\workspace\(release-candidate)_flex-sdk\frameworks\libs\advancedgrids.swc
    [unzip] Expanding: <http://apacheflexbuild.cloudapp.net:8080/job/(release-candidate)_flex-sdk/ws/frameworks/libs/spark_dmv.swc>
into <http://apacheflexbuild.cloudapp.net:8080/job/(release-candidate)_flex-sdk/ws/frameworks/rsls>
     [java] Loading configuration file C:\Jenkins\workspace\(release-candidate)_flex-sdk\frameworks\flex-config.xml
     [java] <http://apacheflexbuild.cloudapp.net:8080/job/(release-candidate)_flex-sdk/ws/frameworks/rsls/library.swf>
(7292 bytes)
     [java] <http://apacheflexbuild.cloudapp.net:8080/job/(release-candidate)_flex-sdk/ws/frameworks/rsls/spark_dmv_4.13.0.20141008.swf>
(6050 bytes)
   [delete] Deleting: <http://apacheflexbuild.cloudapp.net:8080/job/(release-candidate)_flex-sdk/ws/frameworks/rsls/library.swf>
     [java] Digest information was updated in C:\Jenkins\workspace\(release-candidate)_flex-sdk\frameworks\libs\spark_dmv.swc
    [unzip] Expanding: <http://apacheflexbuild.cloudapp.net:8080/job/(release-candidate)_flex-sdk/ws/frameworks/libs/apache.swc>
into <http://apacheflexbuild.cloudapp.net:8080/job/(release-candidate)_flex-sdk/ws/frameworks/rsls>
     [java] Loading configuration file C:\Jenkins\workspace\(release-candidate)_flex-sdk\frameworks\flex-config.xml
     [java] <http://apacheflexbuild.cloudapp.net:8080/job/(release-candidate)_flex-sdk/ws/frameworks/rsls/library.swf>
(14208 bytes)
     [java] <http://apacheflexbuild.cloudapp.net:8080/job/(release-candidate)_flex-sdk/ws/frameworks/rsls/apache_4.13.0.20141008.swf>
(11160 bytes)
   [delete] Deleting: <http://apacheflexbuild.cloudapp.net:8080/job/(release-candidate)_flex-sdk/ws/frameworks/rsls/library.swf>
     [java] Digest information was updated in C:\Jenkins\workspace\(release-candidate)_flex-sdk\frameworks\libs\apache.swc
    [unzip] Expanding: <http://apacheflexbuild.cloudapp.net:8080/job/(release-candidate)_flex-sdk/ws/frameworks/libs/experimental.swc>
into <http://apacheflexbuild.cloudapp.net:8080/job/(release-candidate)_flex-sdk/ws/frameworks/rsls>
     [java] Loading configuration file C:\Jenkins\workspace\(release-candidate)_flex-sdk\frameworks\flex-config.xml
     [java] <http://apacheflexbuild.cloudapp.net:8080/job/(release-candidate)_flex-sdk/ws/frameworks/rsls/library.swf>
(183650 bytes)
     [java] <http://apacheflexbuild.cloudapp.net:8080/job/(release-candidate)_flex-sdk/ws/frameworks/rsls/experimental_4.13.0.20141008.swf>
(122422 bytes)
   [delete] Deleting: <http://apacheflexbuild.cloudapp.net:8080/job/(release-candidate)_flex-sdk/ws/frameworks/rsls/library.swf>
     [java] Digest information was updated in C:\Jenkins\workspace\(release-candidate)_flex-sdk\frameworks\libs\experimental.swc
    [unzip] Expanding: <http://apacheflexbuild.cloudapp.net:8080/job/(release-candidate)_flex-sdk/ws/frameworks/libs/experimental_mobile.swc>
into <http://apacheflexbuild.cloudapp.net:8080/job/(release-candidate)_flex-sdk/ws/frameworks/rsls>
     [java] Loading configuration file C:\Jenkins\workspace\(release-candidate)_flex-sdk\frameworks\flex-config.xml
     [java] <http://apacheflexbuild.cloudapp.net:8080/job/(release-candidate)_flex-sdk/ws/frameworks/rsls/library.swf>
(22722 bytes)
     [java] <http://apacheflexbuild.cloudapp.net:8080/job/(release-candidate)_flex-sdk/ws/frameworks/rsls/experimental_mobile_4.13.0.20141008.swf>
(17103 bytes)
   [delete] Deleting: <http://apacheflexbuild.cloudapp.net:8080/job/(release-candidate)_flex-sdk/ws/frameworks/rsls/library.swf>
     [java] Digest information was updated in C:\Jenkins\workspace\(release-candidate)_flex-sdk\frameworks\libs\experimental_mobile.swc

sample-themes:

clean:

compile:
     [echo] Compiling samples/themes/arcade/arcade.swc
    [mxmlc] Loading configuration file C:\Jenkins\workspace\(release-candidate)_flex-sdk\frameworks\flex-config.xml
    [mxmlc] C:\Jenkins\workspace\(release-candidate)_flex-sdk\samples\themes\arcade\src\assets\flex_skins.swf
(35393 bytes)
    [compc] Loading configuration file C:\Jenkins\workspace\(release-candidate)_flex-sdk\frameworks\flex-config.xml
    [compc] C:\Jenkins\workspace\(release-candidate)_flex-sdk\samples\themes\arcade\arcade.swc
(167680 bytes)

main:

clean:

compile:
     [echo] Compiling samples/themes/cobalt/cobalt.swc
    [compc] <http://apacheflexbuild.cloudapp.net:8080/job/(release-candidate)_flex-sdk/ws/samples/themes/cobalt/build.xml>:67:
java.io.IOException: Cannot run program "C:\Program Files\Java\jdk1.7.0_55\jre\bin\java.exe"
(in directory "<http://apacheflexbuild.cloudapp.net:8080/job/(release-candidate)_flex-sdk/ws/samples/themes/cobalt")>:
CreateProcess error=206, The filename or extension is too long
    [compc] 	at org.apache.tools.ant.taskdefs.Java.fork(Java.java:798)
    [compc] 	at org.apache.tools.ant.taskdefs.Java.executeJava(Java.java:214)
    [compc] 	at org.apache.tools.ant.taskdefs.Java.executeJava(Java.java:135)
    [compc] 	at flex.ant.FlexTask.executeOutOfProcess(FlexTask.java:260)
    [compc] 	at flex.ant.FlexTask.execute(FlexTask.java:238)
    [compc] 	at org.apache.tools.ant.UnknownElement.execute(UnknownElement.java:292)
    [compc] 	at sun.reflect.GeneratedMethodAccessor4.invoke(Unknown Source)
    [compc] 	at sun.reflect.DelegatingMethodAccessorImpl.invoke(DelegatingMethodAccessorImpl.java:43)
    [compc] 	at java.lang.reflect.Method.invoke(Method.java:606)
    [compc] 	at org.apache.tools.ant.dispatch.DispatchUtils.execute(DispatchUtils.java:106)
    [compc] 	at org.apache.tools.ant.Task.perform(Task.java:348)
    [compc] 	at org.apache.tools.ant.Target.execute(Target.java:435)
    [compc] 	at org.apache.tools.ant.Target.performTasks(Target.java:456)
    [compc] 	at org.apache.tools.ant.Project.executeSortedTargets(Project.java:1393)
    [compc] 	at org.apache.tools.ant.helper.SingleCheckExecutor.executeTargets(SingleCheckExecutor.java:38)
    [compc] 	at org.apache.tools.ant.Project.executeTargets(Project.java:1248)
    [compc] 	at org.apache.tools.ant.taskdefs.Ant.execute(Ant.java:440)
    [compc] 	at org.apache.tools.ant.UnknownElement.execute(UnknownElement.java:292)
    [compc] 	at sun.reflect.GeneratedMethodAccessor4.invoke(Unknown Source)
    [compc] 	at sun.reflect.DelegatingMethodAccessorImpl.invoke(DelegatingMethodAccessorImpl.java:43)
    [compc] 	at java.lang.reflect.Method.invoke(Method.java:606)
    [compc] 	at org.apache.tools.ant.dispatch.DispatchUtils.execute(DispatchUtils.java:106)
    [compc] 	at org.apache.tools.ant.Task.perform(Task.java:348)
    [compc] 	at org.apache.tools.ant.Target.execute(Target.java:435)
    [compc] 	at org.apache.tools.ant.Target.performTasks(Target.java:456)
    [compc] 	at org.apache.tools.ant.Project.executeSortedTargets(Project.java:1393)
    [compc] 	at org.apache.tools.ant.Project.executeTarget(Project.java:1364)
    [compc] 	at org.apache.tools.ant.helper.DefaultExecutor.executeTargets(DefaultExecutor.java:41)
    [compc] 	at org.apache.tools.ant.Project.executeTargets(Project.java:1248)
    [compc] 	at org.apache.tools.ant.Main.runBuild(Main.java:851)
    [compc] 	at org.apache.tools.ant.Main.startAnt(Main.java:235)
    [compc] 	at org.apache.tools.ant.launch.Launcher.run(Launcher.java:280)
    [compc] 	at org.apache.tools.ant.launch.Launcher.main(Launcher.java:109)
    [compc] Caused by: java.io.IOException: Cannot run program "C:\Program Files\Java\jdk1.7.0_55\jre\bin\java.exe"
(in directory "<http://apacheflexbuild.cloudapp.net:8080/job/(release-candidate)_flex-sdk/ws/samples/themes/cobalt")>:
CreateProcess error=206, The filename or extension is too long
    [compc] 	at java.lang.ProcessBuilder.start(ProcessBuilder.java:1041)
    [compc] 	at java.lang.Runtime.exec(Runtime.java:617)
    [compc] 	at org.apache.tools.ant.taskdefs.launcher.Java13CommandLauncher.exec(Java13CommandLauncher.java:41)
    [compc] 	at org.apache.tools.ant.taskdefs.Execute.launch(Execute.java:428)
    [compc] 	at org.apache.tools.ant.taskdefs.Execute.execute(Execute.java:442)
    [compc] 	at org.apache.tools.ant.taskdefs.Java.fork(Java.java:791)
    [compc] 	... 32 more
    [compc] Caused by: java.io.IOException: CreateProcess error=206, The filename or extension
is too long
    [compc] 	at java.lang.ProcessImpl.create(Native Method)
    [compc] 	at java.lang.ProcessImpl.<init>(ProcessImpl.java:385)
    [compc] 	at java.lang.ProcessImpl.start(ProcessImpl.java:136)
    [compc] 	at java.lang.ProcessBuilder.start(ProcessBuilder.java:1022)
    [compc] 	... 37 more

main:

clean:

compile:
     [echo] Compiling samples/themes/graphite/graphite.swc
    [mxmlc] Loading configuration file C:\Jenkins\workspace\(release-candidate)_flex-sdk\frameworks\flex-config.xml
    [mxmlc] C:\Jenkins\workspace\(release-candidate)_flex-sdk\samples\themes\graphite\src\assets\flex_skins.swf
(482186 bytes)
    [compc] Loading configuration file C:\Jenkins\workspace\(release-candidate)_flex-sdk\frameworks\flex-config.xml
    [compc] C:\Jenkins\workspace\(release-candidate)_flex-sdk\samples\themes\graphite\graphite.swc
(653585 bytes)

main:

runtime-setup:

mustella-setup:
 [loadfile] <http://apacheflexbuild.cloudapp.net:8080/job/(release-candidate)_flex-sdk/ws/mustella/local.properties>
doesn't exist

echo-info:
     [echo]     JAVA_HOME:               C:\Program Files\Java\jdk1.7.0_55
     [echo]     FLASHPLAYER_DEBUGGER:    c:\Adobe\flashPlayer\11.7\flashplayerdebugger.exe
     [echo]     sdk.dir:                 <http://apacheflexbuild.cloudapp.net:8080/job/(release-candidate)_flex-sdk/ws/mustella/..>
     [echo]     mustella exclude file:   c:/Jenkins/workspace/(release-candidate)_flex-sdk/mustella/tests/ExcludeListWin.txt

get_date:

get_os:

setup_mac:

setup_windows:
     [echo] doing windows setup
     [echo] homepath: C:\Users\apacheflexbuild 
     [echo] trace output file: 1 
     [echo]  player is c:\Adobe\flashPlayer\11.7\flashplayerdebugger.exe 

setup_linux:

db_time:
    [mkdir] Created dir: <http://apacheflexbuild.cloudapp.net:8080/job/(release-candidate)_flex-sdk/ws/mustella/tmp>
     [echo] db_time=2014/10/08 07:30:49

get_mobile_data:

device_fail:

handle_mobile_config:

echo-browser:

echo-apollo:

setup:
     [echo] player is c:\Adobe\flashPlayer\11.7\flashplayerdebugger.exe 
     [echo] fileset: 

makemustellaswc:
 [loadfile] <http://apacheflexbuild.cloudapp.net:8080/job/(release-candidate)_flex-sdk/ws/mustella/local.properties>
doesn't exist

compilemustellaswc:
     [exec] 'c:\Jenkins\workspace\' is not recognized as an internal or external command,
     [exec] operable program or batch file.
     [exec] Result: 1
    [javac] <http://apacheflexbuild.cloudapp.net:8080/job/(release-candidate)_flex-sdk/ws/build.xml>:1442:
warning: 'includeantruntime' was not set, defaulting to build.sysclasspath=last; set to false
for repeatable builds
    [javac] Compiling 1 source file

load-task:

basictests:
    [mxmlc] Loading configuration file C:\Jenkins\workspace\(release-candidate)_flex-sdk\frameworks\flex-config.xml
    [mxmlc] Loading configuration file C:\Jenkins\workspace\(release-candidate)_flex-sdk\frameworks\tests\basicTests\BasicTests-config.xml
    [mxmlc] Error: Unable to resolve a class for include: ExitWhenDone.
    [mxmlc] 
    [mxmlc] Error: Unable to resolve a class for include: SetShowRTE.
    [mxmlc] 
    [mxmlc] Error: Unable to resolve a class for include: SendFormattedResultsToLog.
    [mxmlc] 

BUILD FAILED
<http://apacheflexbuild.cloudapp.net:8080/job/(release-candidate)_flex-sdk/ws/build.xml>:1489:
mxmlc task failed.

Total time: 25 minutes 43 seconds
Build step 'Invoke Ant' marked build as failure
Archiving artifacts
No JDK named ‘(Default)’ found
No JDK named ‘(Default)’ found

Mime
View raw message