flex-commits mailing list archives

Site index · List index
Message view « Date » · « Thread »
Top « Date » · « Thread »
From flex.ci.bui...@gmail.com
Subject Build failed in Jenkins: flex-blazeds #78
Date Fri, 22 Aug 2014 03:46:29 GMT
See <http://apacheflexbuild.cloudapp.net:8080/job/flex-blazeds/78/>

------------------------------------------
Started by timer
Building remotely on flex_sdk_slave2 in workspace <http://apacheflexbuild.cloudapp.net:8080/job/flex-blazeds/ws/>
No JDK named ‘(Default)’ found
Fetching changes from the remote Git repository
Fetching upstream changes from https://git-wip-us.apache.org/repos/asf/flex-blazeds.git
Checking out Revision 2bd9f0a4b59d77f154bc9369b99b5f7d345d39dc (origin/master)
No JDK named ‘(Default)’ found
Parsing POMs
maven31-agent.jar already up to date
maven31-interceptor.jar already up to date
maven3-interceptor-commons.jar already up to date
[modules] $ java -cp c:\Jenkins\maven31-agent.jar;c:\Jenkins\tools\hudson.tasks.Maven_MavenInstallation\Maven_3.2.1\boot\plexus-classworlds-2.5.1.jar;c:\Jenkins\tools\hudson.tasks.Maven_MavenInstallation\Maven_3.2.1/conf/logging
jenkins.maven3.agent.Maven31Main c:\Jenkins\tools\hudson.tasks.Maven_MavenInstallation\Maven_3.2.1
C:\Users\apacheflexbuild\AppData\LocalLow\Sun\Java\Deployment\cache\6.0\2\32f78882-50304996
c:\Jenkins\maven31-interceptor.jar c:\Jenkins\maven3-interceptor-commons.jar 49352
<===[JENKINS REMOTING CAPACITY]===>   channel started
Executing Maven:  -B -f <http://apacheflexbuild.cloudapp.net:8080/job/flex-blazeds/ws/modules/pom.xml>
clean verify
[INFO] Scanning for projects...
[WARNING] 
[WARNING] Some problems were encountered while building the effective model for org.apache.flex.blazeds:flex-messaging-common:jar:4.7.0.0-SNAPSHOT
[WARNING] 'build.plugins.plugin.version' for org.apache.maven.plugins:maven-compiler-plugin
is missing. @ org.apache.flex.blazeds:blazeds:4.7.0.0-SNAPSHOT, C:\Jenkins\workspace\flex-blazeds\modules\pom.xml,
line 84, column 21
[WARNING] 'build.plugins.plugin.version' for org.apache.maven.plugins:maven-surefire-plugin
is missing. @ org.apache.flex.blazeds:blazeds:4.7.0.0-SNAPSHOT, C:\Jenkins\workspace\flex-blazeds\modules\pom.xml,
line 92, column 12
[WARNING] 'build.plugins.plugin.version' for org.apache.maven.plugins:maven-source-plugin
is missing. @ org.apache.flex.blazeds:blazeds:4.7.0.0-SNAPSHOT, C:\Jenkins\workspace\flex-blazeds\modules\pom.xml,
line 102, column 12
[WARNING] 'repositories.repository.layout' for dist.codehaus.org uses the unsupported value
'legacy', artifact resolution might fail. @ org.apache.flex.blazeds:blazeds:4.7.0.0-SNAPSHOT,
C:\Jenkins\workspace\flex-blazeds\modules\pom.xml, line 216, column 12
[WARNING] 'repositories.repository.layout' for apache uses the unsupported value 'legacy',
artifact resolution might fail. @ org.apache.flex.blazeds:blazeds:4.7.0.0-SNAPSHOT, C:\Jenkins\workspace\flex-blazeds\modules\pom.xml,
line 222, column 12
[WARNING] 'pluginRepositories.pluginRepository.layout' for dist.codehaus.org uses the unsupported
value 'legacy', artifact resolution might fail. @ org.apache.flex.blazeds:blazeds:4.7.0.0-SNAPSHOT,
C:\Jenkins\workspace\flex-blazeds\modules\pom.xml, line 268, column 12
[WARNING] 
[WARNING] Some problems were encountered while building the effective model for org.apache.flex.blazeds:flex-messaging-core:jar:4.7.0.0-SNAPSHOT
[WARNING] 'build.plugins.plugin.version' for org.apache.maven.plugins:maven-compiler-plugin
is missing. @ org.apache.flex.blazeds:blazeds:4.7.0.0-SNAPSHOT, C:\Jenkins\workspace\flex-blazeds\modules\pom.xml,
line 84, column 21
[WARNING] 'build.plugins.plugin.version' for org.apache.maven.plugins:maven-surefire-plugin
is missing. @ org.apache.flex.blazeds:blazeds:4.7.0.0-SNAPSHOT, C:\Jenkins\workspace\flex-blazeds\modules\pom.xml,
line 92, column 12
[WARNING] 'build.plugins.plugin.version' for org.apache.maven.plugins:maven-source-plugin
is missing. @ org.apache.flex.blazeds:blazeds:4.7.0.0-SNAPSHOT, C:\Jenkins\workspace\flex-blazeds\modules\pom.xml,
line 102, column 12
[WARNING] 'dependencies.dependency.systemPath' for com.sun:tools:jar refers to a non-existing
file C:\Program Files (x86)\Java\jre7\..\lib\tools.jar. Please verify that you run Maven using
a JDK and not just a JRE. @ line 73, column 25
[WARNING] 'repositories.repository.layout' for dist.codehaus.org uses the unsupported value
'legacy', artifact resolution might fail. @ org.apache.flex.blazeds:blazeds:4.7.0.0-SNAPSHOT,
C:\Jenkins\workspace\flex-blazeds\modules\pom.xml, line 216, column 12
[WARNING] 'repositories.repository.layout' for apache uses the unsupported value 'legacy',
artifact resolution might fail. @ org.apache.flex.blazeds:blazeds:4.7.0.0-SNAPSHOT, C:\Jenkins\workspace\flex-blazeds\modules\pom.xml,
line 222, column 12
[WARNING] 'pluginRepositories.pluginRepository.layout' for dist.codehaus.org uses the unsupported
value 'legacy', artifact resolution might fail. @ org.apache.flex.blazeds:blazeds:4.7.0.0-SNAPSHOT,
C:\Jenkins\workspace\flex-blazeds\modules\pom.xml, line 268, column 12
[WARNING] 
[WARNING] Some problems were encountered while building the effective model for org.apache.flex.blazeds:flex-messaging-proxy:jar:4.7.0.0-SNAPSHOT
[WARNING] 'build.plugins.plugin.version' for org.apache.maven.plugins:maven-compiler-plugin
is missing. @ org.apache.flex.blazeds:blazeds:4.7.0.0-SNAPSHOT, C:\Jenkins\workspace\flex-blazeds\modules\pom.xml,
line 84, column 21
[WARNING] 'build.plugins.plugin.version' for org.apache.maven.plugins:maven-surefire-plugin
is missing. @ org.apache.flex.blazeds:blazeds:4.7.0.0-SNAPSHOT, C:\Jenkins\workspace\flex-blazeds\modules\pom.xml,
line 92, column 12
[WARNING] 'build.plugins.plugin.version' for org.apache.maven.plugins:maven-source-plugin
is missing. @ org.apache.flex.blazeds:blazeds:4.7.0.0-SNAPSHOT, C:\Jenkins\workspace\flex-blazeds\modules\pom.xml,
line 102, column 12
[WARNING] 'repositories.repository.layout' for dist.codehaus.org uses the unsupported value
'legacy', artifact resolution might fail. @ org.apache.flex.blazeds:blazeds:4.7.0.0-SNAPSHOT,
C:\Jenkins\workspace\flex-blazeds\modules\pom.xml, line 216, column 12
[WARNING] 'repositories.repository.layout' for apache uses the unsupported value 'legacy',
artifact resolution might fail. @ org.apache.flex.blazeds:blazeds:4.7.0.0-SNAPSHOT, C:\Jenkins\workspace\flex-blazeds\modules\pom.xml,
line 222, column 12
[WARNING] 'pluginRepositories.pluginRepository.layout' for dist.codehaus.org uses the unsupported
value 'legacy', artifact resolution might fail. @ org.apache.flex.blazeds:blazeds:4.7.0.0-SNAPSHOT,
C:\Jenkins\workspace\flex-blazeds\modules\pom.xml, line 268, column 12
[WARNING] 
[WARNING] Some problems were encountered while building the effective model for org.apache.flex.blazeds:flex-messaging-remoting:jar:4.7.0.0-SNAPSHOT
[WARNING] 'build.plugins.plugin.version' for org.apache.maven.plugins:maven-compiler-plugin
is missing. @ org.apache.flex.blazeds:blazeds:4.7.0.0-SNAPSHOT, C:\Jenkins\workspace\flex-blazeds\modules\pom.xml,
line 84, column 21
[WARNING] 'build.plugins.plugin.version' for org.apache.maven.plugins:maven-surefire-plugin
is missing. @ org.apache.flex.blazeds:blazeds:4.7.0.0-SNAPSHOT, C:\Jenkins\workspace\flex-blazeds\modules\pom.xml,
line 92, column 12
[WARNING] 'build.plugins.plugin.version' for org.apache.maven.plugins:maven-source-plugin
is missing. @ org.apache.flex.blazeds:blazeds:4.7.0.0-SNAPSHOT, C:\Jenkins\workspace\flex-blazeds\modules\pom.xml,
line 102, column 12
[WARNING] 'repositories.repository.layout' for dist.codehaus.org uses the unsupported value
'legacy', artifact resolution might fail. @ org.apache.flex.blazeds:blazeds:4.7.0.0-SNAPSHOT,
C:\Jenkins\workspace\flex-blazeds\modules\pom.xml, line 216, column 12
[WARNING] 'repositories.repository.layout' for apache uses the unsupported value 'legacy',
artifact resolution might fail. @ org.apache.flex.blazeds:blazeds:4.7.0.0-SNAPSHOT, C:\Jenkins\workspace\flex-blazeds\modules\pom.xml,
line 222, column 12
[WARNING] 'pluginRepositories.pluginRepository.layout' for dist.codehaus.org uses the unsupported
value 'legacy', artifact resolution might fail. @ org.apache.flex.blazeds:blazeds:4.7.0.0-SNAPSHOT,
C:\Jenkins\workspace\flex-blazeds\modules\pom.xml, line 268, column 12
[WARNING] 
[WARNING] Some problems were encountered while building the effective model for org.apache.flex.blazeds:flex-messaging-opt-tomcat7:jar:4.7.0.0-SNAPSHOT
[WARNING] 'build.plugins.plugin.version' for org.apache.maven.plugins:maven-surefire-plugin
is missing. @ org.apache.flex.blazeds:blazeds:4.7.0.0-SNAPSHOT, C:\Jenkins\workspace\flex-blazeds\modules\pom.xml,
line 92, column 12
[WARNING] 'build.plugins.plugin.version' for org.apache.maven.plugins:maven-source-plugin
is missing. @ org.apache.flex.blazeds:blazeds:4.7.0.0-SNAPSHOT, C:\Jenkins\workspace\flex-blazeds\modules\pom.xml,
line 102, column 12
[WARNING] 'repositories.repository.layout' for dist.codehaus.org uses the unsupported value
'legacy', artifact resolution might fail. @ org.apache.flex.blazeds:blazeds:4.7.0.0-SNAPSHOT,
C:\Jenkins\workspace\flex-blazeds\modules\pom.xml, line 216, column 12
[WARNING] 'repositories.repository.layout' for apache uses the unsupported value 'legacy',
artifact resolution might fail. @ org.apache.flex.blazeds:blazeds:4.7.0.0-SNAPSHOT, C:\Jenkins\workspace\flex-blazeds\modules\pom.xml,
line 222, column 12
[WARNING] 'pluginRepositories.pluginRepository.layout' for dist.codehaus.org uses the unsupported
value 'legacy', artifact resolution might fail. @ org.apache.flex.blazeds:blazeds:4.7.0.0-SNAPSHOT,
C:\Jenkins\workspace\flex-blazeds\modules\pom.xml, line 268, column 12
[WARNING] 
[WARNING] Some problems were encountered while building the effective model for org.apache.flex.blazeds:flex-messaging-opt-tomcat6:jar:4.7.0.0-SNAPSHOT
[WARNING] 'build.plugins.plugin.version' for org.apache.maven.plugins:maven-surefire-plugin
is missing. @ org.apache.flex.blazeds:blazeds:4.7.0.0-SNAPSHOT, C:\Jenkins\workspace\flex-blazeds\modules\pom.xml,
line 92, column 12
[WARNING] 'build.plugins.plugin.version' for org.apache.maven.plugins:maven-source-plugin
is missing. @ org.apache.flex.blazeds:blazeds:4.7.0.0-SNAPSHOT, C:\Jenkins\workspace\flex-blazeds\modules\pom.xml,
line 102, column 12
[WARNING] 'repositories.repository.layout' for dist.codehaus.org uses the unsupported value
'legacy', artifact resolution might fail. @ org.apache.flex.blazeds:blazeds:4.7.0.0-SNAPSHOT,
C:\Jenkins\workspace\flex-blazeds\modules\pom.xml, line 216, column 12
[WARNING] 'repositories.repository.layout' for apache uses the unsupported value 'legacy',
artifact resolution might fail. @ org.apache.flex.blazeds:blazeds:4.7.0.0-SNAPSHOT, C:\Jenkins\workspace\flex-blazeds\modules\pom.xml,
line 222, column 12
[WARNING] 'pluginRepositories.pluginRepository.layout' for dist.codehaus.org uses the unsupported
value 'legacy', artifact resolution might fail. @ org.apache.flex.blazeds:blazeds:4.7.0.0-SNAPSHOT,
C:\Jenkins\workspace\flex-blazeds\modules\pom.xml, line 268, column 12
[WARNING] 
[WARNING] Some problems were encountered while building the effective model for org.apache.flex.blazeds:flex-messaging-opt-tomcat4:jar:4.7.0.0-SNAPSHOT
[WARNING] 'build.plugins.plugin.version' for org.apache.maven.plugins:maven-surefire-plugin
is missing. @ org.apache.flex.blazeds:blazeds:4.7.0.0-SNAPSHOT, C:\Jenkins\workspace\flex-blazeds\modules\pom.xml,
line 92, column 12
[WARNING] 'build.plugins.plugin.version' for org.apache.maven.plugins:maven-source-plugin
is missing. @ org.apache.flex.blazeds:blazeds:4.7.0.0-SNAPSHOT, C:\Jenkins\workspace\flex-blazeds\modules\pom.xml,
line 102, column 12
[WARNING] 'repositories.repository.layout' for dist.codehaus.org uses the unsupported value
'legacy', artifact resolution might fail. @ org.apache.flex.blazeds:blazeds:4.7.0.0-SNAPSHOT,
C:\Jenkins\workspace\flex-blazeds\modules\pom.xml, line 216, column 12
[WARNING] 'repositories.repository.layout' for apache uses the unsupported value 'legacy',
artifact resolution might fail. @ org.apache.flex.blazeds:blazeds:4.7.0.0-SNAPSHOT, C:\Jenkins\workspace\flex-blazeds\modules\pom.xml,
line 222, column 12
[WARNING] 'pluginRepositories.pluginRepository.layout' for dist.codehaus.org uses the unsupported
value 'legacy', artifact resolution might fail. @ org.apache.flex.blazeds:blazeds:4.7.0.0-SNAPSHOT,
C:\Jenkins\workspace\flex-blazeds\modules\pom.xml, line 268, column 12
[WARNING] 
[WARNING] Some problems were encountered while building the effective model for org.apache.flex.blazeds:flex-messaging-opt:pom:4.7.0.0-SNAPSHOT
[WARNING] 'build.plugins.plugin.version' for org.apache.maven.plugins:maven-surefire-plugin
is missing. @ org.apache.flex.blazeds:blazeds:4.7.0.0-SNAPSHOT, C:\Jenkins\workspace\flex-blazeds\modules\pom.xml,
line 92, column 12
[WARNING] 'build.plugins.plugin.version' for org.apache.maven.plugins:maven-source-plugin
is missing. @ org.apache.flex.blazeds:blazeds:4.7.0.0-SNAPSHOT, C:\Jenkins\workspace\flex-blazeds\modules\pom.xml,
line 102, column 12
[WARNING] 'repositories.repository.layout' for dist.codehaus.org uses the unsupported value
'legacy', artifact resolution might fail. @ org.apache.flex.blazeds:blazeds:4.7.0.0-SNAPSHOT,
C:\Jenkins\workspace\flex-blazeds\modules\pom.xml, line 216, column 12
[WARNING] 'repositories.repository.layout' for apache uses the unsupported value 'legacy',
artifact resolution might fail. @ org.apache.flex.blazeds:blazeds:4.7.0.0-SNAPSHOT, C:\Jenkins\workspace\flex-blazeds\modules\pom.xml,
line 222, column 12
[WARNING] 'pluginRepositories.pluginRepository.layout' for dist.codehaus.org uses the unsupported
value 'legacy', artifact resolution might fail. @ org.apache.flex.blazeds:blazeds:4.7.0.0-SNAPSHOT,
C:\Jenkins\workspace\flex-blazeds\modules\pom.xml, line 268, column 12
[WARNING] 
[WARNING] Some problems were encountered while building the effective model for org.apache.flex.blazeds:flex-messaging-testsuite:jar:4.7.0.0-SNAPSHOT
[WARNING] 'build.plugins.plugin.version' for org.apache.maven.plugins:maven-deploy-plugin
is missing. @ line 75, column 21
[WARNING] 'build.plugins.plugin.version' for org.apache.maven.plugins:maven-compiler-plugin
is missing. @ org.apache.flex.blazeds:blazeds:4.7.0.0-SNAPSHOT, C:\Jenkins\workspace\flex-blazeds\modules\pom.xml,
line 84, column 21
[WARNING] 'build.plugins.plugin.version' for org.apache.maven.plugins:maven-surefire-plugin
is missing. @ org.apache.flex.blazeds:blazeds:4.7.0.0-SNAPSHOT, C:\Jenkins\workspace\flex-blazeds\modules\pom.xml,
line 92, column 12
[WARNING] 'build.plugins.plugin.version' for org.apache.maven.plugins:maven-source-plugin
is missing. @ org.apache.flex.blazeds:blazeds:4.7.0.0-SNAPSHOT, C:\Jenkins\workspace\flex-blazeds\modules\pom.xml,
line 102, column 12
[WARNING] 'repositories.repository.layout' for dist.codehaus.org uses the unsupported value
'legacy', artifact resolution might fail. @ org.apache.flex.blazeds:blazeds:4.7.0.0-SNAPSHOT,
C:\Jenkins\workspace\flex-blazeds\modules\pom.xml, line 216, column 12
[WARNING] 'repositories.repository.layout' for apache uses the unsupported value 'legacy',
artifact resolution might fail. @ org.apache.flex.blazeds:blazeds:4.7.0.0-SNAPSHOT, C:\Jenkins\workspace\flex-blazeds\modules\pom.xml,
line 222, column 12
[WARNING] 'pluginRepositories.pluginRepository.layout' for dist.codehaus.org uses the unsupported
value 'legacy', artifact resolution might fail. @ org.apache.flex.blazeds:blazeds:4.7.0.0-SNAPSHOT,
C:\Jenkins\workspace\flex-blazeds\modules\pom.xml, line 268, column 12
[WARNING] 
[WARNING] Some problems were encountered while building the effective model for org.apache.flex.blazeds:blazeds:pom:4.7.0.0-SNAPSHOT
[WARNING] 'build.plugins.plugin.version' for org.apache.maven.plugins:maven-compiler-plugin
is missing. @ line 84, column 21
[WARNING] 'build.plugins.plugin.version' for org.apache.maven.plugins:maven-surefire-plugin
is missing. @ line 92, column 12
[WARNING] 'build.plugins.plugin.version' for org.apache.maven.plugins:maven-source-plugin
is missing. @ line 102, column 12
[WARNING] 'repositories.repository.layout' for dist.codehaus.org uses the unsupported value
'legacy', artifact resolution might fail. @ line 216, column 12
[WARNING] 'repositories.repository.layout' for apache uses the unsupported value 'legacy',
artifact resolution might fail. @ line 222, column 12
[WARNING] 'pluginRepositories.pluginRepository.layout' for dist.codehaus.org uses the unsupported
value 'legacy', artifact resolution might fail. @ line 268, column 12
[WARNING] 
[WARNING] It is highly recommended to fix these problems because they threaten the stability
of your build.
[WARNING] 
[WARNING] For this reason, future Maven versions might no longer support building such malformed
projects.
[WARNING] 
[INFO] ------------------------------------------------------------------------
[INFO] Reactor Build Order:
[INFO] 
[INFO] Apache Flex: BlazeDS
[INFO] flex-messaging-common
[INFO] flex-messaging-core
[INFO] flex-messaging-proxy
[INFO] flex-messaging-remoting
[INFO] flex-messaging-opt
[INFO] flex-messaging-opt-tomcat7
[INFO] flex-messaging-opt-tomcat6
[INFO] flex-messaging-opt-tomcat4
[INFO] flex-messaging-testsuite
[INFO] 
[INFO] Using the builder org.apache.maven.lifecycle.internal.builder.singlethreaded.SingleThreadedBuilder
with a thread count of 1
[INFO]                                                                         
[INFO] ------------------------------------------------------------------------
[INFO] Building Apache Flex: BlazeDS 4.7.0.0-SNAPSHOT
[INFO] ------------------------------------------------------------------------
[INFO] Downloading: https://repository.sonatype.org/content/repositories/central/org/apache/maven/plugins/maven-compiler-plugin/maven-metadata.xml
[INFO] Downloading: http://mc-repo.googlecode.com/svn/maven2/releases/org/apache/maven/plugins/maven-compiler-plugin/maven-metadata.xml
[INFO] Downloading: http://repository.codehaus.org/org/apache/maven/plugins/maven-compiler-plugin/maven-metadata.xml
[WARNING] Could not transfer metadata org.apache.maven.plugins:maven-compiler-plugin/maven-metadata.xml
from/to dist.codehaus.org (http://dist.codehaus.org): No connector available to access repository
dist.codehaus.org (http://dist.codehaus.org) of type legacy using the available factories
WagonRepositoryConnectorFactory
[INFO] Downloading: https://repository.sonatype.org/content/repositories/central/org/apache/maven/plugins/maven-surefire-plugin/maven-metadata.xml
[INFO] Downloading: http://mc-repo.googlecode.com/svn/maven2/releases/org/apache/maven/plugins/maven-surefire-plugin/maven-metadata.xml
[INFO] Downloading: http://repository.codehaus.org/org/apache/maven/plugins/maven-surefire-plugin/maven-metadata.xml
[WARNING] Could not transfer metadata org.apache.maven.plugins:maven-surefire-plugin/maven-metadata.xml
from/to dist.codehaus.org (http://dist.codehaus.org): No connector available to access repository
dist.codehaus.org (http://dist.codehaus.org) of type legacy using the available factories
WagonRepositoryConnectorFactory
[INFO] Downloading: https://repository.sonatype.org/content/repositories/central/org/apache/maven/plugins/maven-source-plugin/maven-metadata.xml
[INFO] Downloading: http://mc-repo.googlecode.com/svn/maven2/releases/org/apache/maven/plugins/maven-source-plugin/maven-metadata.xml
[INFO] Downloading: http://repository.codehaus.org/org/apache/maven/plugins/maven-source-plugin/maven-metadata.xml
[WARNING] Could not transfer metadata org.apache.maven.plugins:maven-source-plugin/maven-metadata.xml
from/to dist.codehaus.org (http://dist.codehaus.org): No connector available to access repository
dist.codehaus.org (http://dist.codehaus.org) of type legacy using the available factories
WagonRepositoryConnectorFactory
[INFO] 
[INFO] --- maven-clean-plugin:2.5:clean (default-clean) @ blazeds ---
[INFO] 
[INFO] >>> maven-source-plugin:2.2.1:jar (attach-sources) @ blazeds >>>
[WARNING] Failed to getClass for org.apache.maven.plugin.source.SourceJarMojo
[INFO] 
[INFO] <<< maven-source-plugin:2.2.1:jar (attach-sources) @ blazeds <<<
[INFO] 
[INFO] --- maven-source-plugin:2.2.1:jar (attach-sources) @ blazeds ---
[INFO]                                                                         
[INFO] ------------------------------------------------------------------------
[INFO] Building flex-messaging-common 4.7.0.0-SNAPSHOT
[INFO] ------------------------------------------------------------------------
[WARNING] Failure to transfer org.apache.maven.plugins:maven-source-plugin/maven-metadata.xml
from http://dist.codehaus.org was cached in the local repository, resolution will not be reattempted
until the update interval of dist.codehaus.org has elapsed or updates are forced. Original
error: Could not transfer metadata org.apache.maven.plugins:maven-source-plugin/maven-metadata.xml
from/to dist.codehaus.org (http://dist.codehaus.org): No connector available to access repository
dist.codehaus.org (http://dist.codehaus.org) of type legacy using the available factories
WagonRepositoryConnectorFactory
[INFO] 
[INFO] --- maven-clean-plugin:2.5:clean (default-clean) @ flex-messaging-common ---
[INFO] Deleting C:\Jenkins\workspace\flex-blazeds\modules\common\target
[INFO] 
[INFO] --- maven-resources-plugin:2.6:resources (default-resources) @ flex-messaging-common
---
[INFO] Using 'UTF-8' encoding to copy filtered resources.
[INFO] Copying 1 resource
[INFO] 
[INFO] --- maven-compiler-plugin:2.5.1:compile (default-compile) @ flex-messaging-common ---
[INFO] Compiling 47 source files to C:\Jenkins\workspace\flex-blazeds\modules\common\target\classes
[INFO] ------------------------------------------------------------------------
[INFO] Reactor Summary:
[INFO] 
[INFO] Apache Flex: BlazeDS .............................. SUCCESS [  3.923 s]
[INFO] flex-messaging-common ............................. FAILURE [  0.715 s]
[INFO] flex-messaging-core ............................... SKIPPED
[INFO] flex-messaging-proxy .............................. SKIPPED
[INFO] flex-messaging-remoting ........................... SKIPPED
[INFO] flex-messaging-opt ................................ SKIPPED
[INFO] flex-messaging-opt-tomcat7 ........................ SKIPPED
[INFO] flex-messaging-opt-tomcat6 ........................ SKIPPED
[INFO] flex-messaging-opt-tomcat4 ........................ SKIPPED
[INFO] flex-messaging-testsuite .......................... SKIPPED
[INFO] ------------------------------------------------------------------------
[INFO] BUILD FAILURE
[INFO] ------------------------------------------------------------------------
[INFO] Total time: 5.924 s
[INFO] Finished at: 2014-08-22T03:46:28+00:00
[INFO] Final Memory: 11M/26M
[INFO] ------------------------------------------------------------------------
Waiting for Jenkins to finish collecting data
[ERROR] Failed to execute goal org.apache.maven.plugins:maven-compiler-plugin:2.5.1:compile
(default-compile) on project flex-messaging-common: Fatal error compiling: tools.jar not found:
C:\Program Files (x86)\Java\jre7\..\lib\tools.jar -> [Help 1]
[ERROR] 
[ERROR] To see the full stack trace of the errors, re-run Maven with the -e switch.
[ERROR] Re-run Maven using the -X switch to enable full debug logging.
[ERROR] 
[ERROR] For more information about the errors and possible solutions, please read the following
articles:
[ERROR] [Help 1] http://cwiki.apache.org/confluence/display/MAVEN/MojoExecutionException
[ERROR] 
[ERROR] After correcting the problems, you can resume the build with the command
[ERROR]   mvn <goals> -rf :flex-messaging-common
[JENKINS] Archiving C:\Jenkins\workspace\flex-blazeds\modules\proxy\pom.xml to org.apache.flex.blazeds/flex-messaging-proxy/4.7.0.0-SNAPSHOT/flex-messaging-proxy-4.7.0.0-SNAPSHOT.pom
[JENKINS] Archiving C:\Jenkins\workspace\flex-blazeds\modules\opt\poms\tomcat7\pom.xml to
org.apache.flex.blazeds/flex-messaging-opt-tomcat7/4.7.0.0-SNAPSHOT/flex-messaging-opt-tomcat7-4.7.0.0-SNAPSHOT.pom
[JENKINS] Archiving C:\Jenkins\workspace\flex-blazeds\modules\common\pom.xml to org.apache.flex.blazeds/flex-messaging-common/4.7.0.0-SNAPSHOT/flex-messaging-common-4.7.0.0-SNAPSHOT.pom
[JENKINS] Archiving <http://apacheflexbuild.cloudapp.net:8080/job/flex-blazeds/ws/modules/pom.xml>
to org.apache.flex.blazeds/blazeds/4.7.0.0-SNAPSHOT/blazeds-4.7.0.0-SNAPSHOT.pom
[JENKINS] Archiving C:\Jenkins\workspace\flex-blazeds\modules\opt\poms\tomcat6\pom.xml to
org.apache.flex.blazeds/flex-messaging-opt-tomcat6/4.7.0.0-SNAPSHOT/flex-messaging-opt-tomcat6-4.7.0.0-SNAPSHOT.pom
[JENKINS] Archiving C:\Jenkins\workspace\flex-blazeds\modules\remoting\pom.xml to org.apache.flex.blazeds/flex-messaging-remoting/4.7.0.0-SNAPSHOT/flex-messaging-remoting-4.7.0.0-SNAPSHOT.pom
[JENKINS] Archiving C:\Jenkins\workspace\flex-blazeds\modules\opt\poms\tomcat4\pom.xml to
org.apache.flex.blazeds/flex-messaging-opt-tomcat4/4.7.0.0-SNAPSHOT/flex-messaging-opt-tomcat4-4.7.0.0-SNAPSHOT.pom
[JENKINS] Archiving C:\Jenkins\workspace\flex-blazeds\modules\core\pom.xml to org.apache.flex.blazeds/flex-messaging-core/4.7.0.0-SNAPSHOT/flex-messaging-core-4.7.0.0-SNAPSHOT.pom
[JENKINS] Archiving C:\Jenkins\workspace\flex-blazeds\modules\opt\pom.xml to org.apache.flex.blazeds/flex-messaging-opt/4.7.0.0-SNAPSHOT/flex-messaging-opt-4.7.0.0-SNAPSHOT.pom
[JENKINS] Archiving C:\Jenkins\workspace\flex-blazeds\modules\testsuite\pom.xml to org.apache.flex.blazeds/flex-messaging-testsuite/4.7.0.0-SNAPSHOT/flex-messaging-testsuite-4.7.0.0-SNAPSHOT.pom
channel stopped

Mime
View raw message