flex-commits mailing list archives

Site index · List index
Message view « Date » · « Thread »
Top « Date » · « Thread »
From flex.ci.bui...@gmail.com
Subject Build failed in Jenkins: flex-flexunit #16
Date Thu, 24 Apr 2014 22:37:41 GMT
See <http://apacheflexbuild.cloudapp.net:8080/job/flex-flexunit/16/changes>

Changes:

[Alex Harui] extra slash is a problem on Windows

------------------------------------------
Started by an SCM change
Building remotely on flex-sdk slave in workspace <http://apacheflexbuild.cloudapp.net:8080/job/flex-flexunit/ws/>
Fetching changes from the remote Git repository
Fetching upstream changes from https://git-wip-us.apache.org/repos/asf/flex-flexunit.git
Checking out Revision 75806a66eb7ca86693b2754d143ac005bb90e499 (origin/develop)
Deleting old artifacts from #10
[flex-flexunit] $ cmd.exe /C '"c:\Jenkins\tools\hudson.tasks.Ant_AntInstallation\c_apache-ant-1.9.3\bin\ant.bat
-file jenkins.xml clean main && exit %%ERRORLEVEL%%"'
Buildfile: <http://apacheflexbuild.cloudapp.net:8080/job/flex-flexunit/ws/jenkins.xml>

clean:
   [delete] Deleting directory <http://apacheflexbuild.cloudapp.net:8080/job/flex-flexunit/ws/jenkins/temp>
   [delete] Deleting directory <http://apacheflexbuild.cloudapp.net:8080/job/flex-flexunit/ws/jenkins/player>
   [delete] Deleting directory <http://apacheflexbuild.cloudapp.net:8080/job/flex-flexunit/ws/jenkins>

init:
    [mkdir] Created dir: <http://apacheflexbuild.cloudapp.net:8080/job/flex-flexunit/ws/jenkins>
    [mkdir] Created dir: <http://apacheflexbuild.cloudapp.net:8080/job/flex-flexunit/ws/jenkins/temp>

playerglobal-check:

playerglobal-settarget:

playerglobal10.1-download:

playerglobal11.1-download:
    [mkdir] Created dir: <http://apacheflexbuild.cloudapp.net:8080/job/flex-flexunit/ws/jenkins/player/11.1>
      [get] Getting: http://download.macromedia.com/pub/flashplayer/updaters/11/playerglobal11_1.swc
      [get] To: <http://apacheflexbuild.cloudapp.net:8080/job/flex-flexunit/ws/jenkins/player/11.1/playerglobal.swc>

playerglobal-download:

thirdparty-downloads:

main:

BUILD SUCCESSFUL
Total time: 1 minute 46 seconds
[flex-flexunit] $ cmd /c call C:\Users\APACHE~1\AppData\Local\Temp\2\hudson2188619964207549895.bat

<http://apacheflexbuild.cloudapp.net:8080/job/flex-flexunit/ws/>mkdir> jenkins\temp\flex-sdk


<http://apacheflexbuild.cloudapp.net:8080/job/flex-flexunit/ws/>cd> <http://apacheflexbuild.cloudapp.net:8080/job/flex-flexunit/ws/../flex-sdk-release/ide/flashbuilder/>


c:\Jenkins\workspace\flex-sdk-release\ide\flashbuilder>makeApacheFlexForIDE.bat <http://apacheflexbuild.cloudapp.net:8080/job/flex-flexunit/ws/jenkins/temp/flex-sdk>
-Dbuild.noprompt=true 
Copying the Apache Flex SDK from ..\.. to "<http://apacheflexbuild.cloudapp.net:8080/job/flex-flexunit/ws/jenkins/temp/flex-sdk">
64164 File(s) copied
Missing value for property build.noprompt
Downloading and unzipping Adobe AIR Runtime Kit for Windows from "http://airdownload.adobe.com/air/win/download/4.0/AdobeAIRSDK.zip"
to "<http://apacheflexbuild.cloudapp.net:8080/job/flex-flexunit/ws/jenkins/temp/flex-sdk">
Downloading Adobe Flash Player playerglobal.swc from "http://fpdownload.macromedia.com/get/flashplayer/updaters/11/playerglobal11_1.swc"
to "<http://apacheflexbuild.cloudapp.net:8080/job/flex-flexunit/ws/jenkins/temp/flex-sdk/frameworks/libs/player/11.1/playerglobal.swc">
Downloading Adobe Flash Player playerglobal.swc from "http://fpdownload.macromedia.com/get/flashplayer/updaters/11/playerglobal12_0.swc"
to "<http://apacheflexbuild.cloudapp.net:8080/job/flex-flexunit/ws/jenkins/temp/flex-sdk/frameworks/libs/player/12.0/playerglobal.swc">
Installing frameworks config files configured for use with Adobe Flash Builder
<http://apacheflexbuild.cloudapp.net:8080/job/flex-flexunit/ws/jenkins/temp/flex-sdk/ide/flashbuilder/config/air-config.xml>
<http://apacheflexbuild.cloudapp.net:8080/job/flex-flexunit/ws/jenkins/temp/flex-sdk/ide/flashbuilder/config/airmobile-config.xml>
<http://apacheflexbuild.cloudapp.net:8080/job/flex-flexunit/ws/jenkins/temp/flex-sdk/ide/flashbuilder/config/flex-config.xml>
        3 file(s) copied.
[flex-flexunit] $ cmd.exe /C '"c:\Jenkins\tools\hudson.tasks.Ant_AntInstallation\c_apache-ant-1.9.3\bin\ant.bat
-file build.xml -Dbuild.noprompt=true thirdparty-downloads package && exit %%ERRORLEVEL%%"'
Buildfile: <http://apacheflexbuild.cloudapp.net:8080/job/flex-flexunit/ws/build.xml>

thirdparty-downloads:

prepare:

maven-ant-tasks-jar-check:

maven-ant-tasks-jar:

ant-contrib-check:

ant-contrib-jar:

main:
  [typedef] Could not load definitions from resource org/apache/maven/artifact/ant/antlib.xml.
It could not be found.
  [taskdef] Could not load definitions from resource net/sf/antcontrib/antcontrib.properties.
It could not be found.

thirdparty-downloads:

prepare:

junit-jar-check:

junit-jar:

ant-jar-check:

ant-jar:

ant-launcher-jar-check:

ant-launcher-jar:

ant-testutil-jar-check:

ant-testutil-jar:

dom4j-jar-check:

dom4j-jar:

jaxen-jar-check:

jaxen-jar:

main:
  [typedef] Could not load definitions from resource org/apache/maven/artifact/ant/antlib.xml.
It could not be found.
  [taskdef] Could not load definitions from resource net/sf/antcontrib/antcontrib.properties.
It could not be found.

thirdparty-downloads:

prepare:

flexunit1lib-swc-check:

flexunit1lib-swc:

hamcrest-swc-check:

hamcrest-swc:

main:
  [typedef] Could not load definitions from resource org/apache/maven/artifact/ant/antlib.xml.
It could not be found.
  [taskdef] Could not load definitions from resource net/sf/antcontrib/antcontrib.properties.
It could not be found.

thirdparty-downloads:

prepare:

fluint-swc-check:

fluint-swc:

main:

thirdparty-downloads:

prepare:

flexunit1lib-swc-check:

flexunit1lib-swc:
     [echo] Obtaining libs/FlexUnit1Lib.swc

flexunit1lib-swc-check:

flexunit1lib-download-swc:

download-swc:
      [get] Getting: https://github.com/flexunit/flexunit/raw/master/FlexUnit4Test/libs/FlexUnit1Lib.swc
      [get] To: <http://apacheflexbuild.cloudapp.net:8080/job/flex-flexunit/ws/FlexUnit4Test/libs/FlexUnit1Lib.swc>
      [get] https://github.com/flexunit/flexunit/raw/master/FlexUnit4Test/libs/FlexUnit1Lib.swc
moved to https://raw.githubusercontent.com/flexunit/flexunit/master/FlexUnit4Test/libs/FlexUnit1Lib.swc

fail-with-message:

hamcrest-swc-check:

hamcrest-swc:
     [echo] Obtaining lib/hamcrest-as3-flex-1.1.3.swc

download-zip:
    [mkdir] Created dir: <http://apacheflexbuild.cloudapp.net:8080/job/flex-flexunit/ws/FlexUnit4Test/in>
      [get] Getting: http://cloud.github.com/downloads/drewbourne/hamcrest-as3/hamcrest-as3-flex-1.1.3.zip
      [get] To: <http://apacheflexbuild.cloudapp.net:8080/job/flex-flexunit/ws/FlexUnit4Test/in/hamcrest-as3-flex-1.1.3.zip>

untar-file:

unzip-file:
    [unzip] Expanding: <http://apacheflexbuild.cloudapp.net:8080/job/flex-flexunit/ws/FlexUnit4Test/in/hamcrest-as3-flex-1.1.3.zip>
into <http://apacheflexbuild.cloudapp.net:8080/job/flex-flexunit/ws/FlexUnit4Test/in/temp>

check-sum:

fail-with-message:

copy-downloaded-swc:
     [copy] Copying 1 file to <http://apacheflexbuild.cloudapp.net:8080/job/flex-flexunit/ws/FlexUnit4Test/libs>
     [copy] Copying <http://apacheflexbuild.cloudapp.net:8080/job/flex-flexunit/ws/FlexUnit4Test/in/temp/hamcrest-as3-flex-1.1.3/hamcrest-as3-flex-1.1.3.swc>
to <http://apacheflexbuild.cloudapp.net:8080/job/flex-flexunit/ws/FlexUnit4Test/libs/hamcrest-as3-flex-1.1.3.swc>
   [delete] Deleting directory <http://apacheflexbuild.cloudapp.net:8080/job/flex-flexunit/ws/FlexUnit4Test/in/temp/hamcrest-as3-flex-1.1.3>
      [get] Getting: https://raw.github.com/drewbourne/hamcrest-as3/master/hamcrest/LICENSE
      [get] To: <http://apacheflexbuild.cloudapp.net:8080/job/flex-flexunit/ws/FlexUnit4Test/libs/hamcrest-LICENSE>

fluint-swc-check:

fluint-swc:
     [echo] Obtaining libs/fluint-1_2.swc

fluint-swc-check:

fluint-download-swc:

download-swc:
      [get] Getting: https://github.com/flexunit/flexunit/raw/master/FlexUnit4Test/libs/fluint-1_2.swc
      [get] To: <http://apacheflexbuild.cloudapp.net:8080/job/flex-flexunit/ws/FlexUnit4Test/libs/fluint-1_2.swc>
      [get] https://github.com/flexunit/flexunit/raw/master/FlexUnit4Test/libs/fluint-1_2.swc
moved to https://raw.githubusercontent.com/flexunit/flexunit/master/FlexUnit4Test/libs/fluint-1_2.swc

fail-with-message:

mockolate-swc-check:

mockolate-swc:
     [echo] Obtaining lib/mockolate-0.9.5.swc

download-zip:
      [get] Getting: http://cloud.github.com/downloads/drewbourne/mockolate/mockolate-0.9.5.zip
      [get] To: <http://apacheflexbuild.cloudapp.net:8080/job/flex-flexunit/ws/FlexUnit4Test/in/mockolate-0.9.5.zip>

untar-file:

unzip-file:
    [unzip] Expanding: <http://apacheflexbuild.cloudapp.net:8080/job/flex-flexunit/ws/FlexUnit4Test/in/mockolate-0.9.5.zip>
into <http://apacheflexbuild.cloudapp.net:8080/job/flex-flexunit/ws/FlexUnit4Test/in/temp>

check-sum:

fail-with-message:

copy-downloaded-swc:
     [copy] Copying 1 file to <http://apacheflexbuild.cloudapp.net:8080/job/flex-flexunit/ws/FlexUnit4Test/libs>
     [copy] Copying <http://apacheflexbuild.cloudapp.net:8080/job/flex-flexunit/ws/FlexUnit4Test/in/temp/mockolate-0.9.5/mockolate-0.9.5.swc>
to <http://apacheflexbuild.cloudapp.net:8080/job/flex-flexunit/ws/FlexUnit4Test/libs/mockolate-0.9.5.swc>
   [delete] Deleting directory <http://apacheflexbuild.cloudapp.net:8080/job/flex-flexunit/ws/FlexUnit4Test/in/temp/mockolate-0.9.5>
      [get] Getting: https://raw.github.com/drewbourne/mockolate/master/LICENSE
      [get] To: <http://apacheflexbuild.cloudapp.net:8080/job/flex-flexunit/ws/FlexUnit4Test/libs/mockolate-LICENSE>

mock-as-swc-check:

mock-as-swc:
     [echo] Obtaining lib/mock-as3.swc

download-swc:
      [get] Getting: https://github.com/flexunit/flexunit/raw/master/FlexUnit4Test/libs//mock-as3.swc
      [get] To: <http://apacheflexbuild.cloudapp.net:8080/job/flex-flexunit/ws/FlexUnit4Test/libs/mock-as3.swc>
      [get] https://github.com/flexunit/flexunit/raw/master/FlexUnit4Test/libs//mock-as3.swc
moved to https://raw.githubusercontent.com/flexunit/flexunit/master/FlexUnit4Test/libs//mock-as3.swc
      [get] Error opening connection java.io.FileNotFoundException: https://raw.githubusercontent.com/flexunit/flexunit/master/FlexUnit4Test/libs//mock-as3.swc
      [get] Error opening connection java.io.FileNotFoundException: https://raw.githubusercontent.com/flexunit/flexunit/master/FlexUnit4Test/libs//mock-as3.swc
      [get] Error opening connection java.io.FileNotFoundException: https://raw.githubusercontent.com/flexunit/flexunit/master/FlexUnit4Test/libs//mock-as3.swc
      [get] Can't get https://github.com/flexunit/flexunit/raw/master/FlexUnit4Test/libs//mock-as3.swc
to <http://apacheflexbuild.cloudapp.net:8080/job/flex-flexunit/ws/FlexUnit4Test/libs/mock-as3.swc>

BUILD FAILED
<http://apacheflexbuild.cloudapp.net:8080/job/flex-flexunit/ws/build.xml>:115: The following
error occurred while executing this line:
<http://apacheflexbuild.cloudapp.net:8080/job/flex-flexunit/ws/FlexUnit4Test/build.xml>:189:
The following error occurred while executing this line:
<http://apacheflexbuild.cloudapp.net:8080/job/flex-flexunit/ws/FlexUnit4Test/downloads.xml>:293:
The following error occurred while executing this line:
<http://apacheflexbuild.cloudapp.net:8080/job/flex-flexunit/ws/FlexUnit4Test/downloads.xml>:84:
Can't get https://github.com/flexunit/flexunit/raw/master/FlexUnit4Test/libs//mock-as3.swc
to <http://apacheflexbuild.cloudapp.net:8080/job/flex-flexunit/ws/FlexUnit4Test/libs/mock-as3.swc>

Total time: 9 seconds
Build step 'Invoke Ant' marked build as failure
Archiving artifacts
Recording test results

Mime
View raw message