flex-commits mailing list archives

Site index · List index
Message view « Date » · « Thread »
Top « Date » · « Thread »
From Apache Jenkins Server <jenk...@builds.apache.org>
Subject Build failed in Jenkins: flex-sdk_release #539
Date Tue, 01 Apr 2014 07:07:58 GMT
See <https://builds.apache.org/job/flex-sdk_release/539/changes>

Changes:

[mamsellem] FIX- FLEX-33421-Broken RequiresLicense metadata

[jmclean] updated based on discussion on dev list

[jmclean] initial version of CONTRIBUTING

[jmclean] FLEX-34132 further improvements.

[jmclean] added CONTRIBUTING to release packages

[jmclean] FLEX-34133 Fix logic/ADG RTE in columnHeaderWordWrap

[jmclean] update release notes since version 4.12

[mamsellem] REFIX- FLEX-33350 CalloutButton for Web

[aharui] try to fix jenkins sdk build by ignoring air/ folder setup by jenkins

[aharui] see if having no changed files will keep build from failing

[piotrzarzycki21] - Fix: FLEX-34057 - RTE on pasting empty data after Excel operation

[mamsellem] DONE FLEX-33994 Need a way to distinguish phone and tablet target devices through
css

[bigosmallm] Bring back the import for mx_internal

[bigosmallm] Fix for https://issues.apache.org/jira/browse/FLEX-34189

[mamsellem] FIXED - FLEX-24502 Mobile optimized skins and item renderers don't show text when
mirrored

[mamsellem] UNDO FIX - FLEX-24502 Mobile optimized skins and item renderers don't show text
when mirrored

------------------------------------------
[...truncated 2291 lines...]
create-config-files:
     [copy] Copying 3 files to <https://builds.apache.org/job/flex-sdk_release/ws/ide\flashbuilder\config>

expand-config-tokens:
     [echo] expanding {airHome} and {playerglobalHome} tokens

main:

post-build:

main:
     [echo] ant main target completed on 04/01/2014 08:04:38 AM

frameworks-rsls:
     [echo] build.number is 20140401
    [unzip] Expanding: <https://builds.apache.org/job/flex-sdk_release/ws/frameworks\libs\textLayout.swc>
into <https://builds.apache.org/job/flex-sdk_release/ws/frameworks\rsls>
     [java] Loading configuration file F:\hudson\hudson-slave\workspace\flex-sdk_release\frameworks\flex-config.xml
     [java] <https://builds.apache.org/job/flex-sdk_release/ws/frameworks/rsls/library.swf>
(492213 bytes)
     [java] <https://builds.apache.org/job/flex-sdk_release/ws/frameworks/rsls/textLayout_4.13.0.20140401.swf>
(342336 bytes)
   [delete] Deleting: <https://builds.apache.org/job/flex-sdk_release/ws/frameworks\rsls\library.swf>
     [java] Digest information was updated in F:\hudson\hudson-slave\workspace\flex-sdk_release\frameworks\libs\textLayout.swc
    [unzip] Expanding: <https://builds.apache.org/job/flex-sdk_release/ws/frameworks\libs\framework.swc>
into <https://builds.apache.org/job/flex-sdk_release/ws/frameworks\rsls>
     [java] Loading configuration file F:\hudson\hudson-slave\workspace\flex-sdk_release\frameworks\flex-config.xml
     [java] <https://builds.apache.org/job/flex-sdk_release/ws/frameworks/rsls/library.swf>
(798928 bytes)
     [java] <https://builds.apache.org/job/flex-sdk_release/ws/frameworks/rsls/framework_4.13.0.20140401.swf>
(559400 bytes)
   [delete] Deleting: <https://builds.apache.org/job/flex-sdk_release/ws/frameworks\rsls\library.swf>
     [java] Digest information was updated in F:\hudson\hudson-slave\workspace\flex-sdk_release\frameworks\libs\framework.swc
    [unzip] Expanding: <https://builds.apache.org/job/flex-sdk_release/ws/frameworks\libs\mx\mx.swc>
into <https://builds.apache.org/job/flex-sdk_release/ws/frameworks\rsls>
     [java] Loading configuration file F:\hudson\hudson-slave\workspace\flex-sdk_release\frameworks\flex-config.xml
     [java] <https://builds.apache.org/job/flex-sdk_release/ws/frameworks/rsls/library.swf>
(811579 bytes)
     [java] <https://builds.apache.org/job/flex-sdk_release/ws/frameworks/rsls/mx_4.13.0.20140401.swf>
(529810 bytes)
   [delete] Deleting: <https://builds.apache.org/job/flex-sdk_release/ws/frameworks\rsls\library.swf>
     [java] Digest information was updated in F:\hudson\hudson-slave\workspace\flex-sdk_release\frameworks\libs\mx\mx.swc
    [unzip] Expanding: <https://builds.apache.org/job/flex-sdk_release/ws/frameworks\libs\rpc.swc>
into <https://builds.apache.org/job/flex-sdk_release/ws/frameworks\rsls>
     [java] Loading configuration file F:\hudson\hudson-slave\workspace\flex-sdk_release\frameworks\flex-config.xml
     [java] <https://builds.apache.org/job/flex-sdk_release/ws/frameworks/rsls/library.swf>
(299673 bytes)
     [java] <https://builds.apache.org/job/flex-sdk_release/ws/frameworks/rsls/rpc_4.13.0.20140401.swf>
(209048 bytes)
   [delete] Deleting: <https://builds.apache.org/job/flex-sdk_release/ws/frameworks\rsls\library.swf>
     [java] Digest information was updated in F:\hudson\hudson-slave\workspace\flex-sdk_release\frameworks\libs\rpc.swc
    [unzip] Expanding: <https://builds.apache.org/job/flex-sdk_release/ws/frameworks\libs\spark.swc>
into <https://builds.apache.org/job/flex-sdk_release/ws/frameworks\rsls>
     [java] Loading configuration file F:\hudson\hudson-slave\workspace\flex-sdk_release\frameworks\flex-config.xml
     [java] <https://builds.apache.org/job/flex-sdk_release/ws/frameworks/rsls/library.swf>
(1274011 bytes)
     [java] <https://builds.apache.org/job/flex-sdk_release/ws/frameworks/rsls/spark_4.13.0.20140401.swf>
(837703 bytes)
   [delete] Deleting: <https://builds.apache.org/job/flex-sdk_release/ws/frameworks\rsls\library.swf>
     [java] Digest information was updated in F:\hudson\hudson-slave\workspace\flex-sdk_release\frameworks\libs\spark.swc
    [unzip] Expanding: <https://builds.apache.org/job/flex-sdk_release/ws/frameworks\libs\sparkskins.swc>
into <https://builds.apache.org/job/flex-sdk_release/ws/frameworks\rsls>
     [java] Loading configuration file F:\hudson\hudson-slave\workspace\flex-sdk_release\frameworks\flex-config.xml
     [java] <https://builds.apache.org/job/flex-sdk_release/ws/frameworks/rsls/library.swf>
(110594 bytes)
     [java] <https://builds.apache.org/job/flex-sdk_release/ws/frameworks/rsls/sparkskins_4.13.0.20140401.swf>
(68891 bytes)
   [delete] Deleting: <https://builds.apache.org/job/flex-sdk_release/ws/frameworks\rsls\library.swf>
     [java] Digest information was updated in F:\hudson\hudson-slave\workspace\flex-sdk_release\frameworks\libs\sparkskins.swc
    [unzip] Expanding: <https://builds.apache.org/job/flex-sdk_release/ws/frameworks\libs\charts.swc>
into <https://builds.apache.org/job/flex-sdk_release/ws/frameworks\rsls>
     [java] Loading configuration file F:\hudson\hudson-slave\workspace\flex-sdk_release\frameworks\flex-config.xml
     [java] <https://builds.apache.org/job/flex-sdk_release/ws/frameworks/rsls/library.swf>
(381497 bytes)
     [java] <https://builds.apache.org/job/flex-sdk_release/ws/frameworks/rsls/charts_4.13.0.20140401.swf>
(255421 bytes)
   [delete] Deleting: <https://builds.apache.org/job/flex-sdk_release/ws/frameworks\rsls\library.swf>
     [java] Digest information was updated in F:\hudson\hudson-slave\workspace\flex-sdk_release\frameworks\libs\charts.swc
    [unzip] Expanding: <https://builds.apache.org/job/flex-sdk_release/ws/frameworks\libs\advancedgrids.swc>
into <https://builds.apache.org/job/flex-sdk_release/ws/frameworks\rsls>
     [java] Loading configuration file F:\hudson\hudson-slave\workspace\flex-sdk_release\frameworks\flex-config.xml
     [java] <https://builds.apache.org/job/flex-sdk_release/ws/frameworks/rsls/library.swf>
(342428 bytes)
     [java] <https://builds.apache.org/job/flex-sdk_release/ws/frameworks/rsls/advancedgrids_4.13.0.20140401.swf>
(245900 bytes)
   [delete] Deleting: <https://builds.apache.org/job/flex-sdk_release/ws/frameworks\rsls\library.swf>
     [java] Digest information was updated in F:\hudson\hudson-slave\workspace\flex-sdk_release\frameworks\libs\advancedgrids.swc
    [unzip] Expanding: <https://builds.apache.org/job/flex-sdk_release/ws/frameworks\libs\spark_dmv.swc>
into <https://builds.apache.org/job/flex-sdk_release/ws/frameworks\rsls>
     [java] Loading configuration file F:\hudson\hudson-slave\workspace\flex-sdk_release\frameworks\flex-config.xml
     [java] <https://builds.apache.org/job/flex-sdk_release/ws/frameworks/rsls/library.swf>
(7286 bytes)
     [java] <https://builds.apache.org/job/flex-sdk_release/ws/frameworks/rsls/spark_dmv_4.13.0.20140401.swf>
(6046 bytes)
   [delete] Deleting: <https://builds.apache.org/job/flex-sdk_release/ws/frameworks\rsls\library.swf>
     [java] Digest information was updated in F:\hudson\hudson-slave\workspace\flex-sdk_release\frameworks\libs\spark_dmv.swc
    [unzip] Expanding: <https://builds.apache.org/job/flex-sdk_release/ws/frameworks\libs\apache.swc>
into <https://builds.apache.org/job/flex-sdk_release/ws/frameworks\rsls>
     [java] Loading configuration file F:\hudson\hudson-slave\workspace\flex-sdk_release\frameworks\flex-config.xml
     [java] <https://builds.apache.org/job/flex-sdk_release/ws/frameworks/rsls/library.swf>
(14202 bytes)
     [java] <https://builds.apache.org/job/flex-sdk_release/ws/frameworks/rsls/apache_4.13.0.20140401.swf>
(11159 bytes)
   [delete] Deleting: <https://builds.apache.org/job/flex-sdk_release/ws/frameworks\rsls\library.swf>
     [java] Digest information was updated in F:\hudson\hudson-slave\workspace\flex-sdk_release\frameworks\libs\apache.swc
    [unzip] Expanding: <https://builds.apache.org/job/flex-sdk_release/ws/frameworks\libs\experimental.swc>
into <https://builds.apache.org/job/flex-sdk_release/ws/frameworks\rsls>
     [java] Loading configuration file F:\hudson\hudson-slave\workspace\flex-sdk_release\frameworks\flex-config.xml
     [java] <https://builds.apache.org/job/flex-sdk_release/ws/frameworks/rsls/library.swf>
(183631 bytes)
     [java] <https://builds.apache.org/job/flex-sdk_release/ws/frameworks/rsls/experimental_4.13.0.20140401.swf>
(122278 bytes)
   [delete] Deleting: <https://builds.apache.org/job/flex-sdk_release/ws/frameworks\rsls\library.swf>
     [java] Digest information was updated in F:\hudson\hudson-slave\workspace\flex-sdk_release\frameworks\libs\experimental.swc
    [unzip] Expanding: <https://builds.apache.org/job/flex-sdk_release/ws/frameworks\libs\experimental_mobile.swc>
into <https://builds.apache.org/job/flex-sdk_release/ws/frameworks\rsls>
     [java] Loading configuration file F:\hudson\hudson-slave\workspace\flex-sdk_release\frameworks\flex-config.xml
     [java] <https://builds.apache.org/job/flex-sdk_release/ws/frameworks/rsls/library.swf>
(22743 bytes)
     [java] <https://builds.apache.org/job/flex-sdk_release/ws/frameworks/rsls/experimental_mobile_4.13.0.20140401.swf>
(17103 bytes)
   [delete] Deleting: <https://builds.apache.org/job/flex-sdk_release/ws/frameworks\rsls\library.swf>
     [java] Digest information was updated in F:\hudson\hudson-slave\workspace\flex-sdk_release\frameworks\libs\experimental_mobile.swc

sample-themes:

clean:

compile:
     [echo] Compiling samples/themes/arcade/arcade.swc
    [mxmlc] Loading configuration file F:\hudson\hudson-slave\workspace\flex-sdk_release\frameworks\flex-config.xml
    [mxmlc] F:\hudson\hudson-slave\workspace\flex-sdk_release\samples\themes\arcade\src\assets\flex_skins.swf
(35374 bytes)
    [compc] Loading configuration file F:\hudson\hudson-slave\workspace\flex-sdk_release\frameworks\flex-config.xml
    [compc] F:\hudson\hudson-slave\workspace\flex-sdk_release\samples\themes\arcade\arcade.swc
(167449 bytes)

main:

clean:

compile:
     [echo] Compiling samples/themes/cobalt/cobalt.swc
    [compc] <https://builds.apache.org/job/flex-sdk_release/ws/samples\themes\cobalt\build.xml>:67:
java.io.IOException: Cannot run program "f:\hudson\tools\java\latest-1.6-64\jre\bin\java.exe"
(in directory "<https://builds.apache.org/job/flex-sdk_release/ws/samples\themes\cobalt")>:
CreateProcess error=87, The parameter is incorrect
    [compc] 	at org.apache.tools.ant.taskdefs.Java.fork(Java.java:798)
    [compc] 	at org.apache.tools.ant.taskdefs.Java.executeJava(Java.java:214)
    [compc] 	at org.apache.tools.ant.taskdefs.Java.executeJava(Java.java:135)
    [compc] 	at flex.ant.FlexTask.executeOutOfProcess(FlexTask.java:260)
    [compc] 	at flex.ant.FlexTask.execute(FlexTask.java:238)
    [compc] 	at org.apache.tools.ant.UnknownElement.execute(UnknownElement.java:291)
    [compc] 	at sun.reflect.GeneratedMethodAccessor4.invoke(Unknown Source)
    [compc] 	at sun.reflect.DelegatingMethodAccessorImpl.invoke(DelegatingMethodAccessorImpl.java:25)
    [compc] 	at java.lang.reflect.Method.invoke(Method.java:597)
    [compc] 	at org.apache.tools.ant.dispatch.DispatchUtils.execute(DispatchUtils.java:106)
    [compc] 	at org.apache.tools.ant.Task.perform(Task.java:348)
    [compc] 	at org.apache.tools.ant.Target.execute(Target.java:390)
    [compc] 	at org.apache.tools.ant.Target.performTasks(Target.java:411)
    [compc] 	at org.apache.tools.ant.Project.executeSortedTargets(Project.java:1399)
    [compc] 	at org.apache.tools.ant.helper.SingleCheckExecutor.executeTargets(SingleCheckExecutor.java:38)
    [compc] 	at org.apache.tools.ant.Project.executeTargets(Project.java:1251)
    [compc] 	at org.apache.tools.ant.taskdefs.Ant.execute(Ant.java:442)
    [compc] 	at org.apache.tools.ant.UnknownElement.execute(UnknownElement.java:291)
    [compc] 	at sun.reflect.GeneratedMethodAccessor4.invoke(Unknown Source)
    [compc] 	at sun.reflect.DelegatingMethodAccessorImpl.invoke(DelegatingMethodAccessorImpl.java:25)
    [compc] 	at java.lang.reflect.Method.invoke(Method.java:597)
    [compc] 	at org.apache.tools.ant.dispatch.DispatchUtils.execute(DispatchUtils.java:106)
    [compc] 	at org.apache.tools.ant.Task.perform(Task.java:348)
    [compc] 	at org.apache.tools.ant.Target.execute(Target.java:390)
    [compc] 	at org.apache.tools.ant.Target.performTasks(Target.java:411)
    [compc] 	at org.apache.tools.ant.Project.executeSortedTargets(Project.java:1399)
    [compc] 	at org.apache.tools.ant.Project.executeTarget(Project.java:1368)
    [compc] 	at org.apache.tools.ant.helper.DefaultExecutor.executeTargets(DefaultExecutor.java:41)
    [compc] 	at org.apache.tools.ant.Project.executeTargets(Project.java:1251)
    [compc] 	at org.apache.tools.ant.Main.runBuild(Main.java:809)
    [compc] 	at org.apache.tools.ant.Main.startAnt(Main.java:217)
    [compc] 	at org.apache.tools.ant.launch.Launcher.run(Launcher.java:280)
    [compc] 	at org.apache.tools.ant.launch.Launcher.main(Launcher.java:109)
    [compc] Caused by: java.io.IOException: Cannot run program "f:\hudson\tools\java\latest-1.6-64\jre\bin\java.exe"
(in directory "<https://builds.apache.org/job/flex-sdk_release/ws/samples\themes\cobalt")>:
CreateProcess error=87, The parameter is incorrect
    [compc] 	at java.lang.ProcessBuilder.start(ProcessBuilder.java:460)
    [compc] 	at java.lang.Runtime.exec(Runtime.java:593)
    [compc] 	at org.apache.tools.ant.taskdefs.Execute$Java13CommandLauncher.exec(Execute.java:862)
    [compc] 	at org.apache.tools.ant.taskdefs.Execute.launch(Execute.java:481)
    [compc] 	at org.apache.tools.ant.taskdefs.Execute.execute(Execute.java:495)
    [compc] 	at org.apache.tools.ant.taskdefs.Java.fork(Java.java:791)
    [compc] 	... 32 more
    [compc] Caused by: java.io.IOException: CreateProcess error=87, The parameter is incorrect
    [compc] 	at java.lang.ProcessImpl.create(Native Method)
    [compc] 	at java.lang.ProcessImpl.<init>(ProcessImpl.java:81)
    [compc] 	at java.lang.ProcessImpl.start(ProcessImpl.java:30)
    [compc] 	at java.lang.ProcessBuilder.start(ProcessBuilder.java:453)
    [compc] 	... 37 more

main:

clean:

compile:
     [echo] Compiling samples/themes/graphite/graphite.swc
    [mxmlc] Loading configuration file F:\hudson\hudson-slave\workspace\flex-sdk_release\frameworks\flex-config.xml
    [mxmlc] F:\hudson\hudson-slave\workspace\flex-sdk_release\samples\themes\graphite\src\assets\flex_skins.swf
(482207 bytes)
    [compc] Loading configuration file F:\hudson\hudson-slave\workspace\flex-sdk_release\frameworks\flex-config.xml
    [compc] F:\hudson\hudson-slave\workspace\flex-sdk_release\samples\themes\graphite\graphite.swc
(653478 bytes)

main:

runtime-setup:

mustella-setup:
 [loadfile] <https://builds.apache.org/job/flex-sdk_release/ws/mustella\local.properties>
doesn't exist

echo-info:
     [echo]     JAVA_HOME:               f:\hudson\tools\java\latest-1.6-64
     [echo]     FLASHPLAYER_DEBUGGER:    C:/Program Files (x86)/Adobe/flashplayer_11_sa_debug_32bit.exe
     [echo]     sdk.dir:                 <https://builds.apache.org/job/flex-sdk_release/ws/mustella/..>
     [echo]     mustella exclude file:   f:/hudson/hudson-slave/workspace/flex-sdk_release/mustella/tests/ExcludeListWin.txt

get_date:

get_os:

setup_mac:

setup_windows:
     [echo] doing windows setup
     [echo] homepath: C:\Users\hudson 
     [echo] trace output file: 1 
     [echo]  player is C:/Program Files (x86)/Adobe/flashplayer_11_sa_debug_32bit.exe 

setup_linux:

db_time:
    [mkdir] Created dir: <https://builds.apache.org/job/flex-sdk_release/ws/mustella\tmp>
     [echo] db_time=2014/04/01 08:06:04

get_mobile_data:

device_fail:

handle_mobile_config:

echo-browser:

echo-apollo:

setup:
     [echo] player is C:/Program Files (x86)/Adobe/flashplayer_11_sa_debug_32bit.exe 
     [echo] fileset: 

makemustellaswc:
 [loadfile] <https://builds.apache.org/job/flex-sdk_release/ws/mustella\local.properties>
doesn't exist

compilemustellaswc:
     [exec] Loading configuration file F:\hudson\hudson-slave\workspace\flex-sdk_release\frameworks\flex-config.xml
     [exec] F:\hudson\hudson-slave\workspace\flex-sdk_release\mustella\mustella.swc (94811
bytes)
    [javac] <https://builds.apache.org/job/flex-sdk_release/ws/build.xml>:1445: warning:
'includeantruntime' was not set, defaulting to build.sysclasspath=last; set to false for repeatable
builds
    [javac] Compiling 1 source file

load-task:

basictests:
    [mxmlc] Loading configuration file F:\hudson\hudson-slave\workspace\flex-sdk_release\frameworks\flex-config.xml
    [mxmlc] Loading configuration file F:\hudson\hudson-slave\workspace\flex-sdk_release\frameworks\tests\basicTests\BasicTests-config.xml
    [mxmlc] F:\hudson\hudson-slave\workspace\flex-sdk_release\frameworks\tests\basicTests\BasicTests.swf
(3754887 bytes)
    [mxmlc] Loading configuration file F:\hudson\hudson-slave\workspace\flex-sdk_release\frameworks\flex-config.xml
    [mxmlc] F:\hudson\hudson-slave\workspace\flex-sdk_release\frameworks\tests\basicTests\basicLoader.swf
(959 bytes)
    [mxmlc] Loading configuration file F:\hudson\hudson-slave\workspace\flex-sdk_release\frameworks\flex-config.xml
    [mxmlc] F:\hudson\hudson-slave\workspace\flex-sdk_release\frameworks\tests\basicTests\spark\views\StyleManagerModuleTest.swf
(526507 bytes)
    [mxmlc] Loading configuration file F:\hudson\hudson-slave\workspace\flex-sdk_release\frameworks\flex-config.xml
    [mxmlc] Required RSLs:
    [mxmlc]     framework_20140401.swf
    [mxmlc]     textLayout_20140401.swf
    [mxmlc]     spark_20140401.swf
    [mxmlc]     osmf_20140401.swf
    [mxmlc] F:\hudson\hudson-slave\workspace\flex-sdk_release\frameworks\tests\basicTests\spark\views\HelloWorld.swf
(50532 bytes)
     [echo] launching player and swf

mustellaresultsparser:
     [java] Unexpected Trace:  width: 804  height:  566  diag: 983.2456458078012
     [java] results: FAILED

BUILD FAILED
<https://builds.apache.org/job/flex-sdk_release/ws/build.xml>:1521: The following error
occurred while executing this line:
<https://builds.apache.org/job/flex-sdk_release/ws/build.xml>:1678: Java returned: 1

Total time: 15 minutes 36 seconds
Build step 'Invoke Ant' marked build as failure
Archiving artifacts

Mime
View raw message