flex-commits mailing list archives

Site index · List index
Message view « Date » · « Thread »
Top « Date » · « Thread »
From Apache Jenkins Server <jenk...@builds.apache.org>
Subject Build failed in Jenkins: flex-falcon #269
Date Fri, 03 Jan 2014 04:59:02 GMT
See <https://builds.apache.org/job/flex-falcon/269/>

------------------------------------------
Started by timer
Building remotely on windows1 in workspace <https://builds.apache.org/job/flex-falcon/ws/>
Fetching changes from the remote Git repository
Fetching upstream changes from https://git-wip-us.apache.org/repos/asf/flex-falcon.git
Checking out Revision cd48b0adb5b4addfaca61efd6065e262bd8c4041 (origin/develop)
[flex-falcon] $ cmd.exe /C '"f:\hudson\hudson-slave\tools\hudson.tasks.Ant_AntInstallation\ant-1.8.2\bin\ant.bat
-file jenkins.xml main && exit %%ERRORLEVEL%%"'
Buildfile: <https://builds.apache.org/job/flex-falcon/ws/jenkins.xml>

clean:
   [delete] Deleting directory <https://builds.apache.org/job/flex-falcon/ws/jenkins\temp>
   [delete] Deleting directory <https://builds.apache.org/job/flex-falcon/ws/jenkins\JFlex>

init:
    [mkdir] Created dir: <https://builds.apache.org/job/flex-falcon/ws/jenkins\temp>
    [mkdir] Created dir: <https://builds.apache.org/job/flex-falcon/ws/jenkins\JFlex>

jflex-download:
     [echo] Be patient. This takes a few minutes...
      [get] Getting: http://jflex.de/jflex-1.4.3.zip
      [get] To: <https://builds.apache.org/job/flex-falcon/ws/jenkins\temp\JFlex.zip>
    [unzip] Expanding: <https://builds.apache.org/job/flex-falcon/ws/jenkins\temp\JFlex.zip>
into <https://builds.apache.org/job/flex-falcon/ws/jenkins\JFlex>

main:

BUILD SUCCESSFUL
Total time: 4 seconds
[flex-falcon] $ cmd.exe /C '"f:\hudson\hudson-slave\tools\hudson.tasks.Ant_AntInstallation\ant-1.8.2\bin\ant.bat
-file build.xml wipe-all all && exit %%ERRORLEVEL%%"'
Buildfile: <https://builds.apache.org/job/flex-falcon/ws/build.xml>

wipe-all:

clean:
   [delete] Deleting directory <https://builds.apache.org/job/flex-falcon/ws/compiler\generated>

wipe:
   [delete] Deleting directory <https://builds.apache.org/job/flex-falcon/ws/compiler\lib>

clean:
   [delete] Deleting directory <https://builds.apache.org/job/flex-falcon/ws/compiler.tests\classes>
   [delete] Deleting directory <https://builds.apache.org/job/flex-falcon/ws/compiler.tests\results>

wipe:
   [delete] Deleting directory <https://builds.apache.org/job/flex-falcon/ws/compiler.tests\lib>
   [delete] Deleting directory <https://builds.apache.org/job/flex-falcon/ws/compiler.tests\temp>

thirdparty-clean:

clean:

clean:

super-clean:

clean:
   [delete] Deleting directory <https://builds.apache.org/job/flex-falcon/ws/compiler.jx.tests\classes>
   [delete] Deleting directory <https://builds.apache.org/job/flex-falcon/ws/compiler.jx.tests\results>

wipe:
   [delete] Deleting directory <https://builds.apache.org/job/flex-falcon/ws/compiler.jx.tests\lib>
   [delete] Deleting directory <https://builds.apache.org/job/flex-falcon/ws/compiler.jx.tests\temp>

sdk:

checkenv:
     [echo] JFLEX_JAR is <https://builds.apache.org/job/flex-falcon/ws/jenkins/JFlex/jflex-1.4.3/lib/JFlex.jar>

download:

prepare:
    [mkdir] Created dir: <https://builds.apache.org/job/flex-falcon/ws/compiler\lib>

antlr-jar-check:

antlr-jar:
     [echo] Obtaining lib/antlr.jar

antlr-jar-check:

antlr-download-jar:

download-jar:
      [get] Getting: http://antlr3.org/download/antlr-3.3-complete.jar
      [get] To: <https://builds.apache.org/job/flex-falcon/ws/compiler\lib\antlr.jar>

fail-with-message:

commons-cli-jar-check:

commons-cli-jar:
     [echo] Obtaining lib/commons-cli.jar

download-zip:
    [mkdir] Created dir: <https://builds.apache.org/job/flex-falcon/ws/compiler\in>
      [get] Getting: http://archive.apache.org/dist/commons/cli/binaries/commons-cli-1.2-bin.tar.gz
      [get] To: <https://builds.apache.org/job/flex-falcon/ws/compiler\in\commons-cli-1.2-bin.tar.gz>

untar-file:
    [untar] Expanding: <https://builds.apache.org/job/flex-falcon/ws/compiler\in\commons-cli-1.2-bin.tar.gz>
into <https://builds.apache.org/job/flex-falcon/ws/compiler\in\temp>

unzip-file:

check-sum:

fail-with-message:

copy-downloaded-jar:
     [copy] Copying 1 file to <https://builds.apache.org/job/flex-falcon/ws/compiler\lib>
     [copy] Copying <https://builds.apache.org/job/flex-falcon/ws/compiler\in\temp\commons-cli-1.2\commons-cli-1.2.jar>
to <https://builds.apache.org/job/flex-falcon/ws/compiler\lib\commons-cli.jar>
     [copy] Copying 1 file to <https://builds.apache.org/job/flex-falcon/ws/compiler\lib>
   [delete] Deleting directory <https://builds.apache.org/job/flex-falcon/ws/compiler\in\temp\commons-cli-1.2>

commons-io-jar-check:

commons-io-jar:
     [echo] Obtaining lib/commons-io.jar

download-zip:
      [get] Getting: http://archive.apache.org/dist/commons/io/binaries/commons-io-2.0.1-bin.tar.gz
      [get] To: <https://builds.apache.org/job/flex-falcon/ws/compiler\in\commons-io-2.0.1-bin.tar.gz>

untar-file:
    [untar] Expanding: <https://builds.apache.org/job/flex-falcon/ws/compiler\in\commons-io-2.0.1-bin.tar.gz>
into <https://builds.apache.org/job/flex-falcon/ws/compiler\in\temp>

unzip-file:

check-sum:

fail-with-message:

copy-downloaded-jar:
     [copy] Copying 1 file to <https://builds.apache.org/job/flex-falcon/ws/compiler\lib>
     [copy] Copying <https://builds.apache.org/job/flex-falcon/ws/compiler\in\temp\commons-io-2.0.1\commons-io-2.0.1.jar>
to <https://builds.apache.org/job/flex-falcon/ws/compiler\lib\commons-io.jar>
     [copy] Copying 1 file to <https://builds.apache.org/job/flex-falcon/ws/compiler\lib>
   [delete] Deleting directory <https://builds.apache.org/job/flex-falcon/ws/compiler\in\temp\commons-io-2.0.1>

commons-jars:

guava-jar-check:

guava-jar:
     [echo] Obtaining lib/guava.jar

download-jar:
      [get] Getting: http://search.maven.org/remotecontent?filepath=com/google/guava/guava/15.0/guava-15.0.jar
      [get] To: <https://builds.apache.org/job/flex-falcon/ws/compiler\lib\guava.jar>
      [get] Error opening connection java.io.IOException: Server returned HTTP response code:
500 for URL: http://search.maven.org/remotecontent?filepath=com/google/guava/guava/15.0/guava-15.0.jar
      [get] Error opening connection java.io.IOException: Server returned HTTP response code:
500 for URL: http://search.maven.org/remotecontent?filepath=com/google/guava/guava/15.0/guava-15.0.jar
      [get] Error opening connection java.io.IOException: Server returned HTTP response code:
500 for URL: http://search.maven.org/remotecontent?filepath=com/google/guava/guava/15.0/guava-15.0.jar
      [get] Can't get http://search.maven.org/remotecontent?filepath=com/google/guava/guava/15.0/guava-15.0.jar
to <https://builds.apache.org/job/flex-falcon/ws/compiler\lib\guava.jar>

BUILD FAILED
<https://builds.apache.org/job/flex-falcon/ws/build.xml>:66: The following error occurred
while executing this line:
<https://builds.apache.org/job/flex-falcon/ws/compiler\build.xml>:229: The following
error occurred while executing this line:
<https://builds.apache.org/job/flex-falcon/ws/compiler\downloads.xml>:306: The following
error occurred while executing this line:
<https://builds.apache.org/job/flex-falcon/ws/compiler\downloads.xml>:168: Can't get
http://search.maven.org/remotecontent?filepath=com/google/guava/guava/15.0/guava-15.0.jar
to <https://builds.apache.org/job/flex-falcon/ws/compiler\lib\guava.jar>

Total time: 18 seconds
Build step 'Invoke Ant' marked build as failure
Archiving artifacts
Recording test results

Mime
View raw message