flex-commits mailing list archives

Site index · List index
Message view « Date » · « Thread »
Top « Date » · « Thread »
From Apache Jenkins Server <jenk...@builds.apache.org>
Subject Build failed in Jenkins: flex-falcon #299
Date Mon, 20 Jan 2014 14:55:03 GMT
See <https://builds.apache.org/job/flex-falcon/299/>

------------------------------------------
Started by user erikdebruin
Building remotely on windows1 in workspace <https://builds.apache.org/job/flex-falcon/ws/>
Fetching changes from the remote Git repository
Fetching upstream changes from https://git-wip-us.apache.org/repos/asf/flex-falcon.git
Checking out Revision 8966eda94ca616ae0a2f110cfa20f4a2f0f76cfe (origin/develop)
[flex-falcon] $ cmd.exe /C '"f:\hudson\hudson-slave\tools\hudson.tasks.Ant_AntInstallation\ant-1.8.2\bin\ant.bat
-file jenkins.xml main && exit %%ERRORLEVEL%%"'
Buildfile: <https://builds.apache.org/job/flex-falcon/ws/jenkins.xml>

clean:
   [delete] Deleting directory <https://builds.apache.org/job/flex-falcon/ws/jenkins\temp>
   [delete] Deleting directory <https://builds.apache.org/job/flex-falcon/ws/jenkins\JFlex>

init:
    [mkdir] Created dir: <https://builds.apache.org/job/flex-falcon/ws/jenkins\temp>
    [mkdir] Created dir: <https://builds.apache.org/job/flex-falcon/ws/jenkins\JFlex>

jflex-download:
     [echo] Be patient. This takes a few minutes...
      [get] Getting: http://jflex.de/jflex-1.4.3.zip
      [get] To: <https://builds.apache.org/job/flex-falcon/ws/jenkins\temp\JFlex.zip>
    [unzip] Expanding: <https://builds.apache.org/job/flex-falcon/ws/jenkins\temp\JFlex.zip>
into <https://builds.apache.org/job/flex-falcon/ws/jenkins\JFlex>

main:

BUILD SUCCESSFUL
Total time: 5 seconds
[flex-falcon] $ cmd.exe /C '"f:\hudson\hudson-slave\tools\hudson.tasks.Ant_AntInstallation\ant-1.8.2\bin\ant.bat
-file build.xml release create-md5 tests compiler.jx.tests && exit %%ERRORLEVEL%%"'
Buildfile: <https://builds.apache.org/job/flex-falcon/ws/build.xml>

check-flex-home:
     [echo] FLEX_HOME is <https://builds.apache.org/job/flex-falcon/ws/../flex-sdk>

wipe-all:

clean:

wipe:
   [delete] Deleting directory <https://builds.apache.org/job/flex-falcon/ws/compiler\lib>

clean:

wipe:

thirdparty-clean:

clean:

clean:

super-clean:

clean:

wipe:
   [delete] Deleting directory <https://builds.apache.org/job/flex-falcon/ws/out>
   [delete] Deleting directory <https://builds.apache.org/job/flex-falcon/ws/temp>

stage-source:

clean-temp:
     [copy] Copying 6 files to <https://builds.apache.org/job/flex-falcon/ws/temp>

stage-compiler:
     [copy] Copying 1881 files to <https://builds.apache.org/job/flex-falcon/ws/temp\compiler>

stage-compiler.tests:
     [copy] Copying 103 files to <https://builds.apache.org/job/flex-falcon/ws/temp\compiler.tests>

source-package-zip:
    [mkdir] Created dir: <https://builds.apache.org/job/flex-falcon/ws/out>
      [zip] Building zip: <https://builds.apache.org/job/flex-falcon/ws/out\apache-flex-falcon-0.0.1-src.zip>

source-package-tgz:
      [tar] Building tar: <https://builds.apache.org/job/flex-falcon/ws/out\apache-flex-falcon-0.0.1-src.tar.gz>

stage-source-jx:
     [copy] Copying 109 files to <https://builds.apache.org/job/flex-falcon/ws/temp\compiler.jx>
     [copy] Copying 131 files to <https://builds.apache.org/job/flex-falcon/ws/temp\compiler.jx.tests>

source-package-jx-zip:
      [zip] Building zip: <https://builds.apache.org/job/flex-falcon/ws/out\apache-flex-falconjx-0.0.1-src.zip>

source-package-jx-tgz:
      [tar] Building tar: <https://builds.apache.org/job/flex-falcon/ws/out\apache-flex-falconjx-0.0.1-src.tar.gz>

source-package:

source-release:

setup-binary-release:

compiler.binary.release:

release-binaries:

checkenv:
     [echo] JFLEX_JAR is <https://builds.apache.org/job/flex-falcon/ws/jenkins/JFlex/jflex-1.4.3/lib/JFlex.jar>

download:

prepare:
    [mkdir] Created dir: <https://builds.apache.org/job/flex-falcon/ws/compiler\lib>

antlr-jar-check:

antlr-jar:
     [echo] Obtaining lib/antlr.jar

antlr-jar-check:

antlr-download-jar:

download-jar:
      [get] Getting: http://antlr3.org/download/antlr-3.3-complete.jar
      [get] To: <https://builds.apache.org/job/flex-falcon/ws/compiler\lib\antlr.jar>
      [get] http://antlr3.org/download/antlr-3.3-complete.jar moved to http://www.antlr3.org/download/antlr-3.3-complete.jar
      [get] Error opening connection java.io.FileNotFoundException: http://www.antlr3.org/download/antlr-3.3-complete.jar
      [get] Error opening connection java.io.FileNotFoundException: http://www.antlr3.org/download/antlr-3.3-complete.jar
      [get] Error opening connection java.io.FileNotFoundException: http://www.antlr3.org/download/antlr-3.3-complete.jar
      [get] Can't get http://antlr3.org/download/antlr-3.3-complete.jar to <https://builds.apache.org/job/flex-falcon/ws/compiler\lib\antlr.jar>

BUILD FAILED
<https://builds.apache.org/job/flex-falcon/ws/build.xml>:76: The following error occurred
while executing this line:
<https://builds.apache.org/job/flex-falcon/ws/compiler\build.xml>:843: The following
error occurred while executing this line:
<https://builds.apache.org/job/flex-falcon/ws/compiler\build.xml>:229: The following
error occurred while executing this line:
<https://builds.apache.org/job/flex-falcon/ws/compiler\downloads.xml>:217: The following
error occurred while executing this line:
<https://builds.apache.org/job/flex-falcon/ws/compiler\downloads.xml>:224: The following
error occurred while executing this line:
<https://builds.apache.org/job/flex-falcon/ws/compiler\downloads.xml>:168: Can't get
http://antlr3.org/download/antlr-3.3-complete.jar to <https://builds.apache.org/job/flex-falcon/ws/compiler\lib\antlr.jar>

Total time: 35 seconds
Build step 'Invoke Ant' marked build as failure
Archiving artifacts
Recording test results

Mime
View raw message