flex-commits mailing list archives

Site index · List index
Message view « Date » · « Thread »
Top « Date » · « Thread »
From flex.muste...@gmail.com
Subject Build failed in Jenkins: flex-sdk_mustella #356
Date Fri, 27 Sep 2013 21:36:55 GMT
See <http://localhost:8080/job/flex-sdk_mustella/356/changes>

Changes:

[jmclean] updated release notes

------------------------------------------
[...truncated 28705 lines...]
     [java] getting directory from the swf file
     [java] derived directory: C:\jenkins_slave\workspace\flex-sdk_mustella\mustella\tests\containers\Canvas\SWFs
     [java] Launching: 
     [java]  C:\ApacheFlex\dependencies\FlashPlayer_Debug\flashplayer11_1r102_55_win_sa_debug_32bit.exe
C:\jenkins_slave\workspace\flex-sdk_mustella\mustella\tests\containers\Canvas\SWFs\PreferredCanvas.swf
Launching: C:\ApacheFlex\dependencies\FlashPlayer_Debug\flashplayer11_1r102_55_win_sa_debug_32bit.exe
C:\jenkins_slave\workspace\flex-sdk_mustella\mustella\tests\containers\Canvas\SWFs\PreferredCanvas.swf
     [java] USING directory: C:\jenkins_slave\workspace\flex-sdk_mustella\mustella\tests\containers\Canvas\SWFs
     [java] time: 16:36:17.666
     [java] java.io.IOException: Cannot run program "C:\ApacheFlex\dependencies\FlashPlayer_Debug\flashplayer11_1r102_55_win_sa_debug_32bit.exe"
(in directory "C:\jenkins_slave\workspace\flex-sdk_mustella\mustella\tests\containers\Canvas\SWFs"):
CreateProcess error=1455, The paging file is too small for this operation to complete
     [java] 	at java.lang.ProcessBuilder.start(ProcessBuilder.java:459)
     [java] 	at java.lang.Runtime.exec(Runtime.java:593)
     [java] 	at mustella.Runner$Execer.run(Runner.java:1679)
     [java] Caused by: java.io.IOException: CreateProcess error=1455, The paging file is too
small for this operation to complete
     [java] 	at java.lang.ProcessImpl.create(Native Method)
     [java] 	at java.lang.ProcessImpl.<init>(ProcessImpl.java:81)
     [java] 	at java.lang.ProcessImpl.start(ProcessImpl.java:30)
     [java] 	at java.lang.ProcessBuilder.start(ProcessBuilder.java:452)
     [java] 	... 2 more
     [java] java.lang.NullPointerException
     [java] 	at mustella.Runner$Execer.run(Runner.java:1693)
     [java] Total Results so far: 8763
     [java] Grab log, do parse = false
     [java] Grabbing the log from: C:\Users\ApacheFlex\AppData/Roaming\Macromedia/Flash Player/Logs/flashlog.txt
to: C:\jenkins_slave\workspace\flex-sdk_mustella\mustella\tests\containers\Canvas\SWFs\PreferredCanvas.log
     [java] Grablog: never saw the ScriptDone for C:\jenkins_slave\workspace\flex-sdk_mustella\mustella\tests\containers\Canvas\SWFs\PreferredCanvas.swf
     [java] new test file: C:\jenkins_slave\workspace\flex-sdk_mustella\mustella\tests\containers\ControlBar\SWFs\CB_Integration.swf
     [java] ******** cmdArr before: 
     [java] 	C:\ApacheFlex\dependencies\FlashPlayer_Debug\flashplayer11_1r102_55_win_sa_debug_32bit.exe
     [java] 	C:\jenkins_slave\workspace\flex-sdk_mustella\mustella\tests\containers\ControlBar\SWFs\CB_Integration.swf
     [java] ******** moreParameters before: 
     [java] ******** cmdArr after: 
     [java] 	C:\ApacheFlex\dependencies\FlashPlayer_Debug\flashplayer11_1r102_55_win_sa_debug_32bit.exe
     [java] 	C:\jenkins_slave\workspace\flex-sdk_mustella\mustella\tests\containers\ControlBar\SWFs\CB_Integration.swf
     [java] getting directory from the swf file
     [java] derived directory: C:\jenkins_slave\workspace\flex-sdk_mustella\mustella\tests\containers\ControlBar\SWFs
     [java] Launching: 
     [java]  C:\ApacheFlex\dependencies\FlashPlayer_Debug\flashplayer11_1r102_55_win_sa_debug_32bit.exe
C:\jenkins_slave\workspace\flex-sdk_mustella\mustella\tests\containers\ControlBar\SWFs\CB_Integration.swf
Launching: C:\ApacheFlex\dependencies\FlashPlayer_Debug\flashplayer11_1r102_55_win_sa_debug_32bit.exe
C:\jenkins_slave\workspace\flex-sdk_mustella\mustella\tests\containers\ControlBar\SWFs\CB_Integration.swf
     [java] USING directory: C:\jenkins_slave\workspace\flex-sdk_mustella\mustella\tests\containers\ControlBar\SWFs
     [java] time: 16:36:17.727
     [java] java.io.IOException: Cannot run program "C:\ApacheFlex\dependencies\FlashPlayer_Debug\flashplayer11_1r102_55_win_sa_debug_32bit.exe"
(in directory "C:\jenkins_slave\workspace\flex-sdk_mustella\mustella\tests\containers\ControlBar\SWFs"):
CreateProcess error=1455, The paging file is too small for this operation to complete
     [java] 	at java.lang.ProcessBuilder.start(ProcessBuilder.java:459)
     [java] 	at java.lang.Runtime.exec(Runtime.java:593)
     [java] 	at mustella.Runner$Execer.run(Runner.java:1679)
     [java] Caused by: java.io.IOException: CreateProcess error=1455, The paging file is too
small for this operation to complete
     [java] 	at java.lang.ProcessImpl.create(Native Method)
     [java] 	at java.lang.ProcessImpl.<init>(ProcessImpl.java:81)
     [java] 	at java.lang.ProcessImpl.start(ProcessImpl.java:30)
     [java] 	at java.lang.ProcessBuilder.start(ProcessBuilder.java:452)
     [java] 	... 2 more
     [java] java.lang.NullPointerException
     [java] 	at mustella.Runner$Execer.run(Runner.java:1693)
     [java] Total Results so far: 8763
     [java] Grab log, do parse = false
     [java] Grabbing the log from: C:\Users\ApacheFlex\AppData/Roaming\Macromedia/Flash Player/Logs/flashlog.txt
to: C:\jenkins_slave\workspace\flex-sdk_mustella\mustella\tests\containers\ControlBar\SWFs\CB_Integration.log
     [java] Grablog: never saw the ScriptDone for C:\jenkins_slave\workspace\flex-sdk_mustella\mustella\tests\containers\ControlBar\SWFs\CB_Integration.swf
     [java] new test file: C:\jenkins_slave\workspace\flex-sdk_mustella\mustella\tests\containers\ControlBar\SWFs\ControlBar_Basic.swf
     [java] ******** cmdArr before: 
     [java] 	C:\ApacheFlex\dependencies\FlashPlayer_Debug\flashplayer11_1r102_55_win_sa_debug_32bit.exe
     [java] 	C:\jenkins_slave\workspace\flex-sdk_mustella\mustella\tests\containers\ControlBar\SWFs\ControlBar_Basic.swf
     [java] ******** moreParameters before: 
     [java] ******** cmdArr after: 
     [java] 	C:\ApacheFlex\dependencies\FlashPlayer_Debug\flashplayer11_1r102_55_win_sa_debug_32bit.exe
     [java] 	C:\jenkins_slave\workspace\flex-sdk_mustella\mustella\tests\containers\ControlBar\SWFs\ControlBar_Basic.swf
     [java] getting directory from the swf file
     [java] derived directory: C:\jenkins_slave\workspace\flex-sdk_mustella\mustella\tests\containers\ControlBar\SWFs
     [java] Launching: 
     [java]  C:\ApacheFlex\dependencies\FlashPlayer_Debug\flashplayer11_1r102_55_win_sa_debug_32bit.exe
C:\jenkins_slave\workspace\flex-sdk_mustella\mustella\tests\containers\ControlBar\SWFs\ControlBar_Basic.swf
Launching: C:\ApacheFlex\dependencies\FlashPlayer_Debug\flashplayer11_1r102_55_win_sa_debug_32bit.exe
C:\jenkins_slave\workspace\flex-sdk_mustella\mustella\tests\containers\ControlBar\SWFs\ControlBar_Basic.swf
     [java] USING directory: C:\jenkins_slave\workspace\flex-sdk_mustella\mustella\tests\containers\ControlBar\SWFs
     [java] time: 16:36:17.782
     [java] java.io.IOException: Cannot run program "C:\ApacheFlex\dependencies\FlashPlayer_Debug\flashplayer11_1r102_55_win_sa_debug_32bit.exe"
(in directory "C:\jenkins_slave\workspace\flex-sdk_mustella\mustella\tests\containers\ControlBar\SWFs"):
CreateProcess error=1455, The paging file is too small for this operation to complete
     [java] 	at java.lang.ProcessBuilder.start(ProcessBuilder.java:459)
     [java] 	at java.lang.Runtime.exec(Runtime.java:593)
     [java] 	at mustella.Runner$Execer.run(Runner.java:1679)
     [java] Caused by: java.io.IOException: CreateProcess error=1455, The paging file is too
small for this operation to complete
     [java] 	at java.lang.ProcessImpl.create(Native Method)
     [java] 	at java.lang.ProcessImpl.<init>(ProcessImpl.java:81)
     [java] 	at java.lang.ProcessImpl.start(ProcessImpl.java:30)
     [java] 	at java.lang.ProcessBuilder.start(ProcessBuilder.java:452)
     [java] 	... 2 more
     [java] java.lang.NullPointerException
     [java] 	at mustella.Runner$Execer.run(Runner.java:1693)
     [java] Total Results so far: 8763
     [java] Grab log, do parse = false
     [java] Grabbing the log from: C:\Users\ApacheFlex\AppData/Roaming\Macromedia/Flash Player/Logs/flashlog.txt
to: C:\jenkins_slave\workspace\flex-sdk_mustella\mustella\tests\containers\ControlBar\SWFs\ControlBar_Basic.log
     [java] Grablog: never saw the ScriptDone for C:\jenkins_slave\workspace\flex-sdk_mustella\mustella\tests\containers\ControlBar\SWFs\ControlBar_Basic.swf
     [java] new test file: C:\jenkins_slave\workspace\flex-sdk_mustella\mustella\tests\containers\ControlBar\SWFs\ControlBar_Basic_Spark.swf
     [java] ******** cmdArr before: 
     [java] 	C:\ApacheFlex\dependencies\FlashPlayer_Debug\flashplayer11_1r102_55_win_sa_debug_32bit.exe
     [java] 	C:\jenkins_slave\workspace\flex-sdk_mustella\mustella\tests\containers\ControlBar\SWFs\ControlBar_Basic_Spark.swf
     [java] ******** moreParameters before: 
     [java] ******** cmdArr after: 
     [java] 	C:\ApacheFlex\dependencies\FlashPlayer_Debug\flashplayer11_1r102_55_win_sa_debug_32bit.exe
     [java] 	C:\jenkins_slave\workspace\flex-sdk_mustella\mustella\tests\containers\ControlBar\SWFs\ControlBar_Basic_Spark.swf
     [java] getting directory from the swf file
     [java] derived directory: C:\jenkins_slave\workspace\flex-sdk_mustella\mustella\tests\containers\ControlBar\SWFs
     [java] Launching: 
     [java]  C:\ApacheFlex\dependencies\FlashPlayer_Debug\flashplayer11_1r102_55_win_sa_debug_32bit.exe
C:\jenkins_slave\workspace\flex-sdk_mustella\mustella\tests\containers\ControlBar\SWFs\ControlBar_Basic_Spark.swf
Launching: C:\ApacheFlex\dependencies\FlashPlayer_Debug\flashplayer11_1r102_55_win_sa_debug_32bit.exe
C:\jenkins_slave\workspace\flex-sdk_mustella\mustella\tests\containers\ControlBar\SWFs\ControlBar_Basic_Spark.swf
     [java] USING directory: C:\jenkins_slave\workspace\flex-sdk_mustella\mustella\tests\containers\ControlBar\SWFs
     [java] time: 16:36:17.835
     [java] java.io.IOException: Cannot run program "C:\ApacheFlex\dependencies\FlashPlayer_Debug\flashplayer11_1r102_55_win_sa_debug_32bit.exe"
(in directory "C:\jenkins_slave\workspace\flex-sdk_mustella\mustella\tests\containers\ControlBar\SWFs"):
CreateProcess error=1455, The paging file is too small for this operation to complete
     [java] 	at java.lang.ProcessBuilder.start(ProcessBuilder.java:459)
     [java] 	at java.lang.Runtime.exec(Runtime.java:593)
     [java] 	at mustella.Runner$Execer.run(Runner.java:1679)
     [java] Caused by: java.io.IOException: CreateProcess error=1455, The paging file is too
small for this operation to complete
     [java] 	at java.lang.ProcessImpl.create(Native Method)
     [java] 	at java.lang.ProcessImpl.<init>(ProcessImpl.java:81)
     [java] 	at java.lang.ProcessImpl.start(ProcessImpl.java:30)
     [java] 	at java.lang.ProcessBuilder.start(ProcessBuilder.java:452)
     [java] 	... 2 more
     [java] java.lang.NullPointerException
     [java] 	at mustella.Runner$Execer.run(Runner.java:1693)
     [java] Total Results so far: 8763
     [java] Grab log, do parse = false
     [java] Grabbing the log from: C:\Users\ApacheFlex\AppData/Roaming\Macromedia/Flash Player/Logs/flashlog.txt
to: C:\jenkins_slave\workspace\flex-sdk_mustella\mustella\tests\containers\ControlBar\SWFs\ControlBar_Basic_Spark.log
     [java] Grablog: never saw the ScriptDone for C:\jenkins_slave\workspace\flex-sdk_mustella\mustella\tests\containers\ControlBar\SWFs\ControlBar_Basic_Spark.swf
     [java] new test file: C:\jenkins_slave\workspace\flex-sdk_mustella\mustella\tests\containers\DividedBox\SWFs\DivBoxMain.swf
     [java] ******** cmdArr before: 
     [java] 	C:\ApacheFlex\dependencies\FlashPlayer_Debug\flashplayer11_1r102_55_win_sa_debug_32bit.exe
     [java] 	C:\jenkins_slave\workspace\flex-sdk_mustella\mustella\tests\containers\DividedBox\SWFs\DivBoxMain.swf
     [java] ******** moreParameters before: 
     [java] ******** cmdArr after: 
     [java] 	C:\ApacheFlex\dependencies\FlashPlayer_Debug\flashplayer11_1r102_55_win_sa_debug_32bit.exe
     [java] 	C:\jenkins_slave\workspace\flex-sdk_mustella\mustella\tests\containers\DividedBox\SWFs\DivBoxMain.swf
     [java] getting directory from the swf file
     [java] derived directory: C:\jenkins_slave\workspace\flex-sdk_mustella\mustella\tests\containers\DividedBox\SWFs
     [java] Launching: 
     [java]  C:\ApacheFlex\dependencies\FlashPlayer_Debug\flashplayer11_1r102_55_win_sa_debug_32bit.exe
C:\jenkins_slave\workspace\flex-sdk_mustella\mustella\tests\containers\DividedBox\SWFs\DivBoxMain.swf
Launching: C:\ApacheFlex\dependencies\FlashPlayer_Debug\flashplayer11_1r102_55_win_sa_debug_32bit.exe
C:\jenkins_slave\workspace\flex-sdk_mustella\mustella\tests\containers\DividedBox\SWFs\DivBoxMain.swf
     [java] USING directory: C:\jenkins_slave\workspace\flex-sdk_mustella\mustella\tests\containers\DividedBox\SWFs
     [java] time: 16:36:17.892
     [java] java.io.IOException: Cannot run program "C:\ApacheFlex\dependencies\FlashPlayer_Debug\flashplayer11_1r102_55_win_sa_debug_32bit.exe"
(in directory "C:\jenkins_slave\workspace\flex-sdk_mustella\mustella\tests\containers\DividedBox\SWFs"):
CreateProcess error=1455, The paging file is too small for this operation to complete
     [java] 	at java.lang.ProcessBuilder.start(ProcessBuilder.java:459)
     [java] 	at java.lang.Runtime.exec(Runtime.java:593)
     [java] 	at mustella.Runner$Execer.run(Runner.java:1679)
     [java] Caused by: java.io.IOException: CreateProcess error=1455, The paging file is too
small for this operation to complete
     [java] 	at java.lang.ProcessImpl.create(Native Method)
     [java] 	at java.lang.ProcessImpl.<init>(ProcessImpl.java:81)
     [java] 	at java.lang.ProcessImpl.start(ProcessImpl.java:30)
     [java] 	at java.lang.ProcessBuilder.start(ProcessBuilder.java:452)
     [java] 	... 2 more
     [java] java.lang.NullPointerException
     [java] 	at mustella.Runner$Execer.run(Runner.java:1693)
     [java] Total Results so far: 8763
Java HotSpot(TM) Client VM warning: Attempt to allocate stack guard pages failed.
Java HotSpot(TM) Client VM warning: Attempt to unguard stack red zone failed.
An unrecoverable stack overflow has occurred.
#
# An unexpected error has been detected by Java Runtime Environment:
#
#  EXCEPTION_STACK_OVERFLOW (0xc00000fd) at pc=0x6d87f513, pid=2124, tid=30224
#
# Java VM: Java HotSpot(TM) Client VM (1.6.0-b105 mixed mode, sharing)
# Problematic frame:
# V  [jvm.dll+0xbf513]
#
# An error report file with more information is saved as hs_err_pid2124.log
     [java] Grab log, do parse = false
     [java] Grabbing the log from: C:\Users\ApacheFlex\AppData/Roaming\Macromedia/Flash Player/Logs/flashlog.txt
to: C:\jenkins_slave\workspace\flex-sdk_mustella\mustella\tests\containers\DividedBox\SWFs\DivBoxMain.log
     [java] Grablog: never saw the ScriptDone for C:\jenkins_slave\workspace\flex-sdk_mustella\mustella\tests\containers\DividedBox\SWFs\DivBoxMain.swf
     [java] new test file: C:\jenkins_slave\workspace\flex-sdk_mustella\mustella\tests\containers\DividedBox\SWFs\DivBoxMain_spark.swf
     [java] ******** cmdArr before: 
     [java] 	C:\ApacheFlex\dependencies\FlashPlayer_Debug\flashplayer11_1r102_55_win_sa_debug_32bit.exe
     [java] 	C:\jenkins_slave\workspace\flex-sdk_mustella\mustella\tests\containers\DividedBox\SWFs\DivBoxMain_spark.swf
     [java] ******** moreParameters before: 
     [java] ******** cmdArr after: 
     [java] 	C:\ApacheFlex\dependencies\FlashPlayer_Debug\flashplayer11_1r102_55_win_sa_debug_32bit.exe
     [java] 	C:\jenkins_slave\workspace\flex-sdk_mustella\mustella\tests\containers\DividedBox\SWFs\DivBoxMain_spark.swf
     [java] getting directory from the swf file
     [java] derived directory: C:\jenkins_slave\workspace\flex-sdk_mustella\mustella\tests\containers\DividedBox\SWFs
     [java] Launching: 
     [java]  C:\ApacheFlex\dependencies\FlashPlayer_Debug\flashplayer11_1r102_55_win_sa_debug_32bit.exe
C:\jenkins_slave\workspace\flex-sdk_mustella\mustella\tests\containers\DividedBox\SWFs\DivBoxMain_spark.swf
Launching: C:\ApacheFlex\dependencies\FlashPlayer_Debug\flashplayer11_1r102_55_win_sa_debug_32bit.exe
C:\jenkins_slave\workspace\flex-sdk_mustella\mustella\tests\containers\DividedBox\SWFs\DivBoxMain_spark.swf
     [java] USING directory: C:\jenkins_slave\workspace\flex-sdk_mustella\mustella\tests\containers\DividedBox\SWFs
     [java] time: 16:36:17.948
     [java] java.io.IOException: Cannot run program "C:\ApacheFlex\dependencies\FlashPlayer_Debug\flashplayer11_1r102_55_win_sa_debug_32bit.exe"
(in directory "C:\jenkins_slave\workspace\flex-sdk_mustella\mustella\tests\containers\DividedBox\SWFs"):
CreateProcess error=1455, The paging file is too small for this operation to complete
     [java] 	at java.lang.ProcessBuilder.start(ProcessBuilder.java:459)
     [java] 	at java.lang.Runtime.exec(Runtime.java:593)
     [java] 	at mustella.Runner$Execer.run(Runner.java:1679)
     [java] Caused by: java.io.IOException: CreateProcess error=1455, The paging file is too
small for this operation to complete
     [java] 	at java.lang.ProcessImpl.create(Native Method)
     [java] 	at java.lang.ProcessImpl.<init>(ProcessImpl.java:81)
     [java] 	at java.lang.ProcessImpl.start(ProcessImpl.java:30)
     [java] 	at java.lang.ProcessBuilder.start(ProcessBuilder.java:452)
     [java] 	... 2 more
     [java] java.lang.NullPointerException
     [java] 	at mustella.Runner$Execer.run(Runner.java:1693)
     [java] Total Results so far: 8763
#
# If you would like to submit a bug report, please visit:
#   http://java.sun.com/webapps/bugreport/crash.jsp
#



============ JENKINS MUSTELLA RUN REPORT ============

Date and time: 09-27-2013 21:36

Settings:
player.version = 11.1
air.version = 3.7
FLASHPLAYER_DEBUGGER = C:\ApacheFlex\dependencies\FlashPlayer_Debug\flashplayer11_1r102_55_win_sa_debug_32bit.exe
AIR_HOME = C:\ApacheFlex\dependencies\AdobeAIRSDK\3.7

Build: 
  type = main
  command = -timeout=60000
  set = -all

Log:
- Made Cygwin ignore carriage returns
- Cleaned up 'local.properties' files from previous runs
- Set FLASH_VERSION to '11.1' and AIR_VERSION to '3.7'
- Set AIR_HOME to 'C:\ApacheFlex\dependencies\AdobeAIRSDK\3.7'
- Set FLASHPLAYER_DEBUGGER to 'C:\ApacheFlex\dependencies\FlashPlayer_Debug\flashplayer11_1r102_55_win_sa_debug_32bit.exe'
- Ran 'clean', 'main' and 'other.locales' ant targets to prepare the SDK for testing
- Ran Mustella on the SDK with these parameters: '-timeout=60000 -all'
- All tests passed on the first run


=====================================================



Process leaked file descriptors. See http://wiki.jenkins-ci.org/display/JENKINS/Spawning+processes+from+build
for more information
FATAL: Remote call on WindowsSlave failed
java.io.IOException: Remote call on WindowsSlave failed
	at hudson.remoting.Channel.call(Channel.java:681)
	at hudson.Launcher$RemoteLauncher.kill(Launcher.java:877)
	at hudson.plugins.cygpath.CygpathLauncherDecorator$1.kill(CygpathLauncherDecorator.java:76)
	at hudson.model.AbstractBuild$AbstractBuildExecution.run(AbstractBuild.java:609)
	at hudson.model.Run.execute(Run.java:1576)
	at hudson.model.FreeStyleBuild.run(FreeStyleBuild.java:46)
	at hudson.model.ResourceController.execute(ResourceController.java:88)
	at hudson.model.Executor.run(Executor.java:241)
Caused by: java.lang.OutOfMemoryError: Java heap space
	at org.jvnet.winp.Native.getCmdLineAndEnvVars(Native Method)
	at org.jvnet.winp.WinProcess.parseCmdLineAndEnvVars(WinProcess.java:114)
	at org.jvnet.winp.WinProcess.getEnvironmentVariables(WinProcess.java:109)
	at hudson.util.ProcessTree$Windows$1.getEnvironmentVariables(ProcessTree.java:434)
	at hudson.util.ProcessTree$OSProcess.hasMatchingEnvVars(ProcessTree.java:267)
	at hudson.util.ProcessTree$Windows.killAll(ProcessTree.java:460)
	at hudson.Launcher$RemoteLauncher$KillTask.call(Launcher.java:889)
	at hudson.Launcher$RemoteLauncher$KillTask.call(Launcher.java:880)
	at hudson.remoting.UserRequest.perform(UserRequest.java:118)
	at hudson.remoting.UserRequest.perform(UserRequest.java:48)
	at hudson.remoting.Request$2.run(Request.java:326)
	at hudson.remoting.InterceptingExecutorService$1.call(InterceptingExecutorService.java:72)
	at java.util.concurrent.FutureTask$Sync.innerRun(FutureTask.java:303)
	at java.util.concurrent.FutureTask.run(FutureTask.java:138)
	at java.util.concurrent.ThreadPoolExecutor$Worker.runTask(ThreadPoolExecutor.java:885)
	at java.util.concurrent.ThreadPoolExecutor$Worker.run(ThreadPoolExecutor.java:907)
	at hudson.remoting.Engine$1$1.run(Engine.java:58)
	at java.lang.Thread.run(Thread.java:619)

Mime
View raw message