falcon-dev mailing list archives

Site index · List index
Message view « Date » · « Thread »
Top « Date » · « Thread »
From Apache Jenkins Server <jenk...@builds.apache.org>
Subject Build failed in Jenkins: Apache-falcon #1119
Date Wed, 25 Jan 2017 03:40:39 GMT
See <https://builds.apache.org/job/Apache-falcon/1119/changes>

Changes:

[pallavi.rao] FALCON-2246 Api to list all the jobs in the system

[pallavi.rao] FALCON-2263 Deletion of entities for an extension has to have a specific

------------------------------------------
[...truncated 1191 lines...]
-------------------------------------------------------

-------------------------------------------------------
 T E S T S
-------------------------------------------------------
Running org.apache.falcon.expression.ExpressionHelperTest
Tests run: 25, Failures: 0, Errors: 0, Skipped: 0, Time elapsed: 0.869 sec - in org.apache.falcon.expression.ExpressionHelperTest
Running org.apache.falcon.cleanup.LogCleanupServiceTest
*** Error in `/usr/local/asfpackages/java/jdk1.7.0-64/jre/bin/java': malloc(): memory corruption:
0x00007fa2dcbe8470 ***
Aborted
Running org.apache.falcon.service.GroupsServiceTest
Tests run: 2, Failures: 0, Errors: 0, Skipped: 0, Time elapsed: 1.218 sec - in org.apache.falcon.service.GroupsServiceTest
Running org.apache.falcon.service.ProxyUserServiceTest
Tests run: 13, Failures: 0, Errors: 0, Skipped: 0, Time elapsed: 1.499 sec - in org.apache.falcon.service.ProxyUserServiceTest
Running org.apache.falcon.retention.EvictedInstanceSerDeTest
*** Error in `/usr/local/asfpackages/java/jdk1.7.0-64/jre/bin/java': malloc(): memory corruption:
0x00007f8fc4bed460 ***
Aborted
Running org.apache.falcon.retention.EvictionHelperTest
Tests run: 1, Failures: 0, Errors: 0, Skipped: 0, Time elapsed: 0.66 sec - in org.apache.falcon.retention.EvictionHelperTest
Running org.apache.falcon.update.UpdateHelperTest
*** Error in `/usr/local/asfpackages/java/jdk1.7.0-64/jre/bin/java': malloc(): memory corruption:
0x00007f8c68d9b880 ***
Aborted
Running org.apache.falcon.group.FeedGroupMapTest
*** Error in `/usr/local/asfpackages/java/jdk1.7.0-64/jre/bin/java': malloc(): memory corruption:
0x00007f047cbbeb00 ***
Aborted
Running org.apache.falcon.entity.HiveUtilTest
*** Error in `/usr/local/asfpackages/java/jdk1.7.0-64/jre/bin/java': malloc(): memory corruption:
0x00007f2844bf5410 ***
Aborted
Running org.apache.falcon.entity.store.ConfigurationStoreTest
*** Error in `/usr/local/asfpackages/java/jdk1.7.0-64/jre/bin/java': malloc(): memory corruption:
0x00007f985ccd1f10 ***
Aborted
Running org.apache.falcon.entity.store.FeedLocationStoreTest
*** Error in `/usr/local/asfpackages/java/jdk1.7.0-64/jre/bin/java': malloc(): memory corruption:
0x00007f05c0bfa7b0 ***
Aborted
Running org.apache.falcon.entity.StorageFactoryTest
*** Error in `/usr/local/asfpackages/java/jdk1.7.0-64/jre/bin/java': malloc(): memory corruption:
0x00007f7c1cd9fab0 ***
Aborted
Running org.apache.falcon.entity.lock.MemoryLocksTest
Tests run: 3, Failures: 0, Errors: 0, Skipped: 0, Time elapsed: 1.472 sec - in org.apache.falcon.entity.lock.MemoryLocksTest
Running org.apache.falcon.entity.FeedDataPathTest
Tests run: 5, Failures: 0, Errors: 0, Skipped: 0, Time elapsed: 0.308 sec - in org.apache.falcon.entity.FeedDataPathTest
Running org.apache.falcon.entity.CatalogStorageTest
Tests run: 17, Failures: 0, Errors: 0, Skipped: 0, Time elapsed: 0.733 sec - in org.apache.falcon.entity.CatalogStorageTest
Running org.apache.falcon.entity.FileSystemStorageTest
*** Error in `/usr/local/asfpackages/java/jdk1.7.0-64/jre/bin/java': malloc(): memory corruption:
0x00007f6198becf70 ***
Aborted
Running org.apache.falcon.entity.parser.FeedEntityParserTest
*** Error in `/usr/local/asfpackages/java/jdk1.7.0-64/jre/bin/java': malloc(): memory corruption:
0x00007f37a0e0a630 ***
Aborted
Running org.apache.falcon.entity.parser.ClusterEntityParserTest
*** Error in `/usr/local/asfpackages/java/jdk1.7.0-64/jre/bin/java': malloc(): memory corruption:
0x00007f4e84ccb120 ***
Aborted
Running org.apache.falcon.entity.parser.ProcessEntityParserTest
*** Error in `/usr/local/asfpackages/java/jdk1.7.0-64/jre/bin/java': malloc(): memory corruption:
0x00007faa04d57270 ***
Aborted
Running org.apache.falcon.entity.parser.FeedUpdateTest
*** Error in `/usr/local/asfpackages/java/jdk1.7.0-64/jre/bin/java': malloc(): memory corruption:
0x00007f3f4cd939f0 ***
Aborted
Running org.apache.falcon.entity.parser.DatasourceEntityParserTest
*** Error in `/usr/local/asfpackages/java/jdk1.7.0-64/jre/bin/java': malloc(): memory corruption:
0x00007fc060d0f860 ***
Aborted
Running org.apache.falcon.entity.ProcessHelperTest
*** Error in `/usr/local/asfpackages/java/jdk1.7.0-64/jre/bin/java': malloc(): memory corruption:
0x00007efd74c54f40 ***
Aborted
Running org.apache.falcon.entity.EntityTypeTest
Tests run: 4, Failures: 0, Errors: 0, Skipped: 0, Time elapsed: 1.345 sec - in org.apache.falcon.entity.EntityTypeTest
Running org.apache.falcon.entity.v0.EntityGraphTest
*** Error in `/usr/local/asfpackages/java/jdk1.7.0-64/jre/bin/java': malloc(): memory corruption:
0x00007f1edcd43ca0 ***
Aborted
Running org.apache.falcon.entity.EntityUtilTest
*** Error in `/usr/local/asfpackages/java/jdk1.7.0-64/jre/bin/java': malloc(): memory corruption:
0x00007f10acb89790 ***
Aborted
Running org.apache.falcon.entity.ColoClusterRelationTest
*** Error in `/usr/local/asfpackages/java/jdk1.7.0-64/jre/bin/java': malloc(): memory corruption:
0x00007fdc84bef5d0 ***
Aborted
Running org.apache.falcon.entity.FeedHelperTest
*** Error in `/usr/local/asfpackages/java/jdk1.7.0-64/jre/bin/java': malloc(): memory corruption:
0x00007fec48b9fa80 ***
Aborted
Running org.apache.falcon.entity.TestWorkflowNameBuilder
Tests run: 7, Failures: 0, Errors: 0, Skipped: 0, Time elapsed: 1.254 sec - in org.apache.falcon.entity.TestWorkflowNameBuilder
Running org.apache.falcon.security.DefaultAuthorizationProviderTest
*** Error in `/usr/local/asfpackages/java/jdk1.7.0-64/jre/bin/java': malloc(): memory corruption:
0x00007f35acdf9ca0 ***
Aborted
Running org.apache.falcon.security.SecurityUtilTest
*** Error in `/usr/local/asfpackages/java/jdk1.7.0-64/jre/bin/java': malloc(): memory corruption:
0x00007f9090bc46e0 ***
Aborted
Running org.apache.falcon.security.AuthenticationInitializationServiceTest
*** Error in `/usr/local/asfpackages/java/jdk1.7.0-64/jre/bin/java': malloc(): memory corruption:
0x00007f8068c17150 ***
Aborted
Running org.apache.falcon.security.CurrentUserTest
Tests run: 22, Failures: 0, Errors: 0, Skipped: 0, Time elapsed: 1.455 sec - in org.apache.falcon.security.CurrentUserTest
Running org.apache.falcon.util.RadixNodeTest
Tests run: 9, Failures: 0, Errors: 0, Skipped: 0, Time elapsed: 0.397 sec - in org.apache.falcon.util.RadixNodeTest
Running org.apache.falcon.util.HadoopQueueUtilTest
Tests run: 2, Failures: 0, Errors: 0, Skipped: 0, Time elapsed: 0.738 sec - in org.apache.falcon.util.HadoopQueueUtilTest
Running org.apache.falcon.util.ApplicationPropertiesTest
*** Error in `/usr/local/asfpackages/java/jdk1.7.0-64/jre/bin/java': malloc(): memory corruption:
0x00007f83ecc14b40 ***
Aborted
Running org.apache.falcon.util.RadixTreeTest
Tests run: 26, Failures: 0, Errors: 0, Skipped: 0, Time elapsed: 0.928 sec - in org.apache.falcon.util.RadixTreeTest
Running org.apache.falcon.util.ReflectionUtilsTest
*** Error in `/usr/local/asfpackages/java/jdk1.7.0-64/jre/bin/java': malloc(): memory corruption:
0x00007f6188ba35b0 ***
Aborted
Running org.apache.falcon.metadata.MetadataMappingServiceTest
*** Error in `/usr/local/asfpackages/java/jdk1.7.0-64/jre/bin/java': malloc(): memory corruption:
0x00007f22d0e73750 ***
Aborted
Running org.apache.falcon.hadoop.HadoopClientFactoryTest
*** Error in `/usr/local/asfpackages/java/jdk1.7.0-64/jre/bin/java': malloc(): memory corruption:
0x00007fbeb8bd29b0 ***
Aborted
Running org.apache.falcon.workflow.WorkflowJobEndNotificationServiceTest
*** Error in `/usr/local/asfpackages/java/jdk1.7.0-64/jre/bin/java': malloc(): memory corruption:
0x00007f2914d05740 ***
Aborted
Running org.apache.falcon.workflow.WorkflowExecutionContextTest
*** Error in `/usr/local/asfpackages/java/jdk1.7.0-64/jre/bin/java': malloc(): memory corruption:
0x00007fc03ce46600 ***
Aborted
Running cli.TestCLIParser
Tests run: 3, Failures: 0, Errors: 0, Skipped: 0, Time elapsed: 0.354 sec - in cli.TestCLIParser

Results :

Tests run: 139, Failures: 0, Errors: 0, Skipped: 0

[INFO] ------------------------------------------------------------------------
[INFO] Reactor Summary:
[INFO] 
[INFO] Apache Falcon ...................................... SUCCESS [ 21.231 s]
[INFO] Apache Falcon UI ................................... SUCCESS [ 19.107 s]
[INFO] Build Tools ........................................ SUCCESS [  6.754 s]
[INFO] Apache Falcon Java common types .................... SUCCESS [ 42.712 s]
[INFO] Apache Falcon Metrics .............................. SUCCESS [ 20.748 s]
[INFO] Apache Falcon Hadoop Dependencies .................. SUCCESS [ 18.342 s]
[INFO] Apache Falcon Test Utility ......................... SUCCESS [ 14.801 s]
[INFO] Apache Falcon Commons .............................. FAILURE [01:41 min]
[INFO] Apache Falcon extensions ........................... SKIPPED
[INFO] Apache Falcon Java client .......................... SKIPPED
[INFO] Apache Falcon Shell ................................ SKIPPED
[INFO] Apache Falcon CLI client ........................... SKIPPED
[INFO] Apache Falcon Titan 1.0 support .................... SKIPPED
[INFO] Apache Falcon Oozie EL Extension ................... SKIPPED
[INFO] Apache Falcon Embedded Hadoop - Test Cluster ....... SKIPPED
[INFO] Apache Falcon Sharelib Hive - Test Cluster ......... SKIPPED
[INFO] Apache Falcon Sharelib Pig - Test Cluster .......... SKIPPED
[INFO] Apache Falcon Sharelib Hcatalog - Test Cluster ..... SKIPPED
[INFO] Apache Falcon Sharelib Oozie - Test Cluster ........ SKIPPED
[INFO] Apache Falcon Test Tools - Test Cluster ............ SKIPPED
[INFO] Apache Falcon Messaging ............................ SKIPPED
[INFO] Apache Falcon LIfecycle Module ..................... SKIPPED
[INFO] Apache Falcon Oozie Adaptor ........................ SKIPPED
[INFO] Apache Falcon Scheduler ............................ SKIPPED
[INFO] Apache Falcon Acquisition .......................... SKIPPED
[INFO] Apache Falcon Distcp Replication ................... SKIPPED
[INFO] Apache Falcon Retention ............................ SKIPPED
[INFO] Apache Falcon Archival ............................. SKIPPED
[INFO] Apache Falcon Rerun ................................ SKIPPED
[INFO] Apache Falcon Prism ................................ SKIPPED
[INFO] Apache Falcon Unit ................................. SKIPPED
[INFO] Apache Falcon Examples ............................. SKIPPED
[INFO] Apache Falcon Web Application ...................... SKIPPED
[INFO] Apache Falcon Documentation ........................ SKIPPED
[INFO] Apache Falcon Distro ............................... SKIPPED
[INFO] ------------------------------------------------------------------------
[INFO] BUILD FAILURE
[INFO] ------------------------------------------------------------------------
[INFO] Total time: 04:07 min
[INFO] Finished at: 2017-01-25T03:40:03+00:00
[INFO] Final Memory: 222M/1542M
[INFO] ------------------------------------------------------------------------
[WARNING] The requested profile "hadoop-2" could not be activated because it does not exist.
[ERROR] Failed to execute goal org.apache.maven.plugins:maven-surefire-plugin:2.16:test (default-test)
on project falcon-common: ExecutionException; nested exception is java.util.concurrent.ExecutionException:
java.lang.RuntimeException: The forked VM terminated without saying properly goodbye. VM crash
or System.exit called ?
[ERROR] Command was/bin/sh -c cd <https://builds.apache.org/job/Apache-falcon/ws/common>
&& /usr/local/asfpackages/java/jdk1.7.0-64/jre/bin/java -Djava.awt.headless=true -Djava.security.krb5.realm=
-Djava.security.krb5.kdc= -jar <https://builds.apache.org/job/Apache-falcon/ws/common/target/surefire/surefirebooter7903532701274648697.jar>
<https://builds.apache.org/job/Apache-falcon/ws/common/target/surefire/surefire8243055390666174637tmp>
<https://builds.apache.org/job/Apache-falcon/ws/common/target/surefire/surefire_67208786710016674032tmp>
[ERROR] -> [Help 1]
[ERROR] 
[ERROR] To see the full stack trace of the errors, re-run Maven with the -e switch.
[ERROR] Re-run Maven using the -X switch to enable full debug logging.
[ERROR] 
[ERROR] For more information about the errors and possible solutions, please read the following
articles:
[ERROR] [Help 1] http://cwiki.apache.org/confluence/display/MAVEN/MojoFailureException
[ERROR] 
[ERROR] After correcting the problems, you can resume the build with the command
[ERROR]   mvn <goals> -rf :falcon-common
Build step 'Execute shell' marked build as failure
[CHECKSTYLE] Collecting checkstyle analysis files...
[CHECKSTYLE] Finding all files that match the pattern **/target/checkstyle-result.xml
[CHECKSTYLE] Parsing 33 files in <https://builds.apache.org/job/Apache-falcon/ws/>
[CHECKSTYLE] Successfully parsed file <https://builds.apache.org/job/Apache-falcon/ws/acquisition/target/checkstyle-result.xml>
with 0 unique warnings and 0 duplicates.
[CHECKSTYLE] Successfully parsed file <https://builds.apache.org/job/Apache-falcon/ws/archival/target/checkstyle-result.xml>
with 0 unique warnings and 0 duplicates.
[CHECKSTYLE] Successfully parsed file <https://builds.apache.org/job/Apache-falcon/ws/build-tools/target/checkstyle-result.xml>
with 0 unique warnings and 0 duplicates.
[CHECKSTYLE] Successfully parsed file <https://builds.apache.org/job/Apache-falcon/ws/cli/target/checkstyle-result.xml>
with 0 unique warnings and 0 duplicates.
[CHECKSTYLE] Successfully parsed file <https://builds.apache.org/job/Apache-falcon/ws/client/target/checkstyle-result.xml>
with 0 unique warnings and 0 duplicates.
[CHECKSTYLE] Successfully parsed file <https://builds.apache.org/job/Apache-falcon/ws/common-types/target/checkstyle-result.xml>
with 0 unique warnings and 0 duplicates.
[CHECKSTYLE] Successfully parsed file <https://builds.apache.org/job/Apache-falcon/ws/distro/target/checkstyle-result.xml>
with 0 unique warnings and 0 duplicates.
[CHECKSTYLE] Successfully parsed file <https://builds.apache.org/job/Apache-falcon/ws/docs/target/checkstyle-result.xml>
with 0 unique warnings and 0 duplicates.
[CHECKSTYLE] Successfully parsed file <https://builds.apache.org/job/Apache-falcon/ws/examples/target/checkstyle-result.xml>
with 0 unique warnings and 0 duplicates.
[CHECKSTYLE] Successfully parsed file <https://builds.apache.org/job/Apache-falcon/ws/extensions/target/checkstyle-result.xml>
with 0 unique warnings and 0 duplicates.
[CHECKSTYLE] Successfully parsed file <https://builds.apache.org/job/Apache-falcon/ws/falcon-ui/target/checkstyle-result.xml>
with 0 unique warnings and 0 duplicates.
[CHECKSTYLE] Successfully parsed file <https://builds.apache.org/job/Apache-falcon/ws/hadoop-dependencies/target/checkstyle-result.xml>
with 0 unique warnings and 0 duplicates.
[CHECKSTYLE] Successfully parsed file <https://builds.apache.org/job/Apache-falcon/ws/lifecycle/target/checkstyle-result.xml>
with 0 unique warnings and 0 duplicates.
[CHECKSTYLE] Successfully parsed file <https://builds.apache.org/job/Apache-falcon/ws/messaging/target/checkstyle-result.xml>
with 0 unique warnings and 0 duplicates.
[CHECKSTYLE] Successfully parsed file <https://builds.apache.org/job/Apache-falcon/ws/metrics/target/checkstyle-result.xml>
with 0 unique warnings and 0 duplicates.
[CHECKSTYLE] Successfully parsed file <https://builds.apache.org/job/Apache-falcon/ws/oozie-el-extensions/target/checkstyle-result.xml>
with 0 unique warnings and 0 duplicates.
[CHECKSTYLE] Successfully parsed file <https://builds.apache.org/job/Apache-falcon/ws/oozie/target/checkstyle-result.xml>
with 0 unique warnings and 0 duplicates.
[CHECKSTYLE] Successfully parsed file <https://builds.apache.org/job/Apache-falcon/ws/prism/target/checkstyle-result.xml>
with 0 unique warnings and 0 duplicates.
[CHECKSTYLE] Successfully parsed file <https://builds.apache.org/job/Apache-falcon/ws/replication/target/checkstyle-result.xml>
with 0 unique warnings and 0 duplicates.
[CHECKSTYLE] Successfully parsed file <https://builds.apache.org/job/Apache-falcon/ws/rerun/target/checkstyle-result.xml>
with 0 unique warnings and 0 duplicates.
[CHECKSTYLE] Successfully parsed file <https://builds.apache.org/job/Apache-falcon/ws/retention/target/checkstyle-result.xml>
with 0 unique warnings and 0 duplicates.
[CHECKSTYLE] Successfully parsed file <https://builds.apache.org/job/Apache-falcon/ws/scheduler/target/checkstyle-result.xml>
with 0 unique warnings and 0 duplicates.
[CHECKSTYLE] Successfully parsed file <https://builds.apache.org/job/Apache-falcon/ws/shell/target/checkstyle-result.xml>
with 0 unique warnings and 0 duplicates.
[CHECKSTYLE] Successfully parsed file <https://builds.apache.org/job/Apache-falcon/ws/target/checkstyle-result.xml>
with 0 unique warnings and 0 duplicates.
[CHECKSTYLE] Successfully parsed file <https://builds.apache.org/job/Apache-falcon/ws/test-tools/hadoop-webapp/target/checkstyle-result.xml>
with 0 unique warnings and 0 duplicates.
[CHECKSTYLE] Successfully parsed file <https://builds.apache.org/job/Apache-falcon/ws/test-tools/hcatalog-sharelib/target/checkstyle-result.xml>
with 0 unique warnings and 0 duplicates.
[CHECKSTYLE] Successfully parsed file <https://builds.apache.org/job/Apache-falcon/ws/test-tools/hive-sharelib/target/checkstyle-result.xml>
with 0 unique warnings and 0 duplicates.
[CHECKSTYLE] Successfully parsed file <https://builds.apache.org/job/Apache-falcon/ws/test-tools/oozie-sharelib/target/checkstyle-result.xml>
with 0 unique warnings and 0 duplicates.
[CHECKSTYLE] Successfully parsed file <https://builds.apache.org/job/Apache-falcon/ws/test-tools/pig-sharelib/target/checkstyle-result.xml>
with 0 unique warnings and 0 duplicates.
[CHECKSTYLE] Successfully parsed file <https://builds.apache.org/job/Apache-falcon/ws/test-tools/target/checkstyle-result.xml>
with 0 unique warnings and 0 duplicates.
[CHECKSTYLE] Successfully parsed file <https://builds.apache.org/job/Apache-falcon/ws/test-util/target/checkstyle-result.xml>
with 0 unique warnings and 0 duplicates.
[CHECKSTYLE] Successfully parsed file <https://builds.apache.org/job/Apache-falcon/ws/unit/target/checkstyle-result.xml>
with 0 unique warnings and 0 duplicates.
[CHECKSTYLE] Successfully parsed file <https://builds.apache.org/job/Apache-falcon/ws/webapp/target/checkstyle-result.xml>
with 0 unique warnings and 0 duplicates.
[CHECKSTYLE] Computing warning deltas based on reference build #1118
[FINDBUGS] Collecting findbugs analysis files...
[FINDBUGS] Finding all files that match the pattern **/target/findbugs.xml
[FINDBUGS] Parsing 21 files in <https://builds.apache.org/job/Apache-falcon/ws/>
[FINDBUGS] Successfully parsed file <https://builds.apache.org/job/Apache-falcon/ws/cli/target/findbugs.xml>
with 0 unique warnings and 0 duplicates.
[FINDBUGS] Successfully parsed file <https://builds.apache.org/job/Apache-falcon/ws/client/target/findbugs.xml>
with 0 unique warnings and 0 duplicates.
[FINDBUGS] Successfully parsed file <https://builds.apache.org/job/Apache-falcon/ws/common-types/target/findbugs.xml>
with 0 unique warnings and 0 duplicates.
[FINDBUGS] Successfully parsed file <https://builds.apache.org/job/Apache-falcon/ws/examples/target/findbugs.xml>
with 0 unique warnings and 0 duplicates.
[FINDBUGS] Successfully parsed file <https://builds.apache.org/job/Apache-falcon/ws/extensions/target/findbugs.xml>
with 0 unique warnings and 0 duplicates.
[FINDBUGS] Successfully parsed file <https://builds.apache.org/job/Apache-falcon/ws/hadoop-dependencies/target/findbugs.xml>
with 0 unique warnings and 0 duplicates.
[FINDBUGS] Successfully parsed file <https://builds.apache.org/job/Apache-falcon/ws/lifecycle/target/findbugs.xml>
with 0 unique warnings and 0 duplicates.
[FINDBUGS] Successfully parsed file <https://builds.apache.org/job/Apache-falcon/ws/messaging/target/findbugs.xml>
with 0 unique warnings and 0 duplicates.
[FINDBUGS] Successfully parsed file <https://builds.apache.org/job/Apache-falcon/ws/metrics/target/findbugs.xml>
with 0 unique warnings and 0 duplicates.
[FINDBUGS] Successfully parsed file <https://builds.apache.org/job/Apache-falcon/ws/oozie-el-extensions/target/findbugs.xml>
with 0 unique warnings and 0 duplicates.
[FINDBUGS] Successfully parsed file <https://builds.apache.org/job/Apache-falcon/ws/oozie/target/findbugs.xml>
with 0 unique warnings and 0 duplicates.
[FINDBUGS] Successfully parsed file <https://builds.apache.org/job/Apache-falcon/ws/prism/target/findbugs.xml>
with 0 unique warnings and 0 duplicates.
[FINDBUGS] Successfully parsed file <https://builds.apache.org/job/Apache-falcon/ws/replication/target/findbugs.xml>
with 0 unique warnings and 0 duplicates.
[FINDBUGS] Successfully parsed file <https://builds.apache.org/job/Apache-falcon/ws/rerun/target/findbugs.xml>
with 0 unique warnings and 0 duplicates.
[FINDBUGS] Successfully parsed file <https://builds.apache.org/job/Apache-falcon/ws/retention/target/findbugs.xml>
with 0 unique warnings and 0 duplicates.
[FINDBUGS] Successfully parsed file <https://builds.apache.org/job/Apache-falcon/ws/scheduler/target/findbugs.xml>
with 0 unique warnings and 0 duplicates.
[FINDBUGS] Successfully parsed file <https://builds.apache.org/job/Apache-falcon/ws/shell/target/findbugs.xml>
with 0 unique warnings and 0 duplicates.
[FINDBUGS] Successfully parsed file <https://builds.apache.org/job/Apache-falcon/ws/test-tools/hadoop-webapp/target/findbugs.xml>
with 0 unique warnings and 0 duplicates.
[FINDBUGS] Successfully parsed file <https://builds.apache.org/job/Apache-falcon/ws/test-util/target/findbugs.xml>
with 0 unique warnings and 0 duplicates.
[FINDBUGS] Successfully parsed file <https://builds.apache.org/job/Apache-falcon/ws/unit/target/findbugs.xml>
with 0 unique warnings and 0 duplicates.
[FINDBUGS] Successfully parsed file <https://builds.apache.org/job/Apache-falcon/ws/webapp/target/findbugs.xml>
with 0 unique warnings and 0 duplicates.
[FINDBUGS] Computing warning deltas based on reference build #1118
Archiving artifacts
Compressed 14.94 MB of artifacts by 97.5% relative to #1118
Recording test results
TestNG Reports Processing: START
Looking for TestNG results report in workspace using pattern: **/target/testng-results.xml
Did not find any matching files.

Mime
View raw message