falcon-dev mailing list archives

Site index · List index
Message view « Date » · « Thread »
Top « Date » · « Thread »
From Apache Jenkins Server <jenk...@builds.apache.org>
Subject Build failed in Jenkins: Apache-falcon #1096
Date Thu, 01 Dec 2016 05:09:45 GMT
See <https://builds.apache.org/job/Apache-falcon/1096/changes>

Changes:

[pallavi.rao] FALCON-2204 Change mode for falcon_merge_pr.py to executable

------------------------------------------
[...truncated 5038 lines...]
            
            
            
Downloading: https://repository.apache.org/content/groups/snapshots/org/apache/falcon/falcon-extensions/0.11-SNAPSHOT/falcon-extensions-0.11-SNAPSHOT-sources.jar
            
Downloading: https://repository.apache.org/content/groups/public/org/apache/falcon/falcon-extensions/0.11-SNAPSHOT/falcon-extensions-0.11-SNAPSHOT-sources.jar
            
Downloading: https://maven.java.net/content/groups/public/org/apache/falcon/falcon-extensions/0.11-SNAPSHOT/falcon-extensions-0.11-SNAPSHOT-sources.jar
            
Downloading: https://repository.jboss.org/nexus/content/groups/public/org/apache/falcon/falcon-extensions/0.11-SNAPSHOT/falcon-extensions-0.11-SNAPSHOT-sources.jar
            
Downloading: http://repository.apache.org/snapshots/org/apache/falcon/falcon-extensions/0.11-SNAPSHOT/falcon-extensions-0.11-SNAPSHOT-sources.jar
            
Downloading: https://repository.apache.org/content/groups/snapshots/org/apache/falcon/falcon-feed-lifecycle/0.11-SNAPSHOT/maven-metadata.xml
Downloading: https://repository.apache.org/content/groups/public/org/apache/falcon/falcon-feed-lifecycle/0.11-SNAPSHOT/maven-metadata.xml
Downloading: https://maven.java.net/content/groups/public/org/apache/falcon/falcon-feed-lifecycle/0.11-SNAPSHOT/maven-metadata.xml
Downloading: https://repository.jboss.org/nexus/content/groups/public/org/apache/falcon/falcon-feed-lifecycle/0.11-SNAPSHOT/maven-metadata.xml
            
Downloading: http://repository.apache.org/snapshots/org/apache/falcon/falcon-feed-lifecycle/0.11-SNAPSHOT/maven-metadata.xml
            
            
            
            
Downloading: https://repository.apache.org/content/groups/snapshots/org/apache/falcon/falcon-feed-lifecycle/0.11-SNAPSHOT/falcon-feed-lifecycle-0.11-SNAPSHOT-sources.jar
            
Downloading: https://repository.apache.org/content/groups/public/org/apache/falcon/falcon-feed-lifecycle/0.11-SNAPSHOT/falcon-feed-lifecycle-0.11-SNAPSHOT-sources.jar
            
Downloading: https://maven.java.net/content/groups/public/org/apache/falcon/falcon-feed-lifecycle/0.11-SNAPSHOT/falcon-feed-lifecycle-0.11-SNAPSHOT-sources.jar
            
Downloading: https://repository.jboss.org/nexus/content/groups/public/org/apache/falcon/falcon-feed-lifecycle/0.11-SNAPSHOT/falcon-feed-lifecycle-0.11-SNAPSHOT-sources.jar
            
Downloading: http://repository.apache.org/snapshots/org/apache/falcon/falcon-feed-lifecycle/0.11-SNAPSHOT/falcon-feed-lifecycle-0.11-SNAPSHOT-sources.jar
            
Downloading: https://repository.apache.org/content/groups/snapshots/org/apache/falcon/falcon-retention/0.11-SNAPSHOT/maven-metadata.xml
Downloading: https://maven.java.net/content/groups/public/org/apache/falcon/falcon-retention/0.11-SNAPSHOT/maven-metadata.xml
Downloading: https://repository.jboss.org/nexus/content/groups/public/org/apache/falcon/falcon-retention/0.11-SNAPSHOT/maven-metadata.xml
Downloading: https://repository.apache.org/content/groups/public/org/apache/falcon/falcon-retention/0.11-SNAPSHOT/maven-metadata.xml
            
Downloading: http://repository.apache.org/snapshots/org/apache/falcon/falcon-retention/0.11-SNAPSHOT/maven-metadata.xml
            
            
            
            
Downloading: https://repository.apache.org/content/groups/snapshots/org/apache/falcon/falcon-retention/0.11-SNAPSHOT/falcon-retention-0.11-SNAPSHOT-sources.jar
            
Downloading: https://repository.apache.org/content/groups/public/org/apache/falcon/falcon-retention/0.11-SNAPSHOT/falcon-retention-0.11-SNAPSHOT-sources.jar
            
Downloading: https://maven.java.net/content/groups/public/org/apache/falcon/falcon-retention/0.11-SNAPSHOT/falcon-retention-0.11-SNAPSHOT-sources.jar
            
Downloading: https://repository.jboss.org/nexus/content/groups/public/org/apache/falcon/falcon-retention/0.11-SNAPSHOT/falcon-retention-0.11-SNAPSHOT-sources.jar
            
Downloading: http://repository.apache.org/snapshots/org/apache/falcon/falcon-retention/0.11-SNAPSHOT/falcon-retention-0.11-SNAPSHOT-sources.jar
            
Downloading: https://repository.apache.org/content/groups/snapshots/org/apache/falcon/falcon-metrics/0.11-SNAPSHOT/maven-metadata.xml
Downloading: https://repository.apache.org/content/groups/public/org/apache/falcon/falcon-metrics/0.11-SNAPSHOT/maven-metadata.xml
Downloading: https://maven.java.net/content/groups/public/org/apache/falcon/falcon-metrics/0.11-SNAPSHOT/maven-metadata.xml
Downloading: https://repository.jboss.org/nexus/content/groups/public/org/apache/falcon/falcon-metrics/0.11-SNAPSHOT/maven-metadata.xml
            
Downloading: http://repository.apache.org/snapshots/org/apache/falcon/falcon-metrics/0.11-SNAPSHOT/maven-metadata.xml
            
            
            
            
Downloading: https://repository.apache.org/content/groups/snapshots/org/apache/falcon/falcon-metrics/0.11-SNAPSHOT/falcon-metrics-0.11-SNAPSHOT-sources.jar
            
Downloading: https://repository.apache.org/content/groups/public/org/apache/falcon/falcon-metrics/0.11-SNAPSHOT/falcon-metrics-0.11-SNAPSHOT-sources.jar
            
Downloading: https://maven.java.net/content/groups/public/org/apache/falcon/falcon-metrics/0.11-SNAPSHOT/falcon-metrics-0.11-SNAPSHOT-sources.jar
            
Downloading: https://repository.jboss.org/nexus/content/groups/public/org/apache/falcon/falcon-metrics/0.11-SNAPSHOT/falcon-metrics-0.11-SNAPSHOT-sources.jar
            
Downloading: http://repository.apache.org/snapshots/org/apache/falcon/falcon-metrics/0.11-SNAPSHOT/falcon-metrics-0.11-SNAPSHOT-sources.jar
            
Downloading: https://repository.apache.org/content/groups/snapshots/org/apache/falcon/falcon-rerun/0.11-SNAPSHOT/maven-metadata.xml
Downloading: https://repository.apache.org/content/groups/public/org/apache/falcon/falcon-rerun/0.11-SNAPSHOT/maven-metadata.xml
Downloading: https://maven.java.net/content/groups/public/org/apache/falcon/falcon-rerun/0.11-SNAPSHOT/maven-metadata.xml
Downloading: https://repository.jboss.org/nexus/content/groups/public/org/apache/falcon/falcon-rerun/0.11-SNAPSHOT/maven-metadata.xml
            
Downloading: http://repository.apache.org/snapshots/org/apache/falcon/falcon-rerun/0.11-SNAPSHOT/maven-metadata.xml
            
            
            
            
Downloading: https://repository.apache.org/content/groups/snapshots/org/apache/falcon/falcon-rerun/0.11-SNAPSHOT/falcon-rerun-0.11-SNAPSHOT-sources.jar
            
Downloading: https://repository.apache.org/content/groups/public/org/apache/falcon/falcon-rerun/0.11-SNAPSHOT/falcon-rerun-0.11-SNAPSHOT-sources.jar
            
Downloading: https://maven.java.net/content/groups/public/org/apache/falcon/falcon-rerun/0.11-SNAPSHOT/falcon-rerun-0.11-SNAPSHOT-sources.jar
            
Downloading: https://repository.jboss.org/nexus/content/groups/public/org/apache/falcon/falcon-rerun/0.11-SNAPSHOT/falcon-rerun-0.11-SNAPSHOT-sources.jar
            
Downloading: http://repository.apache.org/snapshots/org/apache/falcon/falcon-rerun/0.11-SNAPSHOT/falcon-rerun-0.11-SNAPSHOT-sources.jar
            
[INFO] Reflections took 12417 ms to scan 266 urls, producing 1299 keys and 1299 values 
[WARNING] [ENUNCIATE] FIELD instance of Instance of EntitySummaryResult: C# can't handle properties/fields
that are of the same name as their containing class. Either rename the property/field, or
use the @com.webcohesion.enunciate.metadata.ClientName annotation to rename the property/field
on the client-side.
[WARNING] [ENUNCIATE] Web service API makes use of elements that cannot be handled by the
C# XML client. C# XML client will not be generated.
warning: [options] bootstrap class path not set in conjunction with -source 1.5
1 warning
[INFO] 
[INFO] --- maven-remote-resources-plugin:1.5:process (default) @ falcon-prism ---
[INFO] 
[INFO] --- keytool-maven-plugin:1.5:clean (clean-server) @ falcon-prism ---
[WARNING] Keystore file '<https://builds.apache.org/job/Apache-falcon/ws/prism/target/prism.keystore'>
doesn't exist.
[INFO] 
[INFO] --- keytool-maven-plugin:1.5:generateKeyPair (server) @ falcon-prism ---
[INFO] 
[INFO] --- maven-resources-plugin:2.7:resources (default-resources) @ falcon-prism ---
[INFO] Using 'UTF-8' encoding to copy filtered resources.
[INFO] Copying 2 resources
[INFO] Copying 1 resource
[INFO] Copying 0 resource
[INFO] Copying 2 resources to META-INF
[INFO] Copying 3 resources
[INFO] 
[INFO] --- maven-compiler-plugin:2.3.2:compile (default-compile) @ falcon-prism ---
[INFO] Compiling 50 source files to <https://builds.apache.org/job/Apache-falcon/ws/prism/target/classes>
[INFO] -------------------------------------------------------------
[ERROR] COMPILATION ERROR : 
[INFO] -------------------------------------------------------------
[ERROR] <https://builds.apache.org/job/Apache-falcon/ws/prism/src/main/java/org/apache/falcon/jdbc/MonitoringJdbcStateStore.java>:[219,16]
error: cannot find symbol
[INFO] 1 error
[INFO] -------------------------------------------------------------
[INFO] ------------------------------------------------------------------------
[INFO] Reactor Summary:
[INFO] 
[INFO] Apache Falcon ...................................... SUCCESS [ 24.857 s]
[INFO] Apache Falcon UI ................................... SUCCESS [ 18.216 s]
[INFO] Build Tools ........................................ SUCCESS [  6.071 s]
[INFO] Apache Falcon Java common types .................... SUCCESS [ 34.920 s]
[INFO] Apache Falcon Metrics .............................. SUCCESS [ 15.285 s]
[INFO] Apache Falcon Hadoop Dependencies .................. SUCCESS [ 14.532 s]
[INFO] Apache Falcon Test Utility ......................... SUCCESS [ 13.344 s]
[INFO] Apache Falcon Commons .............................. SUCCESS [02:57 min]
[INFO] Apache Falcon extensions ........................... SUCCESS [ 46.395 s]
[INFO] Apache Falcon Java client .......................... SUCCESS [ 22.269 s]
[INFO] Apache Falcon Shell ................................ SUCCESS [ 15.147 s]
[INFO] Apache Falcon CLI client ........................... SUCCESS [ 18.902 s]
[INFO] Apache Falcon Titan 1.0 support .................... SUCCESS [  7.718 s]
[INFO] Apache Falcon Oozie EL Extension ................... SUCCESS [ 17.758 s]
[INFO] Apache Falcon Embedded Hadoop - Test Cluster ....... SUCCESS [ 35.462 s]
[INFO] Apache Falcon Sharelib Hive - Test Cluster ......... SUCCESS [  3.224 s]
[INFO] Apache Falcon Sharelib Pig - Test Cluster .......... SUCCESS [  0.920 s]
[INFO] Apache Falcon Sharelib Hcatalog - Test Cluster ..... SUCCESS [  1.007 s]
[INFO] Apache Falcon Sharelib Oozie - Test Cluster ........ SUCCESS [  0.506 s]
[INFO] Apache Falcon Test Tools - Test Cluster ............ SUCCESS [  0.491 s]
[INFO] Apache Falcon Messaging ............................ SUCCESS [ 34.226 s]
[INFO] Apache Falcon LIfecycle Module ..................... SUCCESS [ 22.981 s]
[INFO] Apache Falcon Oozie Adaptor ........................ SUCCESS [01:12 min]
[INFO] Apache Falcon Scheduler ............................ SUCCESS [01:23 min]
[INFO] Apache Falcon Acquisition .......................... SUCCESS [  0.944 s]
[INFO] Apache Falcon Distcp Replication ................... SUCCESS [ 20.288 s]
[INFO] Apache Falcon Retention ............................ SUCCESS [ 15.601 s]
[INFO] Apache Falcon Archival ............................. SUCCESS [  1.103 s]
[INFO] Apache Falcon Rerun ................................ SUCCESS [ 26.085 s]
[INFO] Apache Falcon Prism ................................ FAILURE [ 48.474 s]
[INFO] Apache Falcon Unit ................................. SKIPPED
[INFO] Apache Falcon Examples ............................. SKIPPED
[INFO] Apache Falcon Web Application ...................... SKIPPED
[INFO] Apache Falcon Documentation ........................ SKIPPED
[INFO] Apache Falcon Distro ............................... SKIPPED
[INFO] ------------------------------------------------------------------------
[INFO] BUILD FAILURE
[INFO] ------------------------------------------------------------------------
[INFO] Total time: 13:21 min
[INFO] Finished at: 2016-12-01T05:06:41+00:00
[INFO] Final Memory: 903M/2046M
[INFO] ------------------------------------------------------------------------
[WARNING] The requested profile "hadoop-2" could not be activated because it does not exist.
[ERROR] Failed to execute goal org.apache.maven.plugins:maven-compiler-plugin:2.3.2:compile
(default-compile) on project falcon-prism: Compilation failure
[ERROR] <https://builds.apache.org/job/Apache-falcon/ws/prism/src/main/java/org/apache/falcon/jdbc/MonitoringJdbcStateStore.java>:[219,16]
error: cannot find symbol
[ERROR] -> [Help 1]
[ERROR] 
[ERROR] To see the full stack trace of the errors, re-run Maven with the -e switch.
[ERROR] Re-run Maven using the -X switch to enable full debug logging.
[ERROR] 
[ERROR] For more information about the errors and possible solutions, please read the following
articles:
[ERROR] [Help 1] http://cwiki.apache.org/confluence/display/MAVEN/MojoFailureException
[ERROR] 
[ERROR] After correcting the problems, you can resume the build with the command
[ERROR]   mvn <goals> -rf :falcon-prism
Build step 'Execute shell' marked build as failure
[CHECKSTYLE] Collecting checkstyle analysis files...
[CHECKSTYLE] Finding all files that match the pattern **/target/checkstyle-result.xml
[CHECKSTYLE] Parsing 33 files in <https://builds.apache.org/job/Apache-falcon/ws/>
[CHECKSTYLE] Successfully parsed file <https://builds.apache.org/job/Apache-falcon/ws/acquisition/target/checkstyle-result.xml>
with 0 unique warnings and 0 duplicates.
[CHECKSTYLE] Successfully parsed file <https://builds.apache.org/job/Apache-falcon/ws/archival/target/checkstyle-result.xml>
with 0 unique warnings and 0 duplicates.
[CHECKSTYLE] Successfully parsed file <https://builds.apache.org/job/Apache-falcon/ws/build-tools/target/checkstyle-result.xml>
with 0 unique warnings and 0 duplicates.
[CHECKSTYLE] Successfully parsed file <https://builds.apache.org/job/Apache-falcon/ws/cli/target/checkstyle-result.xml>
with 0 unique warnings and 0 duplicates.
[CHECKSTYLE] Successfully parsed file <https://builds.apache.org/job/Apache-falcon/ws/client/target/checkstyle-result.xml>
with 0 unique warnings and 0 duplicates.
[CHECKSTYLE] Successfully parsed file <https://builds.apache.org/job/Apache-falcon/ws/common-types/target/checkstyle-result.xml>
with 0 unique warnings and 0 duplicates.
[CHECKSTYLE] Successfully parsed file <https://builds.apache.org/job/Apache-falcon/ws/common/target/checkstyle-result.xml>
with 0 unique warnings and 0 duplicates.
[CHECKSTYLE] Successfully parsed file <https://builds.apache.org/job/Apache-falcon/ws/distro/target/checkstyle-result.xml>
with 0 unique warnings and 0 duplicates.
[CHECKSTYLE] Successfully parsed file <https://builds.apache.org/job/Apache-falcon/ws/docs/target/checkstyle-result.xml>
with 0 unique warnings and 0 duplicates.
[CHECKSTYLE] Successfully parsed file <https://builds.apache.org/job/Apache-falcon/ws/examples/target/checkstyle-result.xml>
with 0 unique warnings and 0 duplicates.
[CHECKSTYLE] Successfully parsed file <https://builds.apache.org/job/Apache-falcon/ws/extensions/target/checkstyle-result.xml>
with 0 unique warnings and 0 duplicates.
[CHECKSTYLE] Successfully parsed file <https://builds.apache.org/job/Apache-falcon/ws/falcon-ui/target/checkstyle-result.xml>
with 0 unique warnings and 0 duplicates.
[CHECKSTYLE] Successfully parsed file <https://builds.apache.org/job/Apache-falcon/ws/hadoop-dependencies/target/checkstyle-result.xml>
with 0 unique warnings and 0 duplicates.
[CHECKSTYLE] Successfully parsed file <https://builds.apache.org/job/Apache-falcon/ws/lifecycle/target/checkstyle-result.xml>
with 0 unique warnings and 0 duplicates.
[CHECKSTYLE] Successfully parsed file <https://builds.apache.org/job/Apache-falcon/ws/messaging/target/checkstyle-result.xml>
with 0 unique warnings and 0 duplicates.
[CHECKSTYLE] Successfully parsed file <https://builds.apache.org/job/Apache-falcon/ws/metrics/target/checkstyle-result.xml>
with 0 unique warnings and 0 duplicates.
[CHECKSTYLE] Successfully parsed file <https://builds.apache.org/job/Apache-falcon/ws/oozie-el-extensions/target/checkstyle-result.xml>
with 0 unique warnings and 0 duplicates.
[CHECKSTYLE] Successfully parsed file <https://builds.apache.org/job/Apache-falcon/ws/oozie/target/checkstyle-result.xml>
with 0 unique warnings and 0 duplicates.
[CHECKSTYLE] Successfully parsed file <https://builds.apache.org/job/Apache-falcon/ws/replication/target/checkstyle-result.xml>
with 0 unique warnings and 0 duplicates.
[CHECKSTYLE] Successfully parsed file <https://builds.apache.org/job/Apache-falcon/ws/rerun/target/checkstyle-result.xml>
with 0 unique warnings and 0 duplicates.
[CHECKSTYLE] Successfully parsed file <https://builds.apache.org/job/Apache-falcon/ws/retention/target/checkstyle-result.xml>
with 0 unique warnings and 0 duplicates.
[CHECKSTYLE] Successfully parsed file <https://builds.apache.org/job/Apache-falcon/ws/scheduler/target/checkstyle-result.xml>
with 0 unique warnings and 0 duplicates.
[CHECKSTYLE] Successfully parsed file <https://builds.apache.org/job/Apache-falcon/ws/shell/target/checkstyle-result.xml>
with 0 unique warnings and 0 duplicates.
[CHECKSTYLE] Successfully parsed file <https://builds.apache.org/job/Apache-falcon/ws/target/checkstyle-result.xml>
with 0 unique warnings and 0 duplicates.
[CHECKSTYLE] Successfully parsed file <https://builds.apache.org/job/Apache-falcon/ws/test-tools/hadoop-webapp/target/checkstyle-result.xml>
with 0 unique warnings and 0 duplicates.
[CHECKSTYLE] Successfully parsed file <https://builds.apache.org/job/Apache-falcon/ws/test-tools/hcatalog-sharelib/target/checkstyle-result.xml>
with 0 unique warnings and 0 duplicates.
[CHECKSTYLE] Successfully parsed file <https://builds.apache.org/job/Apache-falcon/ws/test-tools/hive-sharelib/target/checkstyle-result.xml>
with 0 unique warnings and 0 duplicates.
[CHECKSTYLE] Successfully parsed file <https://builds.apache.org/job/Apache-falcon/ws/test-tools/oozie-sharelib/target/checkstyle-result.xml>
with 0 unique warnings and 0 duplicates.
[CHECKSTYLE] Successfully parsed file <https://builds.apache.org/job/Apache-falcon/ws/test-tools/pig-sharelib/target/checkstyle-result.xml>
with 0 unique warnings and 0 duplicates.
[CHECKSTYLE] Successfully parsed file <https://builds.apache.org/job/Apache-falcon/ws/test-tools/target/checkstyle-result.xml>
with 0 unique warnings and 0 duplicates.
[CHECKSTYLE] Successfully parsed file <https://builds.apache.org/job/Apache-falcon/ws/test-util/target/checkstyle-result.xml>
with 0 unique warnings and 0 duplicates.
[CHECKSTYLE] Successfully parsed file <https://builds.apache.org/job/Apache-falcon/ws/unit/target/checkstyle-result.xml>
with 0 unique warnings and 0 duplicates.
[CHECKSTYLE] Successfully parsed file <https://builds.apache.org/job/Apache-falcon/ws/webapp/target/checkstyle-result.xml>
with 0 unique warnings and 0 duplicates.
[CHECKSTYLE] Computing warning deltas based on reference build #1095
[FINDBUGS] Collecting findbugs analysis files...
[FINDBUGS] Finding all files that match the pattern **/target/findbugs.xml
[FINDBUGS] Parsing 21 files in <https://builds.apache.org/job/Apache-falcon/ws/>
[FINDBUGS] Successfully parsed file <https://builds.apache.org/job/Apache-falcon/ws/cli/target/findbugs.xml>
with 0 unique warnings and 0 duplicates.
[FINDBUGS] Successfully parsed file <https://builds.apache.org/job/Apache-falcon/ws/client/target/findbugs.xml>
with 0 unique warnings and 0 duplicates.
[FINDBUGS] Successfully parsed file <https://builds.apache.org/job/Apache-falcon/ws/common-types/target/findbugs.xml>
with 0 unique warnings and 0 duplicates.
[FINDBUGS] Successfully parsed file <https://builds.apache.org/job/Apache-falcon/ws/common/target/findbugs.xml>
with 0 unique warnings and 0 duplicates.
[FINDBUGS] Successfully parsed file <https://builds.apache.org/job/Apache-falcon/ws/examples/target/findbugs.xml>
with 0 unique warnings and 0 duplicates.
[FINDBUGS] Successfully parsed file <https://builds.apache.org/job/Apache-falcon/ws/extensions/target/findbugs.xml>
with 0 unique warnings and 0 duplicates.
[FINDBUGS] Successfully parsed file <https://builds.apache.org/job/Apache-falcon/ws/hadoop-dependencies/target/findbugs.xml>
with 0 unique warnings and 0 duplicates.
[FINDBUGS] Successfully parsed file <https://builds.apache.org/job/Apache-falcon/ws/lifecycle/target/findbugs.xml>
with 0 unique warnings and 0 duplicates.
[FINDBUGS] Successfully parsed file <https://builds.apache.org/job/Apache-falcon/ws/messaging/target/findbugs.xml>
with 0 unique warnings and 0 duplicates.
[FINDBUGS] Successfully parsed file <https://builds.apache.org/job/Apache-falcon/ws/metrics/target/findbugs.xml>
with 0 unique warnings and 0 duplicates.
[FINDBUGS] Successfully parsed file <https://builds.apache.org/job/Apache-falcon/ws/oozie-el-extensions/target/findbugs.xml>
with 0 unique warnings and 0 duplicates.
[FINDBUGS] Successfully parsed file <https://builds.apache.org/job/Apache-falcon/ws/oozie/target/findbugs.xml>
with 0 unique warnings and 0 duplicates.
[FINDBUGS] Successfully parsed file <https://builds.apache.org/job/Apache-falcon/ws/replication/target/findbugs.xml>
with 0 unique warnings and 0 duplicates.
[FINDBUGS] Successfully parsed file <https://builds.apache.org/job/Apache-falcon/ws/rerun/target/findbugs.xml>
with 0 unique warnings and 0 duplicates.
[FINDBUGS] Successfully parsed file <https://builds.apache.org/job/Apache-falcon/ws/retention/target/findbugs.xml>
with 0 unique warnings and 0 duplicates.
[FINDBUGS] Successfully parsed file <https://builds.apache.org/job/Apache-falcon/ws/scheduler/target/findbugs.xml>
with 0 unique warnings and 0 duplicates.
[FINDBUGS] Successfully parsed file <https://builds.apache.org/job/Apache-falcon/ws/shell/target/findbugs.xml>
with 0 unique warnings and 0 duplicates.
[FINDBUGS] Successfully parsed file <https://builds.apache.org/job/Apache-falcon/ws/test-tools/hadoop-webapp/target/findbugs.xml>
with 0 unique warnings and 0 duplicates.
[FINDBUGS] Successfully parsed file <https://builds.apache.org/job/Apache-falcon/ws/test-util/target/findbugs.xml>
with 0 unique warnings and 0 duplicates.
[FINDBUGS] Successfully parsed file <https://builds.apache.org/job/Apache-falcon/ws/unit/target/findbugs.xml>
with 0 unique warnings and 0 duplicates.
[FINDBUGS] Successfully parsed file <https://builds.apache.org/job/Apache-falcon/ws/webapp/target/findbugs.xml>
with 0 unique warnings and 0 duplicates.
[FINDBUGS] Computing warning deltas based on reference build #1095
Archiving artifacts
Compressed 17.29 MB of artifacts by 83.3% relative to #1095
Recording test results
TestNG Reports Processing: START
Looking for TestNG results report in workspace using pattern: **/target/testng-results.xml
Did not find any matching files.

Mime
View raw message