falcon-dev mailing list archives

Site index · List index
Message view « Date » · « Thread »
Top « Date » · « Thread »
From Apache Jenkins Server <jenk...@builds.apache.org>
Subject Build failed in Jenkins: Apache-falcon #1091
Date Tue, 22 Nov 2016 04:37:37 GMT
See <https://builds.apache.org/job/Apache-falcon/1091/changes>

Changes:

[pallavi.rao] FALCON-2188 Rest api to register extension

------------------------------------------
[...truncated 3366 lines...]
[INFO] Exclude: **/*.svg
[INFO] Exclude: *.md
[INFO] Exclude: **/*.md
[INFO] Exclude: .git/**
[INFO] Exclude: **/.idea/**
[INFO] Exclude: **/*.twiki
[INFO] Exclude: **/*.iml
[INFO] Exclude: **/target/**
[INFO] Exclude: **/activemq-data/**
[INFO] Exclude: **/build/**
[INFO] Exclude: **/*.patch
[INFO] Exclude: derby.log
[INFO] Exclude: **/logs/**
[INFO] Exclude: **/.classpath
[INFO] Exclude: **/.project
[INFO] Exclude: **/.settings/**
[INFO] Exclude: **/test-output/**
[INFO] Exclude: **/data.txt
[INFO] Exclude: **/maven-eclipse.xml
[INFO] Exclude: **/.externalToolBuilders/**
[INFO] Exclude: html5-ui/**
[INFO] Exclude: **/metastore_db/**
[INFO] Exclude: **/db1.log
[INFO] Exclude: **/db1.properties
[INFO] Exclude: **/db1.script
[INFO] Exclude: **/credential_provider.jceks
[INFO] Exclude: **/*.json
[INFO] Exclude: **/falcon-cli-hist.log
[INFO] 
[INFO] --- maven-checkstyle-plugin:2.9.1:check (checkstyle-check) @ falcon-messaging ---
[INFO] Starting audit...
Audit done.

[INFO] 
[INFO] >>> findbugs-maven-plugin:3.0.3:check (findbugs-check) > :findbugs @ falcon-messaging
>>>
[INFO] 
[INFO] --- findbugs-maven-plugin:3.0.3:findbugs (findbugs) @ falcon-messaging ---
[INFO] Fork Value is true
[INFO] Done FindBugs Analysis....
[INFO] 
[INFO] <<< findbugs-maven-plugin:3.0.3:check (findbugs-check) < :findbugs @ falcon-messaging
<<<
[INFO] 
[INFO] --- findbugs-maven-plugin:3.0.3:check (findbugs-check) @ falcon-messaging ---
[INFO] BugInstance size is 0
[INFO] Error size is 0
[INFO] No errors/warnings found
[INFO]                                                                         
[INFO] ------------------------------------------------------------------------
[INFO] Building Apache Falcon extensions 0.11-SNAPSHOT
[INFO] ------------------------------------------------------------------------
[INFO] 
[INFO] --- maven-clean-plugin:2.5:clean (default-clean) @ falcon-extensions ---
[INFO] Deleting <https://builds.apache.org/job/Apache-falcon/ws/extensions/target>
[INFO] 
[INFO] --- maven-enforcer-plugin:1.3.1:enforce (enforce-property) @ falcon-extensions ---
[INFO] 
[INFO] --- buildnumber-maven-plugin:1.0:create (default) @ falcon-extensions ---
[INFO] Checking for local modifications: skipped.
[INFO] Updating project files from SCM: skipped.
[INFO] Executing: /bin/sh -c cd <https://builds.apache.org/job/Apache-falcon/ws/extensions>
&& git show
[INFO] Working directory: <https://builds.apache.org/job/Apache-falcon/ws/extensions>
[INFO] Storing buildNumber: fd384a7a3b1da39dbae603c032bd3c23eaf0b134 at timestamp: 1479789261218
[INFO] Executing: /bin/sh -c cd <https://builds.apache.org/job/Apache-falcon/ws/extensions>
&& git show
[INFO] Working directory: <https://builds.apache.org/job/Apache-falcon/ws/extensions>
[INFO] Storing buildScmBranch: UNKNOWN
[INFO] 
[INFO] --- maven-remote-resources-plugin:1.5:process (default) @ falcon-extensions ---
[INFO] 
[INFO] --- maven-resources-plugin:2.7:resources (default-resources) @ falcon-extensions ---
[INFO] Using 'UTF-8' encoding to copy filtered resources.
[INFO] skip non existing resourceDirectory <https://builds.apache.org/job/Apache-falcon/ws/extensions/src/main/resources>
[INFO] skip non existing resourceDirectory <https://builds.apache.org/job/Apache-falcon/ws/extensions/src/main/resources>
[INFO] Copying 0 resource
[INFO] Copying 2 resources to META-INF
[INFO] Copying 3 resources
[INFO] 
[INFO] --- maven-compiler-plugin:2.3.2:compile (default-compile) @ falcon-extensions ---
[INFO] Compiling 15 source files to <https://builds.apache.org/job/Apache-falcon/ws/extensions/target/classes>
[INFO] 
[INFO] --- maven-resources-plugin:2.7:testResources (default-testResources) @ falcon-extensions
---
[INFO] Using 'UTF-8' encoding to copy filtered resources.
[INFO] Copying 7 resources
[INFO] Copying 3 resources
[INFO] 
[INFO] --- maven-compiler-plugin:2.3.2:testCompile (default-testCompile) @ falcon-extensions
---
[INFO] Compiling 5 source files to <https://builds.apache.org/job/Apache-falcon/ws/extensions/target/test-classes>
[INFO] 
[INFO] --- maven-surefire-plugin:2.16:test (default-test) @ falcon-extensions ---
[WARNING] The parameter forkMode is deprecated since version 2.14. Use forkCount and reuseForks
instead.
[INFO] Surefire report directory: <https://builds.apache.org/job/Apache-falcon/ws/extensions/target/surefire-reports>

-------------------------------------------------------
 T E S T S
-------------------------------------------------------

-------------------------------------------------------
 T E S T S
-------------------------------------------------------
Running org.apache.falcon.extensions.store.ExtensionStoreTest
Tests run: 3, Failures: 1, Errors: 0, Skipped: 0, Time elapsed: 5.745 sec <<< FAILURE!
- in org.apache.falcon.extensions.store.ExtensionStoreTest
testFailureCaseRegisterExtensionMetadata(org.apache.falcon.extensions.store.ExtensionStoreTest)
 Time elapsed: 0.073 sec  <<< FAILURE!
org.testng.TestException: 
Expected exception java.io.FileNotFoundException but got org.apache.falcon.entity.parser.ValidationException:
README file is not present in the jail://global:00/projects/falcon/extension
	at org.apache.falcon.extensions.store.ExtensionStore.registerExtensionMetadata(ExtensionStore.java:281)
	at org.apache.falcon.extensions.store.ExtensionStoreTest.testFailureCaseRegisterExtensionMetadata(ExtensionStoreTest.java:117)

Running org.apache.falcon.extensions.ExtensionServiceTest
Tests run: 2, Failures: 0, Errors: 0, Skipped: 0, Time elapsed: 4.102 sec - in org.apache.falcon.extensions.ExtensionServiceTest
Running org.apache.falcon.extensions.ExtensionTest
Tests run: 6, Failures: 0, Errors: 0, Skipped: 0, Time elapsed: 7.933 sec - in org.apache.falcon.extensions.ExtensionTest
Running org.apache.falcon.extensions.jdbc.ExtensionMetaStoreTest
Tests run: 1, Failures: 0, Errors: 0, Skipped: 0, Time elapsed: 4.243 sec - in org.apache.falcon.extensions.jdbc.ExtensionMetaStoreTest

Results :

Failed tests: 
  ExtensionStoreTest.testFailureCaseRegisterExtensionMetadata ยป Test 
Expected e...

Tests run: 12, Failures: 1, Errors: 0, Skipped: 0

[INFO] ------------------------------------------------------------------------
[INFO] Reactor Summary:
[INFO] 
[INFO] Apache Falcon ...................................... SUCCESS [ 13.938 s]
[INFO] Apache Falcon UI ................................... SUCCESS [ 14.908 s]
[INFO] Build Tools ........................................ SUCCESS [  4.542 s]
[INFO] Apache Falcon Java common types .................... SUCCESS [ 33.120 s]
[INFO] Apache Falcon Java client .......................... SUCCESS [ 20.998 s]
[INFO] Apache Falcon Shell ................................ SUCCESS [ 11.968 s]
[INFO] Apache Falcon Metrics .............................. SUCCESS [ 14.247 s]
[INFO] Apache Falcon Hadoop Dependencies .................. SUCCESS [ 12.937 s]
[INFO] Apache Falcon Test Utility ......................... SUCCESS [ 10.817 s]
[INFO] Apache Falcon Commons .............................. SUCCESS [02:35 min]
[INFO] Apache Falcon CLI client ........................... SUCCESS [ 15.856 s]
[INFO] Apache Falcon Titan 1.0 support .................... SUCCESS [  5.765 s]
[INFO] Apache Falcon Oozie EL Extension ................... SUCCESS [ 14.374 s]
[INFO] Apache Falcon Embedded Hadoop - Test Cluster ....... SUCCESS [ 30.099 s]
[INFO] Apache Falcon Sharelib Hive - Test Cluster ......... SUCCESS [  1.637 s]
[INFO] Apache Falcon Sharelib Pig - Test Cluster .......... SUCCESS [  0.657 s]
[INFO] Apache Falcon Sharelib Hcatalog - Test Cluster ..... SUCCESS [  1.003 s]
[INFO] Apache Falcon Sharelib Oozie - Test Cluster ........ SUCCESS [  0.508 s]
[INFO] Apache Falcon Test Tools - Test Cluster ............ SUCCESS [  0.443 s]
[INFO] Apache Falcon Messaging ............................ SUCCESS [ 31.900 s]
[INFO] Apache Falcon extensions ........................... FAILURE [ 27.242 s]
[INFO] Apache Falcon LIfecycle Module ..................... SKIPPED
[INFO] Apache Falcon Oozie Adaptor ........................ SKIPPED
[INFO] Apache Falcon Scheduler ............................ SKIPPED
[INFO] Apache Falcon Acquisition .......................... SKIPPED
[INFO] Apache Falcon Distcp Replication ................... SKIPPED
[INFO] Apache Falcon Retention ............................ SKIPPED
[INFO] Apache Falcon Archival ............................. SKIPPED
[INFO] Apache Falcon Rerun ................................ SKIPPED
[INFO] Apache Falcon Prism ................................ SKIPPED
[INFO] Apache Falcon Unit ................................. SKIPPED
[INFO] Apache Falcon Examples ............................. SKIPPED
[INFO] Apache Falcon Web Application ...................... SKIPPED
[INFO] Apache Falcon Documentation ........................ SKIPPED
[INFO] Apache Falcon Distro ............................... SKIPPED
[INFO] ------------------------------------------------------------------------
[INFO] BUILD FAILURE
[INFO] ------------------------------------------------------------------------
[INFO] Total time: 07:03 min
[INFO] Finished at: 2016-11-22T04:34:48+00:00
[INFO] Final Memory: 516M/1746M
[INFO] ------------------------------------------------------------------------
[WARNING] The requested profile "hadoop-2" could not be activated because it does not exist.
[ERROR] Failed to execute goal org.apache.maven.plugins:maven-surefire-plugin:2.16:test (default-test)
on project falcon-extensions: There are test failures.
[ERROR] 
[ERROR] Please refer to <https://builds.apache.org/job/Apache-falcon/ws/extensions/target/surefire-reports>
for the individual test results.
[ERROR] -> [Help 1]
[ERROR] 
[ERROR] To see the full stack trace of the errors, re-run Maven with the -e switch.
[ERROR] Re-run Maven using the -X switch to enable full debug logging.
[ERROR] 
[ERROR] For more information about the errors and possible solutions, please read the following
articles:
[ERROR] [Help 1] http://cwiki.apache.org/confluence/display/MAVEN/MojoFailureException
[ERROR] 
[ERROR] After correcting the problems, you can resume the build with the command
[ERROR]   mvn <goals> -rf :falcon-extensions
Build step 'Execute shell' marked build as failure
[CHECKSTYLE] Collecting checkstyle analysis files...
[CHECKSTYLE] Finding all files that match the pattern **/target/checkstyle-result.xml
[CHECKSTYLE] Parsing 33 files in <https://builds.apache.org/job/Apache-falcon/ws/>
[CHECKSTYLE] Successfully parsed file <https://builds.apache.org/job/Apache-falcon/ws/acquisition/target/checkstyle-result.xml>
with 0 unique warnings and 0 duplicates.
[CHECKSTYLE] Successfully parsed file <https://builds.apache.org/job/Apache-falcon/ws/archival/target/checkstyle-result.xml>
with 0 unique warnings and 0 duplicates.
[CHECKSTYLE] Successfully parsed file <https://builds.apache.org/job/Apache-falcon/ws/build-tools/target/checkstyle-result.xml>
with 0 unique warnings and 0 duplicates.
[CHECKSTYLE] Successfully parsed file <https://builds.apache.org/job/Apache-falcon/ws/cli/target/checkstyle-result.xml>
with 0 unique warnings and 0 duplicates.
[CHECKSTYLE] Successfully parsed file <https://builds.apache.org/job/Apache-falcon/ws/client/target/checkstyle-result.xml>
with 0 unique warnings and 0 duplicates.
[CHECKSTYLE] Successfully parsed file <https://builds.apache.org/job/Apache-falcon/ws/common-types/target/checkstyle-result.xml>
with 0 unique warnings and 0 duplicates.
[CHECKSTYLE] Successfully parsed file <https://builds.apache.org/job/Apache-falcon/ws/common/target/checkstyle-result.xml>
with 0 unique warnings and 0 duplicates.
[CHECKSTYLE] Successfully parsed file <https://builds.apache.org/job/Apache-falcon/ws/distro/target/checkstyle-result.xml>
with 0 unique warnings and 0 duplicates.
[CHECKSTYLE] Successfully parsed file <https://builds.apache.org/job/Apache-falcon/ws/docs/target/checkstyle-result.xml>
with 0 unique warnings and 0 duplicates.
[CHECKSTYLE] Successfully parsed file <https://builds.apache.org/job/Apache-falcon/ws/examples/target/checkstyle-result.xml>
with 0 unique warnings and 0 duplicates.
[CHECKSTYLE] Successfully parsed file <https://builds.apache.org/job/Apache-falcon/ws/falcon-ui/target/checkstyle-result.xml>
with 0 unique warnings and 0 duplicates.
[CHECKSTYLE] Successfully parsed file <https://builds.apache.org/job/Apache-falcon/ws/hadoop-dependencies/target/checkstyle-result.xml>
with 0 unique warnings and 0 duplicates.
[CHECKSTYLE] Successfully parsed file <https://builds.apache.org/job/Apache-falcon/ws/lifecycle/target/checkstyle-result.xml>
with 0 unique warnings and 0 duplicates.
[CHECKSTYLE] Successfully parsed file <https://builds.apache.org/job/Apache-falcon/ws/messaging/target/checkstyle-result.xml>
with 0 unique warnings and 0 duplicates.
[CHECKSTYLE] Successfully parsed file <https://builds.apache.org/job/Apache-falcon/ws/metrics/target/checkstyle-result.xml>
with 0 unique warnings and 0 duplicates.
[CHECKSTYLE] Successfully parsed file <https://builds.apache.org/job/Apache-falcon/ws/oozie-el-extensions/target/checkstyle-result.xml>
with 0 unique warnings and 0 duplicates.
[CHECKSTYLE] Successfully parsed file <https://builds.apache.org/job/Apache-falcon/ws/oozie/target/checkstyle-result.xml>
with 0 unique warnings and 0 duplicates.
[CHECKSTYLE] Successfully parsed file <https://builds.apache.org/job/Apache-falcon/ws/prism/target/checkstyle-result.xml>
with 0 unique warnings and 0 duplicates.
[CHECKSTYLE] Successfully parsed file <https://builds.apache.org/job/Apache-falcon/ws/replication/target/checkstyle-result.xml>
with 0 unique warnings and 0 duplicates.
[CHECKSTYLE] Successfully parsed file <https://builds.apache.org/job/Apache-falcon/ws/rerun/target/checkstyle-result.xml>
with 0 unique warnings and 0 duplicates.
[CHECKSTYLE] Successfully parsed file <https://builds.apache.org/job/Apache-falcon/ws/retention/target/checkstyle-result.xml>
with 0 unique warnings and 0 duplicates.
[CHECKSTYLE] Successfully parsed file <https://builds.apache.org/job/Apache-falcon/ws/scheduler/target/checkstyle-result.xml>
with 0 unique warnings and 0 duplicates.
[CHECKSTYLE] Successfully parsed file <https://builds.apache.org/job/Apache-falcon/ws/shell/target/checkstyle-result.xml>
with 0 unique warnings and 0 duplicates.
[CHECKSTYLE] Successfully parsed file <https://builds.apache.org/job/Apache-falcon/ws/target/checkstyle-result.xml>
with 0 unique warnings and 0 duplicates.
[CHECKSTYLE] Successfully parsed file <https://builds.apache.org/job/Apache-falcon/ws/test-tools/hadoop-webapp/target/checkstyle-result.xml>
with 0 unique warnings and 0 duplicates.
[CHECKSTYLE] Successfully parsed file <https://builds.apache.org/job/Apache-falcon/ws/test-tools/hcatalog-sharelib/target/checkstyle-result.xml>
with 0 unique warnings and 0 duplicates.
[CHECKSTYLE] Successfully parsed file <https://builds.apache.org/job/Apache-falcon/ws/test-tools/hive-sharelib/target/checkstyle-result.xml>
with 0 unique warnings and 0 duplicates.
[CHECKSTYLE] Successfully parsed file <https://builds.apache.org/job/Apache-falcon/ws/test-tools/oozie-sharelib/target/checkstyle-result.xml>
with 0 unique warnings and 0 duplicates.
[CHECKSTYLE] Successfully parsed file <https://builds.apache.org/job/Apache-falcon/ws/test-tools/pig-sharelib/target/checkstyle-result.xml>
with 0 unique warnings and 0 duplicates.
[CHECKSTYLE] Successfully parsed file <https://builds.apache.org/job/Apache-falcon/ws/test-tools/target/checkstyle-result.xml>
with 0 unique warnings and 0 duplicates.
[CHECKSTYLE] Successfully parsed file <https://builds.apache.org/job/Apache-falcon/ws/test-util/target/checkstyle-result.xml>
with 0 unique warnings and 0 duplicates.
[CHECKSTYLE] Successfully parsed file <https://builds.apache.org/job/Apache-falcon/ws/unit/target/checkstyle-result.xml>
with 0 unique warnings and 0 duplicates.
[CHECKSTYLE] Successfully parsed file <https://builds.apache.org/job/Apache-falcon/ws/webapp/target/checkstyle-result.xml>
with 0 unique warnings and 0 duplicates.
[CHECKSTYLE] Computing warning deltas based on reference build #1090
[FINDBUGS] Collecting findbugs analysis files...
[FINDBUGS] Finding all files that match the pattern **/target/findbugs.xml
[FINDBUGS] Parsing 21 files in <https://builds.apache.org/job/Apache-falcon/ws/>
[FINDBUGS] Successfully parsed file <https://builds.apache.org/job/Apache-falcon/ws/cli/target/findbugs.xml>
with 0 unique warnings and 0 duplicates.
[FINDBUGS] Successfully parsed file <https://builds.apache.org/job/Apache-falcon/ws/client/target/findbugs.xml>
with 0 unique warnings and 0 duplicates.
[FINDBUGS] Successfully parsed file <https://builds.apache.org/job/Apache-falcon/ws/common-types/target/findbugs.xml>
with 0 unique warnings and 0 duplicates.
[FINDBUGS] Successfully parsed file <https://builds.apache.org/job/Apache-falcon/ws/common/target/findbugs.xml>
with 0 unique warnings and 0 duplicates.
[FINDBUGS] Successfully parsed file <https://builds.apache.org/job/Apache-falcon/ws/examples/target/findbugs.xml>
with 0 unique warnings and 0 duplicates.
[FINDBUGS] Successfully parsed file <https://builds.apache.org/job/Apache-falcon/ws/hadoop-dependencies/target/findbugs.xml>
with 0 unique warnings and 0 duplicates.
[FINDBUGS] Successfully parsed file <https://builds.apache.org/job/Apache-falcon/ws/lifecycle/target/findbugs.xml>
with 0 unique warnings and 0 duplicates.
[FINDBUGS] Successfully parsed file <https://builds.apache.org/job/Apache-falcon/ws/messaging/target/findbugs.xml>
with 0 unique warnings and 0 duplicates.
[FINDBUGS] Successfully parsed file <https://builds.apache.org/job/Apache-falcon/ws/metrics/target/findbugs.xml>
with 0 unique warnings and 0 duplicates.
[FINDBUGS] Successfully parsed file <https://builds.apache.org/job/Apache-falcon/ws/oozie-el-extensions/target/findbugs.xml>
with 0 unique warnings and 0 duplicates.
[FINDBUGS] Successfully parsed file <https://builds.apache.org/job/Apache-falcon/ws/oozie/target/findbugs.xml>
with 0 unique warnings and 0 duplicates.
[FINDBUGS] Successfully parsed file <https://builds.apache.org/job/Apache-falcon/ws/prism/target/findbugs.xml>
with 0 unique warnings and 0 duplicates.
[FINDBUGS] Successfully parsed file <https://builds.apache.org/job/Apache-falcon/ws/replication/target/findbugs.xml>
with 0 unique warnings and 0 duplicates.
[FINDBUGS] Successfully parsed file <https://builds.apache.org/job/Apache-falcon/ws/rerun/target/findbugs.xml>
with 0 unique warnings and 0 duplicates.
[FINDBUGS] Successfully parsed file <https://builds.apache.org/job/Apache-falcon/ws/retention/target/findbugs.xml>
with 0 unique warnings and 0 duplicates.
[FINDBUGS] Successfully parsed file <https://builds.apache.org/job/Apache-falcon/ws/scheduler/target/findbugs.xml>
with 0 unique warnings and 0 duplicates.
[FINDBUGS] Successfully parsed file <https://builds.apache.org/job/Apache-falcon/ws/shell/target/findbugs.xml>
with 0 unique warnings and 0 duplicates.
[FINDBUGS] Successfully parsed file <https://builds.apache.org/job/Apache-falcon/ws/test-tools/hadoop-webapp/target/findbugs.xml>
with 0 unique warnings and 0 duplicates.
[FINDBUGS] Successfully parsed file <https://builds.apache.org/job/Apache-falcon/ws/test-util/target/findbugs.xml>
with 0 unique warnings and 0 duplicates.
[FINDBUGS] Successfully parsed file <https://builds.apache.org/job/Apache-falcon/ws/unit/target/findbugs.xml>
with 0 unique warnings and 0 duplicates.
[FINDBUGS] Successfully parsed file <https://builds.apache.org/job/Apache-falcon/ws/webapp/target/findbugs.xml>
with 0 unique warnings and 0 duplicates.
[FINDBUGS] Computing warning deltas based on reference build #1090
Archiving artifacts
Compressed 17.62 MB of artifacts by 83.7% relative to #1090
Recording test results
TestNG Reports Processing: START
Looking for TestNG results report in workspace using pattern: **/target/testng-results.xml
Did not find any matching files.

Mime
View raw message