falcon-dev mailing list archives

Site index · List index
Message view « Date » · « Thread »
Top « Date » · « Thread »
From Apache Jenkins Server <jenk...@builds.apache.org>
Subject Build failed in Jenkins: Apache-falcon #1067
Date Thu, 18 Aug 2016 01:03:23 GMT
See <https://builds.apache.org/job/Apache-falcon/1067/changes>

Changes:

[bvellanki] FALCON-1776 Process instance update in titan DB based on JMS

------------------------------------------
[...truncated 5928 lines...]
Running org.apache.falcon.resource.MetadataResourceJerseyIT
Tests run: 2, Failures: 0, Errors: 0, Skipped: 0, Time elapsed: 4.608 sec - in org.apache.falcon.resource.MetadataResourceJerseyIT
Running org.apache.falcon.resource.AbstractSchedulerManagerJerseyIT
Tests run: 0, Failures: 0, Errors: 0, Skipped: 0, Time elapsed: 0.7 sec - in org.apache.falcon.resource.AbstractSchedulerManagerJerseyIT
Running org.apache.falcon.lifecycle.TableStorageFeedEvictorIT
Tests run: 20, Failures: 0, Errors: 0, Skipped: 0, Time elapsed: 31.644 sec - in org.apache.falcon.lifecycle.TableStorageFeedEvictorIT
Running org.apache.falcon.lifecycle.FileSystemFeedReplicationIT
Tests run: 0, Failures: 0, Errors: 0, Skipped: 0, Time elapsed: 4.028 sec - in org.apache.falcon.lifecycle.FileSystemFeedReplicationIT
Running org.apache.falcon.lifecycle.FeedImportIT
Tests run: 0, Failures: 0, Errors: 0, Skipped: 0, Time elapsed: 0.713 sec - in org.apache.falcon.lifecycle.FeedImportIT
Running org.apache.falcon.lifecycle.DatasourceUpdateIT
Tests run: 1, Failures: 0, Errors: 0, Skipped: 0, Time elapsed: 2.797 sec - in org.apache.falcon.lifecycle.DatasourceUpdateIT
Running org.apache.falcon.lifecycle.TableStorageFeedReplicationIT
Tests run: 0, Failures: 0, Errors: 0, Skipped: 0, Time elapsed: 3.339 sec - in org.apache.falcon.lifecycle.TableStorageFeedReplicationIT
Running org.apache.falcon.lifecycle.FeedExportIT
Tests run: 0, Failures: 0, Errors: 0, Skipped: 0, Time elapsed: 0.56 sec - in org.apache.falcon.lifecycle.FeedExportIT
Running org.apache.falcon.process.TableStorageProcessIT
Tests run: 0, Failures: 0, Errors: 0, Skipped: 0, Time elapsed: 2.662 sec - in org.apache.falcon.process.TableStorageProcessIT
Running org.apache.falcon.process.PigProcessIT
Tests run: 0, Failures: 0, Errors: 0, Skipped: 0, Time elapsed: 2.559 sec - in org.apache.falcon.process.PigProcessIT
Running org.apache.falcon.late.LateDataHandlerIT
Tests run: 2, Failures: 0, Errors: 0, Skipped: 0, Time elapsed: 7.271 sec - in org.apache.falcon.late.LateDataHandlerIT
Running org.apache.falcon.cli.FalconClusterUpdateCLIIT
Tests run: 1, Failures: 0, Errors: 0, Skipped: 0, Time elapsed: 6.911 sec - in org.apache.falcon.cli.FalconClusterUpdateCLIIT
Running org.apache.falcon.cli.FalconCLISmokeIT
Tests run: 1, Failures: 1, Errors: 0, Skipped: 0, Time elapsed: 55.885 sec <<< FAILURE!
- in org.apache.falcon.cli.FalconCLISmokeIT
testSubmitAndScheduleEntityValidCommands(org.apache.falcon.cli.FalconCLISmokeIT)  Time elapsed:
53.324 sec  <<< FAILURE!
java.lang.Exception: Workflow for p1471481590728 hasn't started in oozie
	at org.apache.falcon.util.OozieTestUtils.waitForWorkflowStart(OozieTestUtils.java:135)
	at org.apache.falcon.util.OozieTestUtils.waitForProcessWFtoStart(OozieTestUtils.java:106)
	at org.apache.falcon.cli.FalconCLISmokeIT.testSubmitAndScheduleEntityValidCommands(FalconCLISmokeIT.java:86)

Running org.apache.falcon.cli.FalconCLIIT
Tests run: 27, Failures: 9, Errors: 0, Skipped: 0, Time elapsed: 492.868 sec <<<
FAILURE! - in org.apache.falcon.cli.FalconCLIIT
testContinue(org.apache.falcon.cli.FalconCLIIT)  Time elapsed: 49.617 sec  <<< FAILURE!
java.lang.Exception: Workflow for p1471481651428 hasn't started in oozie
	at org.apache.falcon.util.OozieTestUtils.waitForWorkflowStart(OozieTestUtils.java:135)
	at org.apache.falcon.util.OozieTestUtils.waitForProcessWFtoStart(OozieTestUtils.java:106)
	at org.apache.falcon.cli.FalconCLIIT.testContinue(FalconCLIIT.java:807)

testEntityPaginationFilterByCommands(org.apache.falcon.cli.FalconCLIIT)  Time elapsed: 51.351
sec  <<< FAILURE!
java.lang.Exception: Workflow for p1471481707672 hasn't started in oozie
	at org.apache.falcon.util.OozieTestUtils.waitForWorkflowStart(OozieTestUtils.java:135)
	at org.apache.falcon.util.OozieTestUtils.waitForProcessWFtoStart(OozieTestUtils.java:106)
	at org.apache.falcon.cli.FalconCLIIT.testEntityPaginationFilterByCommands(FalconCLIIT.java:668)

testInstanceKillAndRerun(org.apache.falcon.cli.FalconCLIIT)  Time elapsed: 50.204 sec  <<<
FAILURE!
java.lang.Exception: Workflow for p1471481766533 hasn't started in oozie
	at org.apache.falcon.util.OozieTestUtils.waitForWorkflowStart(OozieTestUtils.java:135)
	at org.apache.falcon.util.OozieTestUtils.waitForProcessWFtoStart(OozieTestUtils.java:106)
	at org.apache.falcon.cli.FalconCLIIT.testInstanceKillAndRerun(FalconCLIIT.java:580)

testInstanceRunningAndSearchSummaryCommands(org.apache.falcon.cli.FalconCLIIT)  Time elapsed:
49.031 sec  <<< FAILURE!
java.lang.Exception: Workflow for p1471481816723 hasn't started in oozie
	at org.apache.falcon.util.OozieTestUtils.waitForWorkflowStart(OozieTestUtils.java:135)
	at org.apache.falcon.util.OozieTestUtils.waitForProcessWFtoStart(OozieTestUtils.java:106)
	at org.apache.falcon.cli.FalconCLIIT.testInstanceRunningAndSearchSummaryCommands(FalconCLIIT.java:493)

testInstanceRunningAndStatusCommands(org.apache.falcon.cli.FalconCLIIT)  Time elapsed: 49.225
sec  <<< FAILURE!
java.lang.Exception: Workflow for p1471481865789 hasn't started in oozie
	at org.apache.falcon.util.OozieTestUtils.waitForWorkflowStart(OozieTestUtils.java:135)
	at org.apache.falcon.util.OozieTestUtils.waitForProcessWFtoStart(OozieTestUtils.java:106)
	at org.apache.falcon.cli.FalconCLIIT.testInstanceRunningAndStatusCommands(FalconCLIIT.java:347)

testMetadataListCommands(org.apache.falcon.cli.FalconCLIIT)  Time elapsed: 48.954 sec  <<<
FAILURE!
java.lang.Exception: Workflow for p1471481921476 hasn't started in oozie
	at org.apache.falcon.util.OozieTestUtils.waitForWorkflowStart(OozieTestUtils.java:135)
	at org.apache.falcon.util.OozieTestUtils.waitForProcessWFtoStart(OozieTestUtils.java:106)
	at org.apache.falcon.cli.FalconCLIIT.testMetadataListCommands(FalconCLIIT.java:729)

testMetadataRelationsCommands(org.apache.falcon.cli.FalconCLIIT)  Time elapsed: 49.106 sec
 <<< FAILURE!
java.lang.Exception: Workflow for p1471481970422 hasn't started in oozie
	at org.apache.falcon.util.OozieTestUtils.waitForWorkflowStart(OozieTestUtils.java:135)
	at org.apache.falcon.util.OozieTestUtils.waitForProcessWFtoStart(OozieTestUtils.java:106)
	at org.apache.falcon.cli.FalconCLIIT.testMetadataRelationsCommands(FalconCLIIT.java:772)

testSubmitAndScheduleEntityValidCommands(org.apache.falcon.cli.FalconCLIIT)  Time elapsed:
49.953 sec  <<< FAILURE!
java.lang.Exception: Workflow for p1471482029925 hasn't started in oozie
	at org.apache.falcon.util.OozieTestUtils.waitForWorkflowStart(OozieTestUtils.java:135)
	at org.apache.falcon.util.OozieTestUtils.waitForProcessWFtoStart(OozieTestUtils.java:106)
	at org.apache.falcon.cli.FalconCLIIT.testSubmitAndScheduleEntityValidCommands(FalconCLIIT.java:129)

testSuspendResumeStatusEntityValidCommands(org.apache.falcon.cli.FalconCLIIT)  Time elapsed:
50.278 sec  <<< FAILURE!
java.lang.Exception: Workflow for p1471482081493 hasn't started in oozie
	at org.apache.falcon.util.OozieTestUtils.waitForWorkflowStart(OozieTestUtils.java:135)
	at org.apache.falcon.util.OozieTestUtils.waitForProcessWFtoStart(OozieTestUtils.java:106)
	at org.apache.falcon.cli.FalconCLIIT.testSuspendResumeStatusEntityValidCommands(FalconCLIIT.java:246)

Running org.apache.falcon.cli.FalconSafemodeCLIIT
Tests run: 2, Failures: 0, Errors: 0, Skipped: 0, Time elapsed: 9.053 sec - in org.apache.falcon.cli.FalconSafemodeCLIIT
Running org.apache.falcon.catalog.CatalogPartitionHandlerIT
Tests run: 0, Failures: 0, Errors: 0, Skipped: 0, Time elapsed: 0.339 sec - in org.apache.falcon.catalog.CatalogPartitionHandlerIT
Running org.apache.falcon.catalog.CatalogStorageIT
Tests run: 2, Failures: 0, Errors: 0, Skipped: 0, Time elapsed: 3.801 sec - in org.apache.falcon.catalog.CatalogStorageIT
Running org.apache.falcon.catalog.HiveCatalogServiceIT
Tests run: 25, Failures: 0, Errors: 0, Skipped: 0, Time elapsed: 16.768 sec - in org.apache.falcon.catalog.HiveCatalogServiceIT

Results :

Failed tests: 
  EntityManagerPaginationJerseyIT.prepare:43->scheduleMultipleProcess:164 »  Wor...
  EntityManagerJerseyIT.testScheduleSuspendResume:648 » FalconWeb
  EntityManagerJerseyIT.testUpdateSuspendedEntity:258 » FalconWeb
  FalconCLISmokeIT.testSubmitAndScheduleEntityValidCommands:86 »  Workflow for p...
  FalconCLIIT.testContinue:807 »  Workflow for p1471481651428 hasn't started in ...
  FalconCLIIT.testEntityPaginationFilterByCommands:668 »  Workflow for p14714817...
  FalconCLIIT.testInstanceKillAndRerun:580 »  Workflow for p1471481766533 hasn't...
  FalconCLIIT.testInstanceRunningAndSearchSummaryCommands:493 »  Workflow for p1...
  FalconCLIIT.testInstanceRunningAndStatusCommands:347 »  Workflow for p14714818...
  FalconCLIIT.testMetadataListCommands:729 »  Workflow for p1471481921476 hasn't...
  FalconCLIIT.testMetadataRelationsCommands:772 »  Workflow for p1471481970422 h...
  FalconCLIIT.testSubmitAndScheduleEntityValidCommands:129 »  Workflow for p1471...
  FalconCLIIT.testSuspendResumeStatusEntityValidCommands:246 »  Workflow for p14...

Tests run: 153, Failures: 13, Errors: 0, Skipped: 11

[INFO] 
[INFO] --- maven-jetty-plugin:6.1.26:stop (stop-jetty) @ falcon-webapp ---
[INFO] 
[INFO] --- maven-failsafe-plugin:2.16:verify (verify) @ falcon-webapp ---
[INFO] Stopping server 0
[INFO] Stopped SelectChannelConnector@0.0.0.0:41000
[INFO] Failsafe report directory: <https://builds.apache.org/job/Apache-falcon/ws/webapp/target/failsafe-reports>
[INFO] Stopped SslSocketConnector@0.0.0.0:41443
[INFO] ------------------------------------------------------------------------
[INFO] Reactor Summary:
[INFO] 
[INFO] Apache Falcon ...................................... SUCCESS [ 11.340 s]
[INFO] Apache Falcon UI ................................... SUCCESS [ 11.852 s]
[INFO] Build Tools ........................................ SUCCESS [  4.774 s]
[INFO] Apache Falcon Java client .......................... SUCCESS [ 35.788 s]
[INFO] Apache Falcon Shell ................................ SUCCESS [ 13.988 s]
[INFO] Apache Falcon Metrics .............................. SUCCESS [ 16.521 s]
[INFO] Apache Falcon Hadoop Dependencies .................. SUCCESS [ 13.348 s]
[INFO] Apache Falcon Test Utility ......................... SUCCESS [ 11.792 s]
[INFO] Apache Falcon Commons .............................. SUCCESS [02:54 min]
[INFO] Apache Falcon CLI client ........................... SUCCESS [ 18.260 s]
[INFO] Apache Falcon Titan 1.0 support .................... SUCCESS [  6.742 s]
[INFO] Apache Falcon Oozie EL Extension ................... SUCCESS [ 17.003 s]
[INFO] Apache Falcon Embedded Hadoop - Test Cluster ....... SUCCESS [ 35.451 s]
[INFO] Apache Falcon Sharelib Hive - Test Cluster ......... SUCCESS [  3.063 s]
[INFO] Apache Falcon Sharelib Pig - Test Cluster .......... SUCCESS [  2.169 s]
[INFO] Apache Falcon Sharelib Hcatalog - Test Cluster ..... SUCCESS [  1.046 s]
[INFO] Apache Falcon Sharelib Oozie - Test Cluster ........ SUCCESS [  0.524 s]
[INFO] Apache Falcon Test Tools - Test Cluster ............ SUCCESS [  0.522 s]
[INFO] Apache Falcon Messaging ............................ SUCCESS [ 32.507 s]
[INFO] Apache Falcon extensions ........................... SUCCESS [ 25.253 s]
[INFO] Apache Falcon LIfecycle Module ..................... SUCCESS [ 21.222 s]
[INFO] Apache Falcon Oozie Adaptor ........................ SUCCESS [01:21 min]
[INFO] Apache Falcon Scheduler ............................ SUCCESS [01:27 min]
[INFO] Apache Falcon Acquisition .......................... SUCCESS [  0.941 s]
[INFO] Apache Falcon Distcp Replication ................... SUCCESS [ 18.618 s]
[INFO] Apache Falcon Retention ............................ SUCCESS [ 16.054 s]
[INFO] Apache Falcon Archival ............................. SUCCESS [  0.994 s]
[INFO] Apache Falcon Rerun ................................ SUCCESS [ 26.784 s]
[INFO] Apache Falcon Prism ................................ SUCCESS [03:28 min]
[INFO] Apache Falcon Unit ................................. SUCCESS [02:55 min]
[INFO] Apache Falcon Examples ............................. SUCCESS [ 10.717 s]
[INFO] Apache Falcon Web Application ...................... FAILURE [22:30 min]
[INFO] Apache Falcon Documentation ........................ SKIPPED
[INFO] Apache Falcon Distro ............................... SKIPPED
[INFO] ------------------------------------------------------------------------
[INFO] BUILD FAILURE
[INFO] ------------------------------------------------------------------------
[INFO] Total time: 40:36 min
[INFO] Finished at: 2016-08-18T01:02:47+00:00
[INFO] Final Memory: 1203M/2744M
[INFO] ------------------------------------------------------------------------
[WARNING] The requested profile "hadoop-2" could not be activated because it does not exist.
[ERROR] Failed to execute goal org.apache.maven.plugins:maven-failsafe-plugin:2.16:verify
(verify) on project falcon-webapp: There are test failures.
[ERROR] 
[ERROR] Please refer to <https://builds.apache.org/job/Apache-falcon/ws/webapp/target/failsafe-reports>
for the individual test results.
[ERROR] -> [Help 1]
[ERROR] 
[ERROR] To see the full stack trace of the errors, re-run Maven with the -e switch.
[ERROR] Re-run Maven using the -X switch to enable full debug logging.
[ERROR] 
[ERROR] For more information about the errors and possible solutions, please read the following
articles:
[ERROR] [Help 1] http://cwiki.apache.org/confluence/display/MAVEN/MojoFailureException
[ERROR] 
[ERROR] After correcting the problems, you can resume the build with the command
[ERROR]   mvn <goals> -rf :falcon-webapp
[INFO] Shutdown hook executing
Shutting down hive metastore.
[INFO] Shutdown hook complete
Build step 'Execute shell' marked build as failure
[CHECKSTYLE] Collecting checkstyle analysis files...
[CHECKSTYLE] Finding all files that match the pattern **/target/checkstyle-result.xml
[CHECKSTYLE] Parsing 30 files in <https://builds.apache.org/job/Apache-falcon/ws/>
[CHECKSTYLE] Successfully parsed file <https://builds.apache.org/job/Apache-falcon/ws/acquisition/target/checkstyle-result.xml>
with 0 unique warnings and 0 duplicates.
[CHECKSTYLE] Successfully parsed file <https://builds.apache.org/job/Apache-falcon/ws/archival/target/checkstyle-result.xml>
with 0 unique warnings and 0 duplicates.
[CHECKSTYLE] Successfully parsed file <https://builds.apache.org/job/Apache-falcon/ws/build-tools/target/checkstyle-result.xml>
with 0 unique warnings and 0 duplicates.
[CHECKSTYLE] Successfully parsed file <https://builds.apache.org/job/Apache-falcon/ws/cli/target/checkstyle-result.xml>
with 0 unique warnings and 0 duplicates.
[CHECKSTYLE] Successfully parsed file <https://builds.apache.org/job/Apache-falcon/ws/client/target/checkstyle-result.xml>
with 0 unique warnings and 0 duplicates.
[CHECKSTYLE] Successfully parsed file <https://builds.apache.org/job/Apache-falcon/ws/common/target/checkstyle-result.xml>
with 0 unique warnings and 0 duplicates.
[CHECKSTYLE] Successfully parsed file <https://builds.apache.org/job/Apache-falcon/ws/examples/target/checkstyle-result.xml>
with 0 unique warnings and 0 duplicates.
[CHECKSTYLE] Successfully parsed file <https://builds.apache.org/job/Apache-falcon/ws/extensions/target/checkstyle-result.xml>
with 0 unique warnings and 0 duplicates.
[CHECKSTYLE] Successfully parsed file <https://builds.apache.org/job/Apache-falcon/ws/falcon-ui/target/checkstyle-result.xml>
with 0 unique warnings and 0 duplicates.
[CHECKSTYLE] Successfully parsed file <https://builds.apache.org/job/Apache-falcon/ws/hadoop-dependencies/target/checkstyle-result.xml>
with 0 unique warnings and 0 duplicates.
[CHECKSTYLE] Successfully parsed file <https://builds.apache.org/job/Apache-falcon/ws/lifecycle/target/checkstyle-result.xml>
with 0 unique warnings and 0 duplicates.
[CHECKSTYLE] Successfully parsed file <https://builds.apache.org/job/Apache-falcon/ws/messaging/target/checkstyle-result.xml>
with 0 unique warnings and 0 duplicates.
[CHECKSTYLE] Successfully parsed file <https://builds.apache.org/job/Apache-falcon/ws/metrics/target/checkstyle-result.xml>
with 0 unique warnings and 0 duplicates.
[CHECKSTYLE] Successfully parsed file <https://builds.apache.org/job/Apache-falcon/ws/oozie-el-extensions/target/checkstyle-result.xml>
with 0 unique warnings and 0 duplicates.
[CHECKSTYLE] Successfully parsed file <https://builds.apache.org/job/Apache-falcon/ws/oozie/target/checkstyle-result.xml>
with 0 unique warnings and 0 duplicates.
[CHECKSTYLE] Successfully parsed file <https://builds.apache.org/job/Apache-falcon/ws/prism/target/checkstyle-result.xml>
with 0 unique warnings and 0 duplicates.
[CHECKSTYLE] Successfully parsed file <https://builds.apache.org/job/Apache-falcon/ws/replication/target/checkstyle-result.xml>
with 0 unique warnings and 0 duplicates.
[CHECKSTYLE] Successfully parsed file <https://builds.apache.org/job/Apache-falcon/ws/rerun/target/checkstyle-result.xml>
with 0 unique warnings and 0 duplicates.
[CHECKSTYLE] Successfully parsed file <https://builds.apache.org/job/Apache-falcon/ws/retention/target/checkstyle-result.xml>
with 0 unique warnings and 0 duplicates.
[CHECKSTYLE] Successfully parsed file <https://builds.apache.org/job/Apache-falcon/ws/scheduler/target/checkstyle-result.xml>
with 0 unique warnings and 0 duplicates.
[CHECKSTYLE] Successfully parsed file <https://builds.apache.org/job/Apache-falcon/ws/shell/target/checkstyle-result.xml>
with 0 unique warnings and 0 duplicates.
[CHECKSTYLE] Successfully parsed file <https://builds.apache.org/job/Apache-falcon/ws/target/checkstyle-result.xml>
with 0 unique warnings and 0 duplicates.
[CHECKSTYLE] Successfully parsed file <https://builds.apache.org/job/Apache-falcon/ws/test-tools/hadoop-webapp/target/checkstyle-result.xml>
with 0 unique warnings and 0 duplicates.
[CHECKSTYLE] Successfully parsed file <https://builds.apache.org/job/Apache-falcon/ws/test-tools/hcatalog-sharelib/target/checkstyle-result.xml>
with 0 unique warnings and 0 duplicates.
[CHECKSTYLE] Successfully parsed file <https://builds.apache.org/job/Apache-falcon/ws/test-tools/hive-sharelib/target/checkstyle-result.xml>
with 0 unique warnings and 0 duplicates.
[CHECKSTYLE] Successfully parsed file <https://builds.apache.org/job/Apache-falcon/ws/test-tools/oozie-sharelib/target/checkstyle-result.xml>
with 0 unique warnings and 0 duplicates.
[CHECKSTYLE] Successfully parsed file <https://builds.apache.org/job/Apache-falcon/ws/test-tools/pig-sharelib/target/checkstyle-result.xml>
with 0 unique warnings and 0 duplicates.
[CHECKSTYLE] Successfully parsed file <https://builds.apache.org/job/Apache-falcon/ws/test-tools/target/checkstyle-result.xml>
with 0 unique warnings and 0 duplicates.
[CHECKSTYLE] Successfully parsed file <https://builds.apache.org/job/Apache-falcon/ws/test-util/target/checkstyle-result.xml>
with 0 unique warnings and 0 duplicates.
[CHECKSTYLE] Successfully parsed file <https://builds.apache.org/job/Apache-falcon/ws/unit/target/checkstyle-result.xml>
with 0 unique warnings and 0 duplicates.
[CHECKSTYLE] Computing warning deltas based on reference build #1051
[FINDBUGS] Collecting findbugs analysis files...
[FINDBUGS] Finding all files that match the pattern **/target/findbugs.xml
[FINDBUGS] Parsing 20 files in <https://builds.apache.org/job/Apache-falcon/ws/>
[FINDBUGS] Successfully parsed file <https://builds.apache.org/job/Apache-falcon/ws/cli/target/findbugs.xml>
with 0 unique warnings and 0 duplicates.
[FINDBUGS] Successfully parsed file <https://builds.apache.org/job/Apache-falcon/ws/client/target/findbugs.xml>
with 0 unique warnings and 0 duplicates.
[FINDBUGS] Successfully parsed file <https://builds.apache.org/job/Apache-falcon/ws/common/target/findbugs.xml>
with 0 unique warnings and 0 duplicates.
[FINDBUGS] Successfully parsed file <https://builds.apache.org/job/Apache-falcon/ws/examples/target/findbugs.xml>
with 0 unique warnings and 0 duplicates.
[FINDBUGS] Successfully parsed file <https://builds.apache.org/job/Apache-falcon/ws/extensions/target/findbugs.xml>
with 0 unique warnings and 0 duplicates.
[FINDBUGS] Successfully parsed file <https://builds.apache.org/job/Apache-falcon/ws/hadoop-dependencies/target/findbugs.xml>
with 0 unique warnings and 0 duplicates.
[FINDBUGS] Successfully parsed file <https://builds.apache.org/job/Apache-falcon/ws/lifecycle/target/findbugs.xml>
with 0 unique warnings and 0 duplicates.
[FINDBUGS] Successfully parsed file <https://builds.apache.org/job/Apache-falcon/ws/messaging/target/findbugs.xml>
with 0 unique warnings and 0 duplicates.
[FINDBUGS] Successfully parsed file <https://builds.apache.org/job/Apache-falcon/ws/metrics/target/findbugs.xml>
with 0 unique warnings and 0 duplicates.
[FINDBUGS] Successfully parsed file <https://builds.apache.org/job/Apache-falcon/ws/oozie-el-extensions/target/findbugs.xml>
with 0 unique warnings and 0 duplicates.
[FINDBUGS] Successfully parsed file <https://builds.apache.org/job/Apache-falcon/ws/oozie/target/findbugs.xml>
with 0 unique warnings and 0 duplicates.
[FINDBUGS] Successfully parsed file <https://builds.apache.org/job/Apache-falcon/ws/prism/target/findbugs.xml>
with 0 unique warnings and 0 duplicates.
[FINDBUGS] Successfully parsed file <https://builds.apache.org/job/Apache-falcon/ws/replication/target/findbugs.xml>
with 0 unique warnings and 0 duplicates.
[FINDBUGS] Successfully parsed file <https://builds.apache.org/job/Apache-falcon/ws/rerun/target/findbugs.xml>
with 0 unique warnings and 0 duplicates.
[FINDBUGS] Successfully parsed file <https://builds.apache.org/job/Apache-falcon/ws/retention/target/findbugs.xml>
with 0 unique warnings and 0 duplicates.
[FINDBUGS] Successfully parsed file <https://builds.apache.org/job/Apache-falcon/ws/scheduler/target/findbugs.xml>
with 0 unique warnings and 0 duplicates.
[FINDBUGS] Successfully parsed file <https://builds.apache.org/job/Apache-falcon/ws/shell/target/findbugs.xml>
with 0 unique warnings and 0 duplicates.
[FINDBUGS] Successfully parsed file <https://builds.apache.org/job/Apache-falcon/ws/test-tools/hadoop-webapp/target/findbugs.xml>
with 0 unique warnings and 0 duplicates.
[FINDBUGS] Successfully parsed file <https://builds.apache.org/job/Apache-falcon/ws/test-util/target/findbugs.xml>
with 0 unique warnings and 0 duplicates.
[FINDBUGS] Successfully parsed file <https://builds.apache.org/job/Apache-falcon/ws/unit/target/findbugs.xml>
with 0 unique warnings and 0 duplicates.
[FINDBUGS] Computing warning deltas based on reference build #1051
Archiving artifacts
Recording test results
TestNG Reports Processing: START
Looking for TestNG results report in workspace using pattern: **/target/testng-results.xml
Did not find any matching files.

Mime
View raw message