falcon-dev mailing list archives

Site index · List index
Message view « Date » · « Thread »
Top « Date » · « Thread »
From Apache Jenkins Server <jenk...@builds.apache.org>
Subject Build failed in Jenkins: Apache-falcon #1049
Date Wed, 06 Jul 2016 11:48:32 GMT
See <https://builds.apache.org/job/Apache-falcon/1049/changes>

Changes:

[ajaynsit] FALCON-1609 Add entity commands to falcon spring-shell CLI

------------------------------------------
[...truncated 4684 lines...]
[INFO] BugInstance size is 0
[INFO] Error size is 0
[INFO] No errors/warnings found
[INFO]                                                                         
[INFO] ------------------------------------------------------------------------
[INFO] Building Apache Falcon Unit 0.11-SNAPSHOT
[INFO] ------------------------------------------------------------------------
[INFO] 
[INFO] --- maven-clean-plugin:2.5:clean (default-clean) @ falcon-unit ---
[INFO] Deleting <https://builds.apache.org/job/Apache-falcon/ws/unit/target>
[INFO] 
[INFO] --- maven-enforcer-plugin:1.3.1:enforce (enforce-property) @ falcon-unit ---
[INFO] 
[INFO] --- buildnumber-maven-plugin:1.0:create (default) @ falcon-unit ---
[INFO] Checking for local modifications: skipped.
[INFO] Updating project files from SCM: skipped.
[INFO] Executing: /bin/sh -c cd <https://builds.apache.org/job/Apache-falcon/ws/unit>
&& git show
[INFO] Working directory: <https://builds.apache.org/job/Apache-falcon/ws/unit>
[INFO] Storing buildNumber: b2526d8f4b8043ed0e1c005b89533683815e2373 at timestamp: 1467805517848
[INFO] Executing: /bin/sh -c cd <https://builds.apache.org/job/Apache-falcon/ws/unit>
&& git show
[INFO] Working directory: <https://builds.apache.org/job/Apache-falcon/ws/unit>
[INFO] Storing buildScmBranch: UNKNOWN
[INFO] 
[INFO] --- maven-remote-resources-plugin:1.5:process (default) @ falcon-unit ---
[INFO] 
[INFO] --- maven-resources-plugin:2.7:resources (default-resources) @ falcon-unit ---
[INFO] Using 'UTF-8' encoding to copy filtered resources.
[INFO] Copying 7 resources
[INFO] Copying 2 resources
[INFO] Copying 0 resource
[INFO] Copying 2 resources to META-INF
[INFO] Copying 3 resources
[INFO] 
[INFO] --- maven-compiler-plugin:2.3.2:compile (default-compile) @ falcon-unit ---
[INFO] Compiling 7 source files to <https://builds.apache.org/job/Apache-falcon/ws/unit/target/classes>
[INFO] 
[INFO] --- maven-resources-plugin:2.7:testResources (default-testResources) @ falcon-unit
---
[INFO] Using 'UTF-8' encoding to copy filtered resources.
[INFO] Copying 7 resources
[INFO] Copying 3 resources
[INFO] 
[INFO] --- maven-compiler-plugin:2.3.2:testCompile (default-testCompile) @ falcon-unit ---
[INFO] Compiling 5 source files to <https://builds.apache.org/job/Apache-falcon/ws/unit/target/test-classes>
[INFO] 
[INFO] --- maven-surefire-plugin:2.16:test (default-test) @ falcon-unit ---
[WARNING] The parameter forkMode is deprecated since version 2.14. Use forkCount and reuseForks
instead.
[INFO] Surefire report directory: <https://builds.apache.org/job/Apache-falcon/ws/unit/target/surefire-reports>

-------------------------------------------------------
 T E S T S
-------------------------------------------------------

-------------------------------------------------------
 T E S T S
-------------------------------------------------------
Running org.apache.falcon.unit.TestFalconUnit
Tests run: 12, Failures: 0, Errors: 0, Skipped: 0, Time elapsed: 147.15 sec - in org.apache.falcon.unit.TestFalconUnit

Results :

Tests run: 12, Failures: 0, Errors: 0, Skipped: 0

[INFO] 
[INFO] --- maven-site-plugin:3.4:site (default) @ falcon-unit ---
[INFO] maven.site.skip = true: Skipping site generation
[INFO] 
[INFO] --- maven-jar-plugin:2.4:jar (default-jar) @ falcon-unit ---
[INFO] Building jar: <https://builds.apache.org/job/Apache-falcon/ws/unit/target/falcon-unit-0.11-SNAPSHOT.jar>
[INFO] 
[INFO] --- maven-site-plugin:3.4:attach-descriptor (attach-descriptor) @ falcon-unit ---
[INFO] 
[INFO] --- maven-jar-plugin:2.4:test-jar (default) @ falcon-unit ---
[INFO] Building jar: <https://builds.apache.org/job/Apache-falcon/ws/unit/target/falcon-unit-0.11-SNAPSHOT-tests.jar>
[INFO] 
[INFO] --- maven-failsafe-plugin:2.16:integration-test (integration-test) @ falcon-unit ---
[WARNING] The parameter forkMode is deprecated since version 2.14. Use forkCount and reuseForks
instead.
[INFO] 
[INFO] --- maven-failsafe-plugin:2.16:verify (verify) @ falcon-unit ---
[INFO] Failsafe report directory: <https://builds.apache.org/job/Apache-falcon/ws/unit/target/failsafe-reports>
[INFO] 
[INFO] --- apache-rat-plugin:0.7:check (rat-check) @ falcon-unit ---
[INFO] Exclude: *.txt
[INFO] Exclude: **/*.txt
[INFO] Exclude: **/*.svg
[INFO] Exclude: *.md
[INFO] Exclude: **/*.md
[INFO] Exclude: .git/**
[INFO] Exclude: **/.idea/**
[INFO] Exclude: **/*.twiki
[INFO] Exclude: **/*.iml
[INFO] Exclude: **/target/**
[INFO] Exclude: **/activemq-data/**
[INFO] Exclude: **/build/**
[INFO] Exclude: **/*.patch
[INFO] Exclude: derby.log
[INFO] Exclude: **/logs/**
[INFO] Exclude: **/.classpath
[INFO] Exclude: **/.project
[INFO] Exclude: **/.settings/**
[INFO] Exclude: **/test-output/**
[INFO] Exclude: **/data.txt
[INFO] Exclude: **/maven-eclipse.xml
[INFO] Exclude: **/.externalToolBuilders/**
[INFO] Exclude: html5-ui/**
[INFO] Exclude: **/metastore_db/**
[INFO] Exclude: **/db1.log
[INFO] Exclude: **/db1.properties
[INFO] Exclude: **/db1.script
[INFO] Exclude: **/credential_provider.jceks
[INFO] Exclude: **/*.json
[INFO] 
[INFO] --- maven-checkstyle-plugin:2.9.1:check (checkstyle-check) @ falcon-unit ---
[INFO] Starting audit...
<https://builds.apache.org/job/Apache-falcon/ws/unit/src/main/java/org/apache/falcon/unit/FalconUnitClient.java>:373:
Line is longer than 120 characters.
<https://builds.apache.org/job/Apache-falcon/ws/unit/src/test/java/org/apache/falcon/unit/FalconUnitTestBase.java>:143:81:
Redundant throws: 'FalconCLIException' is unchecked exception.
<https://builds.apache.org/job/Apache-falcon/ws/unit/src/test/java/org/apache/falcon/unit/FalconUnitTestBase.java>:152:56:
Redundant throws: 'FalconCLIException' is unchecked exception.
<https://builds.apache.org/job/Apache-falcon/ws/unit/src/test/java/org/apache/falcon/unit/FalconUnitTestBase.java>:156:76:
Redundant throws: 'FalconCLIException' is unchecked exception.
<https://builds.apache.org/job/Apache-falcon/ws/unit/src/test/java/org/apache/falcon/unit/FalconUnitTestBase.java>:160:72:
Redundant throws: 'FalconCLIException' is unchecked exception.
<https://builds.apache.org/job/Apache-falcon/ws/unit/src/test/java/org/apache/falcon/unit/FalconUnitTestBase.java>:164:94:
Redundant throws: 'FalconCLIException' is unchecked exception.
<https://builds.apache.org/job/Apache-falcon/ws/unit/src/test/java/org/apache/falcon/unit/FalconUnitTestBase.java>:171:92:
Redundant throws: 'FalconCLIException' is unchecked exception.
<https://builds.apache.org/job/Apache-falcon/ws/unit/src/test/java/org/apache/falcon/unit/FalconUnitTestBase.java>:183:26:
Redundant throws: 'FalconCLIException' is unchecked exception.
<https://builds.apache.org/job/Apache-falcon/ws/unit/src/test/java/org/apache/falcon/unit/FalconUnitTestBase.java>:194:13:
Redundant throws: 'FalconCLIException' is unchecked exception.
<https://builds.apache.org/job/Apache-falcon/ws/unit/src/test/java/org/apache/falcon/unit/FalconUnitTestBase.java>:204:30:
Redundant throws: 'FalconCLIException' is unchecked exception.
<https://builds.apache.org/job/Apache-falcon/ws/unit/src/test/java/org/apache/falcon/unit/FalconUnitTestBase.java>:372:13:
Redundant throws: 'FalconCLIException' is unchecked exception.
<https://builds.apache.org/job/Apache-falcon/ws/unit/src/test/java/org/apache/falcon/unit/TestFalconUnit.java>:86:53:
Redundant throws: 'FalconCLIException' is unchecked exception.
<https://builds.apache.org/job/Apache-falcon/ws/unit/src/test/java/org/apache/falcon/unit/TestFalconUnit.java>:132:50:
Redundant throws: 'FalconCLIException' is unchecked exception.
<https://builds.apache.org/job/Apache-falcon/ws/unit/src/test/java/org/apache/falcon/unit/TestFalconUnit.java>:165:52:
Redundant throws: 'FalconCLIException' is unchecked exception.
<https://builds.apache.org/job/Apache-falcon/ws/unit/src/test/java/org/apache/falcon/unit/TestFalconUnit.java>:180:58:
Redundant throws: 'FalconCLIException' is unchecked exception.
<https://builds.apache.org/job/Apache-falcon/ws/unit/src/test/java/org/apache/falcon/unit/TestFalconUnit.java>:215:62:
Redundant throws: 'FalconCLIException' is unchecked exception.
Audit done.

[INFO] There are 16 checkstyle errors.
[INFO] ------------------------------------------------------------------------
[INFO] Reactor Summary:
[INFO] 
[INFO] Apache Falcon ..................................... SUCCESS [ 11.361 s]
[INFO] Apache Falcon UI .................................. SUCCESS [ 13.534 s]
[INFO] Build Tools ....................................... SUCCESS [  4.136 s]
[INFO] Apache Falcon Java client ......................... SUCCESS [ 27.751 s]
[INFO] Apache Falcon Metrics ............................. SUCCESS [ 14.677 s]
[INFO] Apache Falcon Hadoop Dependencies ................. SUCCESS [ 11.359 s]
[INFO] Apache Falcon Test Utility ........................ SUCCESS [ 12.188 s]
[INFO] Apache Falcon Commons ............................. SUCCESS [02:40 min]
[INFO] Apache Falcon CLI client .......................... SUCCESS [ 22.030 s]
[INFO] Apache Falcon Titan 1.0 support ................... SUCCESS [  4.791 s]
[INFO] Apache Falcon Oozie EL Extension .................. SUCCESS [ 14.339 s]
[INFO] Apache Falcon Embedded Hadoop - Test Cluster ...... SUCCESS [ 30.363 s]
[INFO] Apache Falcon Sharelib Hive - Test Cluster ........ SUCCESS [  1.084 s]
[INFO] Apache Falcon Sharelib Pig - Test Cluster ......... SUCCESS [  0.585 s]
[INFO] Apache Falcon Sharelib Hcatalog - Test Cluster .... SUCCESS [  0.712 s]
[INFO] Apache Falcon Sharelib Oozie - Test Cluster ....... SUCCESS [  0.583 s]
[INFO] Apache Falcon Test Tools - Test Cluster ........... SUCCESS [  0.603 s]
[INFO] Apache Falcon Messaging ........................... SUCCESS [ 30.896 s]
[INFO] Apache Falcon extensions .......................... SUCCESS [ 26.326 s]
[INFO] Apache Falcon LIfecycle Module .................... SUCCESS [ 18.495 s]
[INFO] Apache Falcon Oozie Adaptor ....................... SUCCESS [01:05 min]
[INFO] Apache Falcon Scheduler ........................... SUCCESS [01:23 min]
[INFO] Apache Falcon Acquisition ......................... SUCCESS [  1.163 s]
[INFO] Apache Falcon Distcp Replication .................. SUCCESS [ 18.580 s]
[INFO] Apache Falcon Retention ........................... SUCCESS [ 14.962 s]
[INFO] Apache Falcon Archival ............................ SUCCESS [  2.788 s]
[INFO] Apache Falcon Rerun ............................... SUCCESS [ 28.863 s]
[INFO] Apache Falcon Prism ............................... SUCCESS [02:43 min]
[INFO] Apache Falcon Unit ................................ FAILURE [02:32 min]
[INFO] Apache Falcon Examples ............................ SKIPPED
[INFO] Apache Falcon Web Application ..................... SKIPPED
[INFO] Apache Falcon Documentation ....................... SKIPPED
[INFO] Apache Falcon Distro .............................. SKIPPED
[INFO] ------------------------------------------------------------------------
[INFO] BUILD FAILURE
[INFO] ------------------------------------------------------------------------
[INFO] Total time: 15:40 min
[INFO] Finished at: 2016-07-06T11:47:50+00:00
[INFO] Final Memory: 982M/2315M
[INFO] ------------------------------------------------------------------------
[WARNING] The requested profile "hadoop-2" could not be activated because it does not exist.
[ERROR] Failed to execute goal org.apache.maven.plugins:maven-checkstyle-plugin:2.9.1:check
(checkstyle-check) on project falcon-unit: You have 16 Checkstyle violations. -> [Help
1]
[ERROR] 
[ERROR] To see the full stack trace of the errors, re-run Maven with the -e switch.
[ERROR] Re-run Maven using the -X switch to enable full debug logging.
[ERROR] 
[ERROR] For more information about the errors and possible solutions, please read the following
articles:
[ERROR] [Help 1] http://cwiki.apache.org/confluence/display/MAVEN/MojoFailureException
[ERROR] 
[ERROR] After correcting the problems, you can resume the build with the command
[ERROR]   mvn <goals> -rf :falcon-unit
Build step 'Execute shell' marked build as failure
[CHECKSTYLE] Collecting checkstyle analysis files...
[CHECKSTYLE] Finding all files that match the pattern **/target/checkstyle-result.xml
[CHECKSTYLE] Parsing 31 files in <https://builds.apache.org/job/Apache-falcon/ws/>
[CHECKSTYLE] Successfully parsed file <https://builds.apache.org/job/Apache-falcon/ws/acquisition/target/checkstyle-result.xml>
with 0 unique warnings and 0 duplicates.
[CHECKSTYLE] Successfully parsed file <https://builds.apache.org/job/Apache-falcon/ws/archival/target/checkstyle-result.xml>
with 0 unique warnings and 0 duplicates.
[CHECKSTYLE] Successfully parsed file <https://builds.apache.org/job/Apache-falcon/ws/build-tools/target/checkstyle-result.xml>
with 0 unique warnings and 0 duplicates.
[CHECKSTYLE] Successfully parsed file <https://builds.apache.org/job/Apache-falcon/ws/cli/target/checkstyle-result.xml>
with 0 unique warnings and 0 duplicates.
[CHECKSTYLE] Successfully parsed file <https://builds.apache.org/job/Apache-falcon/ws/client/target/checkstyle-result.xml>
with 0 unique warnings and 0 duplicates.
[CHECKSTYLE] Successfully parsed file <https://builds.apache.org/job/Apache-falcon/ws/common/target/checkstyle-result.xml>
with 0 unique warnings and 0 duplicates.
[CHECKSTYLE] Successfully parsed file <https://builds.apache.org/job/Apache-falcon/ws/distro/target/checkstyle-result.xml>
with 0 unique warnings and 0 duplicates.
[CHECKSTYLE] Successfully parsed file <https://builds.apache.org/job/Apache-falcon/ws/docs/target/checkstyle-result.xml>
with 0 unique warnings and 0 duplicates.
[CHECKSTYLE] Successfully parsed file <https://builds.apache.org/job/Apache-falcon/ws/examples/target/checkstyle-result.xml>
with 0 unique warnings and 0 duplicates.
[CHECKSTYLE] Successfully parsed file <https://builds.apache.org/job/Apache-falcon/ws/extensions/target/checkstyle-result.xml>
with 0 unique warnings and 0 duplicates.
[CHECKSTYLE] Successfully parsed file <https://builds.apache.org/job/Apache-falcon/ws/falcon-ui/target/checkstyle-result.xml>
with 0 unique warnings and 0 duplicates.
[CHECKSTYLE] Successfully parsed file <https://builds.apache.org/job/Apache-falcon/ws/hadoop-dependencies/target/checkstyle-result.xml>
with 0 unique warnings and 0 duplicates.
[CHECKSTYLE] Successfully parsed file <https://builds.apache.org/job/Apache-falcon/ws/lifecycle/target/checkstyle-result.xml>
with 0 unique warnings and 0 duplicates.
[CHECKSTYLE] Successfully parsed file <https://builds.apache.org/job/Apache-falcon/ws/messaging/target/checkstyle-result.xml>
with 0 unique warnings and 0 duplicates.
[CHECKSTYLE] Successfully parsed file <https://builds.apache.org/job/Apache-falcon/ws/metrics/target/checkstyle-result.xml>
with 0 unique warnings and 0 duplicates.
[CHECKSTYLE] Successfully parsed file <https://builds.apache.org/job/Apache-falcon/ws/oozie-el-extensions/target/checkstyle-result.xml>
with 0 unique warnings and 0 duplicates.
[CHECKSTYLE] Successfully parsed file <https://builds.apache.org/job/Apache-falcon/ws/oozie/target/checkstyle-result.xml>
with 0 unique warnings and 0 duplicates.
[CHECKSTYLE] Successfully parsed file <https://builds.apache.org/job/Apache-falcon/ws/prism/target/checkstyle-result.xml>
with 0 unique warnings and 0 duplicates.
[CHECKSTYLE] Successfully parsed file <https://builds.apache.org/job/Apache-falcon/ws/replication/target/checkstyle-result.xml>
with 0 unique warnings and 0 duplicates.
[CHECKSTYLE] Successfully parsed file <https://builds.apache.org/job/Apache-falcon/ws/rerun/target/checkstyle-result.xml>
with 0 unique warnings and 0 duplicates.
[CHECKSTYLE] Successfully parsed file <https://builds.apache.org/job/Apache-falcon/ws/retention/target/checkstyle-result.xml>
with 0 unique warnings and 0 duplicates.
[CHECKSTYLE] Successfully parsed file <https://builds.apache.org/job/Apache-falcon/ws/scheduler/target/checkstyle-result.xml>
with 0 unique warnings and 0 duplicates.
[CHECKSTYLE] Successfully parsed file <https://builds.apache.org/job/Apache-falcon/ws/target/checkstyle-result.xml>
with 0 unique warnings and 0 duplicates.
[CHECKSTYLE] Successfully parsed file <https://builds.apache.org/job/Apache-falcon/ws/test-tools/hadoop-webapp/target/checkstyle-result.xml>
with 0 unique warnings and 0 duplicates.
[CHECKSTYLE] Successfully parsed file <https://builds.apache.org/job/Apache-falcon/ws/test-tools/hcatalog-sharelib/target/checkstyle-result.xml>
with 0 unique warnings and 0 duplicates.
[CHECKSTYLE] Successfully parsed file <https://builds.apache.org/job/Apache-falcon/ws/test-tools/hive-sharelib/target/checkstyle-result.xml>
with 0 unique warnings and 0 duplicates.
[CHECKSTYLE] Successfully parsed file <https://builds.apache.org/job/Apache-falcon/ws/test-tools/oozie-sharelib/target/checkstyle-result.xml>
with 0 unique warnings and 0 duplicates.
[CHECKSTYLE] Successfully parsed file <https://builds.apache.org/job/Apache-falcon/ws/test-tools/pig-sharelib/target/checkstyle-result.xml>
with 0 unique warnings and 0 duplicates.
[CHECKSTYLE] Successfully parsed file <https://builds.apache.org/job/Apache-falcon/ws/test-tools/target/checkstyle-result.xml>
with 0 unique warnings and 0 duplicates.
[CHECKSTYLE] Successfully parsed file <https://builds.apache.org/job/Apache-falcon/ws/test-util/target/checkstyle-result.xml>
with 0 unique warnings and 0 duplicates.
[CHECKSTYLE] Successfully parsed file <https://builds.apache.org/job/Apache-falcon/ws/unit/target/checkstyle-result.xml>
with 16 unique warnings and 0 duplicates.
[CHECKSTYLE] Computing warning deltas based on reference build #1047
[FINDBUGS] Collecting findbugs analysis files...
[FINDBUGS] Finding all files that match the pattern **/target/findbugs.xml
[FINDBUGS] Parsing 18 files in <https://builds.apache.org/job/Apache-falcon/ws/>
[FINDBUGS] Successfully parsed file <https://builds.apache.org/job/Apache-falcon/ws/cli/target/findbugs.xml>
with 0 unique warnings and 0 duplicates.
[FINDBUGS] Successfully parsed file <https://builds.apache.org/job/Apache-falcon/ws/client/target/findbugs.xml>
with 0 unique warnings and 0 duplicates.
[FINDBUGS] Successfully parsed file <https://builds.apache.org/job/Apache-falcon/ws/common/target/findbugs.xml>
with 0 unique warnings and 0 duplicates.
[FINDBUGS] Successfully parsed file <https://builds.apache.org/job/Apache-falcon/ws/examples/target/findbugs.xml>
with 0 unique warnings and 0 duplicates.
[FINDBUGS] Successfully parsed file <https://builds.apache.org/job/Apache-falcon/ws/extensions/target/findbugs.xml>
with 0 unique warnings and 0 duplicates.
[FINDBUGS] Successfully parsed file <https://builds.apache.org/job/Apache-falcon/ws/hadoop-dependencies/target/findbugs.xml>
with 0 unique warnings and 0 duplicates.
[FINDBUGS] Successfully parsed file <https://builds.apache.org/job/Apache-falcon/ws/lifecycle/target/findbugs.xml>
with 0 unique warnings and 0 duplicates.
[FINDBUGS] Successfully parsed file <https://builds.apache.org/job/Apache-falcon/ws/messaging/target/findbugs.xml>
with 0 unique warnings and 0 duplicates.
[FINDBUGS] Successfully parsed file <https://builds.apache.org/job/Apache-falcon/ws/metrics/target/findbugs.xml>
with 0 unique warnings and 0 duplicates.
[FINDBUGS] Successfully parsed file <https://builds.apache.org/job/Apache-falcon/ws/oozie-el-extensions/target/findbugs.xml>
with 0 unique warnings and 0 duplicates.
[FINDBUGS] Successfully parsed file <https://builds.apache.org/job/Apache-falcon/ws/oozie/target/findbugs.xml>
with 0 unique warnings and 0 duplicates.
[FINDBUGS] Successfully parsed file <https://builds.apache.org/job/Apache-falcon/ws/prism/target/findbugs.xml>
with 0 unique warnings and 0 duplicates.
[FINDBUGS] Successfully parsed file <https://builds.apache.org/job/Apache-falcon/ws/replication/target/findbugs.xml>
with 0 unique warnings and 0 duplicates.
[FINDBUGS] Successfully parsed file <https://builds.apache.org/job/Apache-falcon/ws/rerun/target/findbugs.xml>
with 0 unique warnings and 0 duplicates.
[FINDBUGS] Successfully parsed file <https://builds.apache.org/job/Apache-falcon/ws/retention/target/findbugs.xml>
with 0 unique warnings and 0 duplicates.
[FINDBUGS] Successfully parsed file <https://builds.apache.org/job/Apache-falcon/ws/scheduler/target/findbugs.xml>
with 0 unique warnings and 0 duplicates.
[FINDBUGS] Successfully parsed file <https://builds.apache.org/job/Apache-falcon/ws/test-tools/hadoop-webapp/target/findbugs.xml>
with 0 unique warnings and 0 duplicates.
[FINDBUGS] Successfully parsed file <https://builds.apache.org/job/Apache-falcon/ws/test-util/target/findbugs.xml>
with 0 unique warnings and 0 duplicates.
[FINDBUGS] Computing warning deltas based on reference build #1047
Archiving artifacts
Recording test results
TestNG Reports Processing: START
Looking for TestNG results report in workspace using pattern: **/target/testng-results.xml
Did not find any matching files.

Mime
View raw message