falcon-dev mailing list archives

Site index · List index
Message view « Date » · « Thread »
Top « Date » · « Thread »
From "Balu Vellanki (JIRA)" <j...@apache.org>
Subject [jira] [Created] (FALCON-1953) Build fails when profiles hivedr and test-patch is used together
Date Wed, 11 May 2016 22:24:13 GMT
Balu Vellanki created FALCON-1953:
-------------------------------------

             Summary: Build fails when profiles hivedr and test-patch is used together
                 Key: FALCON-1953
                 URL: https://issues.apache.org/jira/browse/FALCON-1953
             Project: Falcon
          Issue Type: Bug
            Reporter: Balu Vellanki
            Assignee: Balu Vellanki
             Fix For: 0.10


{code}
[INFO] ------------------------------------------------------------------------
[INFO] BUILD FAILURE
[INFO] ------------------------------------------------------------------------
[INFO] Total time: 15:15 min
[INFO] Finished at: 2016-05-11T14:41:46-07:00
[INFO] Final Memory: 384M/857M
[INFO] ------------------------------------------------------------------------
[ERROR] Failed to execute goal org.apache.maven.plugins:maven-compiler-plugin:2.3.2:compile
(default-compile) on project falcon-hive-replication: Compilation failure
[ERROR] /Users/bvellanki/SourceCode/apache-falcon/falcon/addons/hivedr/src/main/java/org/apache/falcon/hive/util/HiveDRUtils.java:[82,12]
error: cannot find symbol
[ERROR] -> [Help 1]
{code}



--
This message was sent by Atlassian JIRA
(v6.3.4#6332)

Mime
View raw message