falcon-dev mailing list archives

Site index · List index
Message view « Date » · « Thread »
Top « Date » · « Thread »
From Pavan Nadakarni <pnadaka...@gmail.com>
Subject Re: Falcon On MapR
Date Tue, 17 May 2016 00:38:26 GMT
Hi Pavan,

I followed the link but it didn't help. Tried to run it with Debug enabled

export MAVEN_OPTS="-Xmx1024m -XX:MaxPermSize=256m -noverify" && mvn -X -e
exec:exec clean install

It is complaining about some missing executable

[ERROR] Failed to execute goal
org.codehaus.mojo:exec-maven-plugin:1.4.0:exec (default-cli) on project
falcon-main: The parameters 'executable' for goal
org.codehaus.mojo:exec-maven-plugin:1.4.0:exec are missing or invalid ->
[Help 1]

org.apache.maven.lifecycle.LifecycleExecutionException: Failed to execute
goal org.codehaus.mojo:exec-maven-plugin:1.4.0:exec (default-cli) on
project falcon-main: The parameters 'executable' for goal
org.codehaus.mojo:exec-maven-plugin:1.4.0:exec are missing or invalid

at
org.apache.maven.lifecycle.internal.MojoExecutor.execute(MojoExecutor.java:212)

at
org.apache.maven.lifecycle.internal.MojoExecutor.execute(MojoExecutor.java:153)

at
org.apache.maven.lifecycle.internal.MojoExecutor.execute(MojoExecutor.java:145)

at
org.apache.maven.lifecycle.internal.LifecycleModuleBuilder.buildProject(LifecycleModuleBuilder.java:116)

at
org.apache.maven.lifecycle.internal.LifecycleModuleBuilder.buildProject(LifecycleModuleBuilder.java:80)

at
org.apache.maven.lifecycle.internal.builder.singlethreaded.SingleThreadedBuilder.build(SingleThreadedBuilder.java:51)

at
org.apache.maven.lifecycle.internal.LifecycleStarter.execute(LifecycleStarter.java:128)

at org.apache.maven.DefaultMaven.doExecute(DefaultMaven.java:307)

at org.apache.maven.DefaultMaven.doExecute(DefaultMaven.java:193)

at org.apache.maven.DefaultMaven.execute(DefaultMaven.java:106)

at org.apache.maven.cli.MavenCli.execute(MavenCli.java:863)

at org.apache.maven.cli.MavenCli.doMain(MavenCli.java:288)

at org.apache.maven.cli.MavenCli.main(MavenCli.java:199)

at sun.reflect.NativeMethodAccessorImpl.invoke0(Native Method)

at
sun.reflect.NativeMethodAccessorImpl.invoke(NativeMethodAccessorImpl.java:57)

at
sun.reflect.DelegatingMethodAccessorImpl.invoke(DelegatingMethodAccessorImpl.java:43)

at java.lang.reflect.Method.invoke(Method.java:606)

at
org.codehaus.plexus.classworlds.launcher.Launcher.launchEnhanced(Launcher.java:289)

at
org.codehaus.plexus.classworlds.launcher.Launcher.launch(Launcher.java:229)

at
org.codehaus.plexus.classworlds.launcher.Launcher.mainWithExitCode(Launcher.java:415)

at org.codehaus.plexus.classworlds.launcher.Launcher.main(Launcher.java:356)

Caused by: org.apache.maven.plugin.PluginParameterException: The parameters
'executable' for goal org.codehaus.mojo:exec-maven-plugin:1.4.0:exec are
missing or invalid

at
org.apache.maven.plugin.internal.DefaultMavenPluginManager.populatePluginFields(DefaultMavenPluginManager.java:641)

at
org.apache.maven.plugin.internal.DefaultMavenPluginManager.getConfiguredMojo(DefaultMavenPluginManager.java:594)

at
org.apache.maven.plugin.DefaultBuildPluginManager.executeMojo(DefaultBuildPluginManager.java:121)

at
org.apache.maven.lifecycle.internal.MojoExecutor.execute(MojoExecutor.java:207)

... 20 more

[ERROR]

[ERROR]

[ERROR] For more information about the errors and possible solutions,
please read the following articles:

[ERROR] [Help 1]
http://cwiki.apache.org/confluence/display/MAVEN/PluginParameterException

Can you tell what does it actually wants.

Thanks,
Pavan​

On Thu, May 5, 2016 at 1:19 AM, Pavan Kolamuri <pavan.kolamuri@inmobi.com>
wrote:

> Hi Pavan,
>
> Can you please check https://issues.apache.org/jira/browse/FALCON-1620 is
> it related ? Can you please try  suggested approaches ?
>
> On Thu, May 5, 2016 at 12:35 AM, Pavan Nadakarni <pnadakarni@gmail.com>
> wrote:
>
> > Hello Srikanth,
> >
> > Our nodes were running openjdk version "1.8.0_65"  then i installed jdk
> 1.6
> > but still getting same error
> > From the prerequisites on Falcon installation page it supported JDK
> 1.7/1.8
> > and Oozie requires JDK 1.6+
> >
> > Below is the message after enabling debugging
> >
> > [ERROR] Failed to execute goal
> > org.codehaus.mojo:exec-maven-plugin:1.4.0:java (default-cli) on project
> > falcon-main: The parameters 'mainClass' for goal
> > org.codehaus.mojo:exec-maven-plugin:1.4.0:java are missing or invalid ->
> > [Help 1]
> >
> > org.apache.maven.lifecycle.LifecycleExecutionException: Failed to execute
> > goal org.codehaus.mojo:exec-maven-plugin:1.4.0:java (default-cli) on
> > project falcon-main: The parameters 'mainClass' for goal
> > org.codehaus.mojo:exec-maven-plugin:1.4.0:java are missing or invalid
> >
> > at
> >
> >
> org.apache.maven.lifecycle.internal.MojoExecutor.execute(MojoExecutor.java:212)
> >
> > at
> >
> >
> org.apache.maven.lifecycle.internal.MojoExecutor.execute(MojoExecutor.java:153)
> >
> > at
> >
> >
> org.apache.maven.lifecycle.internal.MojoExecutor.execute(MojoExecutor.java:145)
> >
> > at
> >
> >
> org.apache.maven.lifecycle.internal.LifecycleModuleBuilder.buildProject(LifecycleModuleBuilder.java:116)
> >
> > at
> >
> >
> org.apache.maven.lifecycle.internal.LifecycleModuleBuilder.buildProject(LifecycleModuleBuilder.java:80)
> >
> > at
> >
> >
> org.apache.maven.lifecycle.internal.builder.singlethreaded.SingleThreadedBuilder.build(SingleThreadedBuilder.java:51)
> >
> > at
> >
> >
> org.apache.maven.lifecycle.internal.LifecycleStarter.execute(LifecycleStarter.java:128)
> >
> > at org.apache.maven.DefaultMaven.doExecute(DefaultMaven.java:307)
> >
> > at org.apache.maven.DefaultMaven.doExecute(DefaultMaven.java:193)
> >
> > at org.apache.maven.DefaultMaven.execute(DefaultMaven.java:106)
> >
> > at org.apache.maven.cli.MavenCli.execute(MavenCli.java:863)
> >
> > at org.apache.maven.cli.MavenCli.doMain(MavenCli.java:288)
> >
> > at org.apache.maven.cli.MavenCli.main(MavenCli.java:199)
> >
> > at sun.reflect.NativeMethodAccessorImpl.invoke0(Native Method)
> >
> > at
> >
> >
> sun.reflect.NativeMethodAccessorImpl.invoke(NativeMethodAccessorImpl.java:62)
> >
> > at
> >
> >
> sun.reflect.DelegatingMethodAccessorImpl.invoke(DelegatingMethodAccessorImpl.java:43)
> >
> > at java.lang.reflect.Method.invoke(Method.java:497)
> >
> > at
> >
> >
> org.codehaus.plexus.classworlds.launcher.Launcher.launchEnhanced(Launcher.java:289)
> >
> > at
> >
> org.codehaus.plexus.classworlds.launcher.Launcher.launch(Launcher.java:229)
> >
> > at
> >
> >
> org.codehaus.plexus.classworlds.launcher.Launcher.mainWithExitCode(Launcher.java:415)
> >
> > at
> > org.codehaus.plexus.classworlds.launcher.Launcher.main(Launcher.java:356)
> >
> > Caused by: org.apache.maven.plugin.PluginParameterException: The
> parameters
> > 'mainClass' for goal org.codehaus.mojo:exec-maven-plugin:1.4.0:java are
> > missing or invalid
> >
> > at
> >
> >
> org.apache.maven.plugin.internal.DefaultMavenPluginManager.populatePluginFields(DefaultMavenPluginManager.java:641)
> >
> > at
> >
> >
> org.apache.maven.plugin.internal.DefaultMavenPluginManager.getConfiguredMojo(DefaultMavenPluginManager.java:594)
> >
> > at
> >
> >
> org.apache.maven.plugin.DefaultBuildPluginManager.executeMojo(DefaultBuildPluginManager.java:121)
> >
> > at
> >
> >
> org.apache.maven.lifecycle.internal.MojoExecutor.execute(MojoExecutor.java:207)
> >
> > ... 20 more
> >
> > [ERROR]
> >
> > [ERROR]
> >
> > [ERROR] For more information about the errors and possible solutions,
> > please read the following articles:
> >
> > [ERROR] [Help 1]
> >
> http://cwiki.apache.org/confluence/display/MAVEN/PluginParameterException
> >
> > Thanks,
> > Pavan
> >
> > On Wed, May 4, 2016 at 11:24 AM, Srikanth Sundarrajan <
> sriksun@hotmail.com
> > >
> > wrote:
> >
> > > Looks like a build failure in the oozie build. Can you check if java
> > > version is compatible with oozie. In most cases that happens to be the
> > > problem.
> > >
> > > Sent from my iPhone
> > >
> > > > On 04-May-2016, at 7:24 pm, "Pavan Nadakarni" <pnadakarni@gmail.com>
> > > wrote:
> > > >
> > > > Hello,
> > > >
> > > > I am trying to start playing with Falcon on our MapR Cluster but
> unable
> > > to
> > > > install it.
> > > >
> > > > I followed the documentation on the installation page
> > > > https://falcon.apache.org/InstallationSteps.html
> > > >
> > > > but failed on step 2.
> > > > Below is the last part of messages. Any help will be appreciated.
> > > >
> > > > [INFO] Apache Falcon Examples ............................. SKIPPED
> > > >
> > > > [INFO] Apache Falcon Web Application ...................... SKIPPED
> > > >
> > > > [INFO] Apache Falcon Documentation ........................ SKIPPED
> > > >
> > > > [INFO] Apache Falcon Distro ............................... SKIPPED
> > > >
> > > > [INFO]
> > > >
> > ------------------------------------------------------------------------
> > > >
> > > > [INFO] BUILD FAILURE
> > > >
> > > > [INFO]
> > > >
> > ------------------------------------------------------------------------
> > > >
> > > > [INFO] Total time: 06:32 min
> > > >
> > > > [INFO] Finished at: 2016-05-03T10:44:54-04:00
> > > >
> > > > [INFO] Final Memory: 33M/526M
> > > >
> > > > [INFO]
> > > >
> > ------------------------------------------------------------------------
> > > >
> > > > [ERROR] Failed to execute goal
> > > > org.codehaus.mojo:exec-maven-plugin:1.2.1:exec (BUILD-OOZIE) on
> project
> > > > build-tools: Command execution failed. Process exited with an error:
> 1
> > > > (Exit value: 1) -> [Help 1]
> > > >
> > > > [ERROR]
> > > >
> > > > [ERROR] To see the full stack trace of the errors, re-run Maven with
> > the
> > > -e
> > > > switch.
> > > >
> > > > [ERROR] Re-run Maven using the -X switch to enable full debug
> logging.
> > > >
> > > > [ERROR]
> > > >
> > > > [ERROR] For more information about the errors and possible solutions,
> > > > please read the following articles:
> > > >
> > > > [ERROR] [Help 1]
> > > >
> > http://cwiki.apache.org/confluence/display/MAVEN/MojoExecutionException
> > > >
> > > > [ERROR]
> > > >
> > > > [ERROR] After correcting the problems, you can resume the build with
> > the
> > > > command
> > > >
> > > > [ERROR]   mvn <goals> -rf :build-tools
> > > >
> > > >
> > > > --
> > > > Thanks,
> > > > Pavan
> > >
> >
> >
> >
> > --
> > Thanks,
> > Pavan
> >
>
>
>
> --
> Thanks and regards
> Pavan Kumar Kolamuri
>
> --
> _____________________________________________________________
> The information contained in this communication is intended solely for the
> use of the individual or entity to whom it is addressed and others
> authorized to receive it. It may contain confidential or legally privileged
> information. If you are not the intended recipient you are hereby notified
> that any disclosure, copying, distribution or taking any action in reliance
> on the contents of this information is strictly prohibited and may be
> unlawful. If you have received this communication in error, please notify
> us immediately by responding to this email and then delete it from your
> system. The firm is neither liable for the proper and complete transmission
> of the information contained in this communication nor for any delay in its
> receipt.
>



-- 
Thanks,
Pavan

Mime
  • Unnamed multipart/alternative (inline, None, 0 bytes)
View raw message