falcon-dev mailing list archives

Site index · List index
Message view « Date » · « Thread »
Top « Date » · « Thread »
From Apache Jenkins Server <jenk...@builds.apache.org>
Subject Build failed in Jenkins: Apache-falcon #1005
Date Thu, 19 May 2016 05:26:39 GMT
See <https://builds.apache.org/job/Apache-falcon/1005/changes>

Changes:

[pavan.kolamuri] FALCON-1853 : Add spark process workflow builder

------------------------------------------
[...truncated 1200 lines...]
Tests run: 4, Failures: 0, Errors: 0, Skipped: 0, Time elapsed: 1.38 sec - in org.apache.falcon.retention.EvictedInstanceSerDeTest
Running org.apache.falcon.retention.EvictionHelperTest
Tests run: 1, Failures: 0, Errors: 0, Skipped: 0, Time elapsed: 0.542 sec - in org.apache.falcon.retention.EvictionHelperTest
Running org.apache.falcon.update.UpdateHelperTest
Tests run: 6, Failures: 0, Errors: 0, Skipped: 0, Time elapsed: 4.288 sec - in org.apache.falcon.update.UpdateHelperTest
Running org.apache.falcon.group.FeedGroupMapTest
Tests run: 3, Failures: 0, Errors: 0, Skipped: 0, Time elapsed: 2.651 sec - in org.apache.falcon.group.FeedGroupMapTest
Running org.apache.falcon.entity.HiveUtilTest
Tests run: 2, Failures: 0, Errors: 0, Skipped: 0, Time elapsed: 1.374 sec - in org.apache.falcon.entity.HiveUtilTest
Running org.apache.falcon.entity.store.ConfigurationStoreTest
Tests run: 16, Failures: 0, Errors: 0, Skipped: 0, Time elapsed: 2.392 sec - in org.apache.falcon.entity.store.ConfigurationStoreTest
Running org.apache.falcon.entity.store.FeedLocationStoreTest
Tests run: 7, Failures: 0, Errors: 0, Skipped: 0, Time elapsed: 2.754 sec - in org.apache.falcon.entity.store.FeedLocationStoreTest
Running org.apache.falcon.entity.StorageFactoryTest
Tests run: 36, Failures: 0, Errors: 0, Skipped: 0, Time elapsed: 2.51 sec - in org.apache.falcon.entity.StorageFactoryTest
Running org.apache.falcon.entity.lock.MemoryLocksTest
Tests run: 3, Failures: 0, Errors: 0, Skipped: 0, Time elapsed: 1.381 sec - in org.apache.falcon.entity.lock.MemoryLocksTest
Running org.apache.falcon.entity.FeedDataPathTest
Tests run: 5, Failures: 0, Errors: 0, Skipped: 0, Time elapsed: 0.27 sec - in org.apache.falcon.entity.FeedDataPathTest
Running org.apache.falcon.entity.CatalogStorageTest
Tests run: 17, Failures: 0, Errors: 0, Skipped: 0, Time elapsed: 0.661 sec - in org.apache.falcon.entity.CatalogStorageTest
Running org.apache.falcon.entity.FileSystemStorageTest
Tests run: 38, Failures: 0, Errors: 0, Skipped: 0, Time elapsed: 3.595 sec - in org.apache.falcon.entity.FileSystemStorageTest
Running org.apache.falcon.entity.parser.FeedEntityParserTest
Tests run: 55, Failures: 0, Errors: 0, Skipped: 0, Time elapsed: 6.771 sec - in org.apache.falcon.entity.parser.FeedEntityParserTest
Running org.apache.falcon.entity.parser.ClusterEntityParserTest
Tests run: 15, Failures: 0, Errors: 0, Skipped: 0, Time elapsed: 9.128 sec - in org.apache.falcon.entity.parser.ClusterEntityParserTest
Running org.apache.falcon.entity.parser.ProcessEntityParserTest
Tests run: 39, Failures: 0, Errors: 0, Skipped: 0, Time elapsed: 8.887 sec - in org.apache.falcon.entity.parser.ProcessEntityParserTest
Running org.apache.falcon.entity.parser.FeedUpdateTest
Tests run: 4, Failures: 0, Errors: 0, Skipped: 0, Time elapsed: 2.9 sec - in org.apache.falcon.entity.parser.FeedUpdateTest
Running org.apache.falcon.entity.parser.DatasourceEntityParserTest
Tests run: 2, Failures: 0, Errors: 0, Skipped: 0, Time elapsed: 2.399 sec - in org.apache.falcon.entity.parser.DatasourceEntityParserTest
Running org.apache.falcon.entity.ProcessHelperTest
Tests run: 6, Failures: 0, Errors: 0, Skipped: 0, Time elapsed: 2.54 sec - in org.apache.falcon.entity.ProcessHelperTest
Running org.apache.falcon.entity.EntityTypeTest
Tests run: 4, Failures: 0, Errors: 0, Skipped: 0, Time elapsed: 1.142 sec - in org.apache.falcon.entity.EntityTypeTest
Running org.apache.falcon.entity.v0.EntityGraphTest
Tests run: 6, Failures: 0, Errors: 0, Skipped: 0, Time elapsed: 2.404 sec - in org.apache.falcon.entity.v0.EntityGraphTest
Running org.apache.falcon.entity.EntityUtilTest
Tests run: 41, Failures: 0, Errors: 0, Skipped: 0, Time elapsed: 3.368 sec - in org.apache.falcon.entity.EntityUtilTest
Running org.apache.falcon.entity.ColoClusterRelationTest
Tests run: 1, Failures: 0, Errors: 0, Skipped: 0, Time elapsed: 2.357 sec - in org.apache.falcon.entity.ColoClusterRelationTest
Running org.apache.falcon.entity.FeedHelperTest
Tests run: 51, Failures: 0, Errors: 0, Skipped: 0, Time elapsed: 3.556 sec - in org.apache.falcon.entity.FeedHelperTest
Running org.apache.falcon.entity.TestWorkflowNameBuilder
Tests run: 7, Failures: 0, Errors: 0, Skipped: 0, Time elapsed: 1.16 sec - in org.apache.falcon.entity.TestWorkflowNameBuilder
Running org.apache.falcon.security.DefaultAuthorizationProviderTest
Tests run: 34, Failures: 0, Errors: 0, Skipped: 0, Time elapsed: 2.459 sec - in org.apache.falcon.security.DefaultAuthorizationProviderTest
Running org.apache.falcon.security.SecurityUtilTest
Tests run: 9, Failures: 0, Errors: 0, Skipped: 0, Time elapsed: 1.655 sec - in org.apache.falcon.security.SecurityUtilTest
Running org.apache.falcon.security.AuthenticationInitializationServiceTest
Tests run: 5, Failures: 0, Errors: 0, Skipped: 0, Time elapsed: 1.618 sec - in org.apache.falcon.security.AuthenticationInitializationServiceTest
Running org.apache.falcon.security.CurrentUserTest
Tests run: 22, Failures: 0, Errors: 0, Skipped: 0, Time elapsed: 1.219 sec - in org.apache.falcon.security.CurrentUserTest
Running org.apache.falcon.util.RadixNodeTest
Tests run: 9, Failures: 0, Errors: 0, Skipped: 0, Time elapsed: 0.327 sec - in org.apache.falcon.util.RadixNodeTest
Running org.apache.falcon.util.HadoopQueueUtilTest
Tests run: 2, Failures: 0, Errors: 0, Skipped: 0, Time elapsed: 0.553 sec - in org.apache.falcon.util.HadoopQueueUtilTest
Running org.apache.falcon.util.ApplicationPropertiesTest
Tests run: 5, Failures: 0, Errors: 0, Skipped: 0, Time elapsed: 1.655 sec - in org.apache.falcon.util.ApplicationPropertiesTest
Running org.apache.falcon.util.RadixTreeTest
Tests run: 26, Failures: 0, Errors: 0, Skipped: 0, Time elapsed: 0.778 sec - in org.apache.falcon.util.RadixTreeTest
Running org.apache.falcon.util.ReflectionUtilsTest
Tests run: 1, Failures: 0, Errors: 0, Skipped: 0, Time elapsed: 2.094 sec - in org.apache.falcon.util.ReflectionUtilsTest
Running org.apache.falcon.metadata.MetadataMappingServiceTest
Tests run: 18, Failures: 0, Errors: 0, Skipped: 0, Time elapsed: 18.319 sec - in org.apache.falcon.metadata.MetadataMappingServiceTest
Running org.apache.falcon.hadoop.HadoopClientFactoryTest
Tests run: 3, Failures: 0, Errors: 0, Skipped: 0, Time elapsed: 1.374 sec - in org.apache.falcon.hadoop.HadoopClientFactoryTest
Running org.apache.falcon.workflow.WorkflowJobEndNotificationServiceTest
Tests run: 3, Failures: 0, Errors: 0, Skipped: 0, Time elapsed: 2.227 sec - in org.apache.falcon.workflow.WorkflowJobEndNotificationServiceTest
Running org.apache.falcon.workflow.WorkflowExecutionContextTest
Tests run: 41, Failures: 0, Errors: 0, Skipped: 0, Time elapsed: 3.218 sec - in org.apache.falcon.workflow.WorkflowExecutionContextTest
Running cli.TestCLIParser
Tests run: 3, Failures: 0, Errors: 0, Skipped: 0, Time elapsed: 0.266 sec - in cli.TestCLIParser

Results :

Tests run: 592, Failures: 0, Errors: 0, Skipped: 0

[INFO] 
[INFO] --- maven-site-plugin:3.4:site (default) @ falcon-common ---
[INFO] maven.site.skip = true: Skipping site generation
[INFO] 
[INFO] --- maven-jar-plugin:2.4:jar (default-jar) @ falcon-common ---
[INFO] Building jar: <https://builds.apache.org/job/Apache-falcon/ws/common/target/falcon-common-0.10-SNAPSHOT.jar>
[INFO] 
[INFO] --- maven-site-plugin:3.4:attach-descriptor (attach-descriptor) @ falcon-common ---
[INFO] 
[INFO] --- maven-jar-plugin:2.4:test-jar (default) @ falcon-common ---
[INFO] Building jar: <https://builds.apache.org/job/Apache-falcon/ws/common/target/falcon-common-0.10-SNAPSHOT-tests.jar>
[INFO] 
[INFO] --- maven-failsafe-plugin:2.16:integration-test (integration-test) @ falcon-common
---
[WARNING] The parameter forkMode is deprecated since version 2.14. Use forkCount and reuseForks
instead.
[INFO] 
[INFO] --- maven-failsafe-plugin:2.16:verify (verify) @ falcon-common ---
[INFO] Failsafe report directory: <https://builds.apache.org/job/Apache-falcon/ws/common/target/failsafe-reports>
[INFO] 
[INFO] --- apache-rat-plugin:0.7:check (rat-check) @ falcon-common ---
[INFO] Exclude: *.txt
[INFO] Exclude: **/*.txt
[INFO] Exclude: **/*.svg
[INFO] Exclude: *.md
[INFO] Exclude: **/*.md
[INFO] Exclude: .git/**
[INFO] Exclude: **/.idea/**
[INFO] Exclude: **/*.twiki
[INFO] Exclude: **/*.iml
[INFO] Exclude: **/target/**
[INFO] Exclude: **/activemq-data/**
[INFO] Exclude: **/build/**
[INFO] Exclude: **/*.patch
[INFO] Exclude: derby.log
[INFO] Exclude: **/logs/**
[INFO] Exclude: **/.classpath
[INFO] Exclude: **/.project
[INFO] Exclude: **/.settings/**
[INFO] Exclude: **/test-output/**
[INFO] Exclude: **/data.txt
[INFO] Exclude: **/maven-eclipse.xml
[INFO] Exclude: **/.externalToolBuilders/**
[INFO] Exclude: html5-ui/**
[INFO] Exclude: **/metastore_db/**
[INFO] Exclude: **/db1.log
[INFO] Exclude: **/db1.properties
[INFO] Exclude: **/db1.script
[INFO] Exclude: **/credential_provider.jceks
[INFO] Exclude: **/*.json
[INFO] 
[INFO] --- maven-checkstyle-plugin:2.9.1:check (checkstyle-check) @ falcon-common ---
[INFO] Starting audit...
<https://builds.apache.org/job/Apache-falcon/ws/common/src/test/java/org/apache/falcon/util/ApplicationPropertiesTest.java>:43:31:
Name 'credDir' must match pattern '^[A-Z][A-Z0-9]*(_[A-Z0-9]+)*$'.
Audit done.

[INFO] There are 1 checkstyle errors.
[INFO] ------------------------------------------------------------------------
[INFO] Reactor Summary:
[INFO] 
[INFO] Apache Falcon ..................................... SUCCESS [  8.343 s]
[INFO] Apache Falcon UI .................................. SUCCESS [ 12.235 s]
[INFO] Build Tools ....................................... SUCCESS [  4.022 s]
[INFO] Apache Falcon Java client ......................... SUCCESS [ 27.672 s]
[INFO] Apache Falcon Metrics ............................. SUCCESS [ 14.421 s]
[INFO] Apache Falcon Hadoop Dependencies ................. SUCCESS [ 11.943 s]
[INFO] Apache Falcon Test Utility ........................ SUCCESS [ 11.759 s]
[INFO] Apache Falcon Commons ............................. FAILURE [02:25 min]
[INFO] Apache Falcon CLI client .......................... SKIPPED
[INFO] Apache Falcon Oozie EL Extension .................. SKIPPED
[INFO] Apache Falcon Embedded Hadoop - Test Cluster ...... SKIPPED
[INFO] Apache Falcon Sharelib Hive - Test Cluster ........ SKIPPED
[INFO] Apache Falcon Sharelib Pig - Test Cluster ......... SKIPPED
[INFO] Apache Falcon Sharelib Hcatalog - Test Cluster .... SKIPPED
[INFO] Apache Falcon Sharelib Oozie - Test Cluster ....... SKIPPED
[INFO] Apache Falcon Test Tools - Test Cluster ........... SKIPPED
[INFO] Apache Falcon Messaging ........................... SKIPPED
[INFO] Apache Falcon extensions .......................... SKIPPED
[INFO] Apache Falcon LIfecycle Module .................... SKIPPED
[INFO] Apache Falcon Oozie Adaptor ....................... SKIPPED
[INFO] Apache Falcon Scheduler ........................... SKIPPED
[INFO] Apache Falcon Acquisition ......................... SKIPPED
[INFO] Apache Falcon Distcp Replication .................. SKIPPED
[INFO] Apache Falcon Retention ........................... SKIPPED
[INFO] Apache Falcon Archival ............................ SKIPPED
[INFO] Apache Falcon Rerun ............................... SKIPPED
[INFO] Apache Falcon Prism ............................... SKIPPED
[INFO] Apache Falcon Unit ................................ SKIPPED
[INFO] Apache Falcon Examples ............................ SKIPPED
[INFO] Apache Falcon Web Application ..................... SKIPPED
[INFO] Apache Falcon Documentation ....................... SKIPPED
[INFO] Apache Falcon Distro .............................. SKIPPED
[INFO] ------------------------------------------------------------------------
[INFO] BUILD FAILURE
[INFO] ------------------------------------------------------------------------
[INFO] Total time: 03:57 min
[INFO] Finished at: 2016-05-19T05:26:33+00:00
[INFO] Final Memory: 221M/1590M
[INFO] ------------------------------------------------------------------------
[ERROR] Failed to execute goal org.apache.maven.plugins:maven-checkstyle-plugin:2.9.1:check
(checkstyle-check) on project falcon-common: You have 1 Checkstyle violation. -> [Help
1]
[ERROR] 
[ERROR] To see the full stack trace of the errors, re-run Maven with the -e switch.
[ERROR] Re-run Maven using the -X switch to enable full debug logging.
[ERROR] 
[ERROR] For more information about the errors and possible solutions, please read the following
articles:
[ERROR] [Help 1] http://cwiki.apache.org/confluence/display/MAVEN/MojoFailureException
[ERROR] 
[ERROR] After correcting the problems, you can resume the build with the command
[ERROR]   mvn <goals> -rf :falcon-common
Build step 'Execute shell' marked build as failure
[CHECKSTYLE] Collecting checkstyle analysis files...
[CHECKSTYLE] Finding all files that match the pattern **/target/checkstyle-result.xml
[CHECKSTYLE] Parsing 31 files in <https://builds.apache.org/job/Apache-falcon/ws/>
[CHECKSTYLE] Successfully parsed file <https://builds.apache.org/job/Apache-falcon/ws/acquisition/target/checkstyle-result.xml>
with 0 unique warnings and 0 duplicates.
[CHECKSTYLE] Successfully parsed file <https://builds.apache.org/job/Apache-falcon/ws/archival/target/checkstyle-result.xml>
with 0 unique warnings and 0 duplicates.
[CHECKSTYLE] Successfully parsed file <https://builds.apache.org/job/Apache-falcon/ws/build-tools/target/checkstyle-result.xml>
with 0 unique warnings and 0 duplicates.
[CHECKSTYLE] Successfully parsed file <https://builds.apache.org/job/Apache-falcon/ws/cli/target/checkstyle-result.xml>
with 0 unique warnings and 0 duplicates.
[CHECKSTYLE] Successfully parsed file <https://builds.apache.org/job/Apache-falcon/ws/client/target/checkstyle-result.xml>
with 0 unique warnings and 0 duplicates.
[CHECKSTYLE] Successfully parsed file <https://builds.apache.org/job/Apache-falcon/ws/common/target/checkstyle-result.xml>
with 1 unique warning and 0 duplicates.
[CHECKSTYLE] Successfully parsed file <https://builds.apache.org/job/Apache-falcon/ws/distro/target/checkstyle-result.xml>
with 1 unique warning and 0 duplicates.
[CHECKSTYLE] Successfully parsed file <https://builds.apache.org/job/Apache-falcon/ws/docs/target/checkstyle-result.xml>
with 1 unique warning and 0 duplicates.
[CHECKSTYLE] Successfully parsed file <https://builds.apache.org/job/Apache-falcon/ws/examples/target/checkstyle-result.xml>
with 1 unique warning and 0 duplicates.
[CHECKSTYLE] Successfully parsed file <https://builds.apache.org/job/Apache-falcon/ws/extensions/target/checkstyle-result.xml>
with 1 unique warning and 0 duplicates.
[CHECKSTYLE] Successfully parsed file <https://builds.apache.org/job/Apache-falcon/ws/falcon-ui/target/checkstyle-result.xml>
with 1 unique warning and 0 duplicates.
[CHECKSTYLE] Successfully parsed file <https://builds.apache.org/job/Apache-falcon/ws/hadoop-dependencies/target/checkstyle-result.xml>
with 1 unique warning and 0 duplicates.
[CHECKSTYLE] Successfully parsed file <https://builds.apache.org/job/Apache-falcon/ws/lifecycle/target/checkstyle-result.xml>
with 1 unique warning and 0 duplicates.
[CHECKSTYLE] Successfully parsed file <https://builds.apache.org/job/Apache-falcon/ws/messaging/target/checkstyle-result.xml>
with 1 unique warning and 0 duplicates.
[CHECKSTYLE] Successfully parsed file <https://builds.apache.org/job/Apache-falcon/ws/metrics/target/checkstyle-result.xml>
with 1 unique warning and 0 duplicates.
[CHECKSTYLE] Successfully parsed file <https://builds.apache.org/job/Apache-falcon/ws/oozie-el-extensions/target/checkstyle-result.xml>
with 1 unique warning and 0 duplicates.
[CHECKSTYLE] Successfully parsed file <https://builds.apache.org/job/Apache-falcon/ws/oozie/target/checkstyle-result.xml>
with 1 unique warning and 0 duplicates.
[CHECKSTYLE] Successfully parsed file <https://builds.apache.org/job/Apache-falcon/ws/prism/target/checkstyle-result.xml>
with 1 unique warning and 0 duplicates.
[CHECKSTYLE] Successfully parsed file <https://builds.apache.org/job/Apache-falcon/ws/replication/target/checkstyle-result.xml>
with 1 unique warning and 0 duplicates.
[CHECKSTYLE] Successfully parsed file <https://builds.apache.org/job/Apache-falcon/ws/rerun/target/checkstyle-result.xml>
with 1 unique warning and 0 duplicates.
[CHECKSTYLE] Successfully parsed file <https://builds.apache.org/job/Apache-falcon/ws/retention/target/checkstyle-result.xml>
with 1 unique warning and 0 duplicates.
[CHECKSTYLE] Successfully parsed file <https://builds.apache.org/job/Apache-falcon/ws/scheduler/target/checkstyle-result.xml>
with 1 unique warning and 0 duplicates.
[CHECKSTYLE] Successfully parsed file <https://builds.apache.org/job/Apache-falcon/ws/target/checkstyle-result.xml>
with 1 unique warning and 0 duplicates.
[CHECKSTYLE] Successfully parsed file <https://builds.apache.org/job/Apache-falcon/ws/test-tools/hadoop-webapp/target/checkstyle-result.xml>
with 1 unique warning and 0 duplicates.
[CHECKSTYLE] Successfully parsed file <https://builds.apache.org/job/Apache-falcon/ws/test-tools/hcatalog-sharelib/target/checkstyle-result.xml>
with 1 unique warning and 0 duplicates.
[CHECKSTYLE] Successfully parsed file <https://builds.apache.org/job/Apache-falcon/ws/test-tools/hive-sharelib/target/checkstyle-result.xml>
with 1 unique warning and 0 duplicates.
[CHECKSTYLE] Successfully parsed file <https://builds.apache.org/job/Apache-falcon/ws/test-tools/oozie-sharelib/target/checkstyle-result.xml>
with 1 unique warning and 0 duplicates.
[CHECKSTYLE] Successfully parsed file <https://builds.apache.org/job/Apache-falcon/ws/test-tools/pig-sharelib/target/checkstyle-result.xml>
with 1 unique warning and 0 duplicates.
[CHECKSTYLE] Successfully parsed file <https://builds.apache.org/job/Apache-falcon/ws/test-tools/target/checkstyle-result.xml>
with 1 unique warning and 0 duplicates.
[CHECKSTYLE] Successfully parsed file <https://builds.apache.org/job/Apache-falcon/ws/test-util/target/checkstyle-result.xml>
with 1 unique warning and 0 duplicates.
[CHECKSTYLE] Successfully parsed file <https://builds.apache.org/job/Apache-falcon/ws/unit/target/checkstyle-result.xml>
with 1 unique warning and 0 duplicates.
[CHECKSTYLE] Computing warning deltas based on reference build #992
[FINDBUGS] Collecting findbugs analysis files...
[FINDBUGS] Finding all files that match the pattern **/target/findbugs.xml
[FINDBUGS] Parsing 17 files in <https://builds.apache.org/job/Apache-falcon/ws/>
[FINDBUGS] Successfully parsed file <https://builds.apache.org/job/Apache-falcon/ws/cli/target/findbugs.xml>
with 0 unique warnings and 0 duplicates.
[FINDBUGS] Successfully parsed file <https://builds.apache.org/job/Apache-falcon/ws/client/target/findbugs.xml>
with 0 unique warnings and 0 duplicates.
[FINDBUGS] Successfully parsed file <https://builds.apache.org/job/Apache-falcon/ws/extensions/target/findbugs.xml>
with 0 unique warnings and 0 duplicates.
[FINDBUGS] Successfully parsed file <https://builds.apache.org/job/Apache-falcon/ws/hadoop-dependencies/target/findbugs.xml>
with 0 unique warnings and 0 duplicates.
[FINDBUGS] Successfully parsed file <https://builds.apache.org/job/Apache-falcon/ws/lifecycle/target/findbugs.xml>
with 0 unique warnings and 0 duplicates.
[FINDBUGS] Successfully parsed file <https://builds.apache.org/job/Apache-falcon/ws/messaging/target/findbugs.xml>
with 0 unique warnings and 0 duplicates.
[FINDBUGS] Successfully parsed file <https://builds.apache.org/job/Apache-falcon/ws/metrics/target/findbugs.xml>
with 0 unique warnings and 0 duplicates.
[FINDBUGS] Successfully parsed file <https://builds.apache.org/job/Apache-falcon/ws/oozie-el-extensions/target/findbugs.xml>
with 0 unique warnings and 0 duplicates.
[FINDBUGS] Successfully parsed file <https://builds.apache.org/job/Apache-falcon/ws/oozie/target/findbugs.xml>
with 0 unique warnings and 0 duplicates.
[FINDBUGS] Successfully parsed file <https://builds.apache.org/job/Apache-falcon/ws/prism/target/findbugs.xml>
with 0 unique warnings and 0 duplicates.
[FINDBUGS] Successfully parsed file <https://builds.apache.org/job/Apache-falcon/ws/replication/target/findbugs.xml>
with 0 unique warnings and 0 duplicates.
[FINDBUGS] Successfully parsed file <https://builds.apache.org/job/Apache-falcon/ws/rerun/target/findbugs.xml>
with 0 unique warnings and 0 duplicates.
[FINDBUGS] Successfully parsed file <https://builds.apache.org/job/Apache-falcon/ws/retention/target/findbugs.xml>
with 0 unique warnings and 0 duplicates.
[FINDBUGS] Successfully parsed file <https://builds.apache.org/job/Apache-falcon/ws/scheduler/target/findbugs.xml>
with 0 unique warnings and 0 duplicates.
[FINDBUGS] Successfully parsed file <https://builds.apache.org/job/Apache-falcon/ws/test-tools/hadoop-webapp/target/findbugs.xml>
with 0 unique warnings and 0 duplicates.
[FINDBUGS] Successfully parsed file <https://builds.apache.org/job/Apache-falcon/ws/test-util/target/findbugs.xml>
with 0 unique warnings and 0 duplicates.
[FINDBUGS] Successfully parsed file <https://builds.apache.org/job/Apache-falcon/ws/unit/target/findbugs.xml>
with 0 unique warnings and 0 duplicates.
[FINDBUGS] Computing warning deltas based on reference build #992
Archiving artifacts
Recording test results
TestNG Reports Processing: START
Looking for TestNG results report in workspace using pattern: **/target/testng-results.xml
Did not find any matching files.

Mime
View raw message