falcon-dev mailing list archives

Site index · List index
Message view « Date » · « Thread »
Top « Date » · « Thread »
From "Sowmya Ramesh (JIRA)" <j...@apache.org>
Subject [jira] [Created] (FALCON-1901) Intermittent IT test failures
Date Wed, 13 Apr 2016 19:05:25 GMT
Sowmya Ramesh created FALCON-1901:
-------------------------------------

             Summary: Intermittent IT test failures
                 Key: FALCON-1901
                 URL: https://issues.apache.org/jira/browse/FALCON-1901
             Project: Falcon
          Issue Type: Bug
            Reporter: Sowmya Ramesh
            Assignee: Sowmya Ramesh
             Fix For: trunk


{noformat}
Running org.apache.falcon.cli.FalconCLIIT
Tests run: 27, Failures: 19, Errors: 0, Skipped: 0, Time elapsed: 17.927 sec <<<
FAILURE! - in org.apache.falcon.cli.FalconCLIIT
testClientProperties(org.apache.falcon.cli.FalconCLIIT)  Time elapsed: 1.834 sec  <<<
FAILURE!
java.lang.AssertionError: expected:<0> but was:<-1>
at org.testng.Assert.fail(Assert.java:89)
at org.testng.Assert.failNotEquals(Assert.java:489)
at org.testng.Assert.assertEquals(Assert.java:118)
at org.testng.Assert.assertEquals(Assert.java:365)
at org.testng.Assert.assertEquals(Assert.java:375)
at org.apache.falcon.cli.FalconCLIIT.submitTestFiles(FalconCLIIT.java:974)
at org.apache.falcon.cli.FalconCLIIT.testClientProperties(FalconCLIIT.java:858)

testContinue(org.apache.falcon.cli.FalconCLIIT)  Time elapsed: 0.826 sec  <<< FAILURE!
java.lang.AssertionError: expected:<0> but was:<-1>
at org.testng.Assert.fail(Assert.java:89)
at org.testng.Assert.failNotEquals(Assert.java:489)
at org.testng.Assert.assertEquals(Assert.java:118)
at org.testng.Assert.assertEquals(Assert.java:365)
at org.testng.Assert.assertEquals(Assert.java:375)
at org.apache.falcon.cli.FalconCLIIT.submitTestFiles(FalconCLIIT.java:974)
at org.apache.falcon.cli.FalconCLIIT.testContinue(FalconCLIIT.java:796)

testDefinitionEntityValidCommands(org.apache.falcon.cli.FalconCLIIT)  Time elapsed: 0.748
sec  <<< FAILURE!
java.lang.AssertionError: expected:<0> but was:<-1>
at org.testng.Assert.fail(Assert.java:89)
at org.testng.Assert.failNotEquals(Assert.java:489)
at org.testng.Assert.assertEquals(Assert.java:118)
at org.testng.Assert.assertEquals(Assert.java:365)
at org.testng.Assert.assertEquals(Assert.java:375)
at org.apache.falcon.cli.FalconCLIIT.submitTestFiles(FalconCLIIT.java:974)
at org.apache.falcon.cli.FalconCLIIT.testDefinitionEntityValidCommands(FalconCLIIT.java:167)

testDeleteEntityValidCommands(org.apache.falcon.cli.FalconCLIIT)  Time elapsed: 0.706 sec
 <<< FAILURE!
java.lang.AssertionError: expected:<0> but was:<-1>
at org.testng.Assert.fail(Assert.java:89)
at org.testng.Assert.failNotEquals(Assert.java:489)
at org.testng.Assert.assertEquals(Assert.java:118)
at org.testng.Assert.assertEquals(Assert.java:365)
at org.testng.Assert.assertEquals(Assert.java:375)
at org.apache.falcon.cli.FalconCLIIT.submitTestFiles(FalconCLIIT.java:974)
at org.apache.falcon.cli.FalconCLIIT.testDeleteEntityValidCommands(FalconCLIIT.java:311)

testEntityLineage(org.apache.falcon.cli.FalconCLIIT)  Time elapsed: 0.757 sec  <<<
FAILURE!
java.lang.AssertionError: expected:<0> but was:<-1>
at org.testng.Assert.fail(Assert.java:89)
at org.testng.Assert.failNotEquals(Assert.java:489)
at org.testng.Assert.assertEquals(Assert.java:118)
at org.testng.Assert.assertEquals(Assert.java:365)
at org.testng.Assert.assertEquals(Assert.java:375)
at org.apache.falcon.cli.FalconCLIIT.testEntityLineage(FalconCLIIT.java:614)

testEntityPaginationFilterByCommands(org.apache.falcon.cli.FalconCLIIT)  Time elapsed: 1.258
sec  <<< FAILURE!
java.lang.AssertionError: expected:<0> but was:<-1>
at org.testng.Assert.fail(Assert.java:89)
at org.testng.Assert.failNotEquals(Assert.java:489)
at org.testng.Assert.assertEquals(Assert.java:118)
at org.testng.Assert.assertEquals(Assert.java:365)
at org.testng.Assert.assertEquals(Assert.java:375)
at org.apache.falcon.cli.FalconCLIIT.testEntityPaginationFilterByCommands(FalconCLIIT.java:642)

testInstanceGetLogs(org.apache.falcon.cli.FalconCLIIT)  Time elapsed: 0.681 sec  <<<
FAILURE!
java.lang.AssertionError: expected:<0> but was:<-1>
at org.testng.Assert.fail(Assert.java:89)
at org.testng.Assert.failNotEquals(Assert.java:489)
at org.testng.Assert.assertEquals(Assert.java:118)
at org.testng.Assert.assertEquals(Assert.java:365)
at org.testng.Assert.assertEquals(Assert.java:375)
at org.apache.falcon.cli.FalconCLIIT.submitTestFiles(FalconCLIIT.java:974)
at org.apache.falcon.cli.FalconCLIIT.testInstanceGetLogs(FalconCLIIT.java:890)

testInstanceKillAndRerun(org.apache.falcon.cli.FalconCLIIT)  Time elapsed: 0.665 sec  <<<
FAILURE!
java.lang.AssertionError: expected:<0> but was:<-1>
at org.testng.Assert.fail(Assert.java:89)
at org.testng.Assert.failNotEquals(Assert.java:489)
at org.testng.Assert.assertEquals(Assert.java:118)
at org.testng.Assert.assertEquals(Assert.java:365)
at org.testng.Assert.assertEquals(Assert.java:375)
at org.apache.falcon.cli.FalconCLIIT.submitTestFiles(FalconCLIIT.java:974)
at org.apache.falcon.cli.FalconCLIIT.testInstanceKillAndRerun(FalconCLIIT.java:565)

testInstanceRunningAndStatusCommands(org.apache.falcon.cli.FalconCLIIT)  Time elapsed: 0.668
sec  <<< FAILURE!
java.lang.AssertionError: expected:<0> but was:<-1>
at org.testng.Assert.fail(Assert.java:89)
at org.testng.Assert.failNotEquals(Assert.java:489)
at org.testng.Assert.assertEquals(Assert.java:118)
at org.testng.Assert.assertEquals(Assert.java:365)
at org.testng.Assert.assertEquals(Assert.java:375)
at org.apache.falcon.cli.FalconCLIIT.submitTestFiles(FalconCLIIT.java:974)
at org.apache.falcon.cli.FalconCLIIT.testInstanceRunningAndStatusCommands(FalconCLIIT.java:341)

testInstanceRunningAndSummaryCommands(org.apache.falcon.cli.FalconCLIIT)  Time elapsed: 0.696
sec  <<< FAILURE!
java.lang.AssertionError: expected:<0> but was:<-1>
at org.testng.Assert.fail(Assert.java:89)
at org.testng.Assert.failNotEquals(Assert.java:489)
at org.testng.Assert.assertEquals(Assert.java:118)
at org.testng.Assert.assertEquals(Assert.java:365)
at org.testng.Assert.assertEquals(Assert.java:375)
at org.apache.falcon.cli.FalconCLIIT.submitTestFiles(FalconCLIIT.java:974)
at org.apache.falcon.cli.FalconCLIIT.testInstanceRunningAndSummaryCommands(FalconCLIIT.java:486)

testInstanceSuspendAndResume(org.apache.falcon.cli.FalconCLIIT)  Time elapsed: 0.673 sec 
<<< FAILURE!
java.lang.AssertionError: expected:<0> but was:<-1>
at org.testng.Assert.fail(Assert.java:89)
at org.testng.Assert.failNotEquals(Assert.java:489)
at org.testng.Assert.assertEquals(Assert.java:118)
at org.testng.Assert.assertEquals(Assert.java:365)
at org.testng.Assert.assertEquals(Assert.java:375)
at org.apache.falcon.cli.FalconCLIIT.submitTestFiles(FalconCLIIT.java:974)
at org.apache.falcon.cli.FalconCLIIT.testInstanceSuspendAndResume(FalconCLIIT.java:526)

testMetadataListCommands(org.apache.falcon.cli.FalconCLIIT)  Time elapsed: 0.661 sec  <<<
FAILURE!
java.lang.AssertionError: expected:<0> but was:<-1>
at org.testng.Assert.fail(Assert.java:89)
at org.testng.Assert.failNotEquals(Assert.java:489)
at org.testng.Assert.assertEquals(Assert.java:118)
at org.testng.Assert.assertEquals(Assert.java:365)
at org.testng.Assert.assertEquals(Assert.java:375)
at org.apache.falcon.cli.FalconCLIIT.submitTestFiles(FalconCLIIT.java:974)
at org.apache.falcon.cli.FalconCLIIT.testMetadataListCommands(FalconCLIIT.java:710)

testMetadataRelationsCommands(org.apache.falcon.cli.FalconCLIIT)  Time elapsed: 0.673 sec
 <<< FAILURE!
java.lang.AssertionError: expected:<0> but was:<-1>
at org.testng.Assert.fail(Assert.java:89)
at org.testng.Assert.failNotEquals(Assert.java:489)
at org.testng.Assert.assertEquals(Assert.java:118)
at org.testng.Assert.assertEquals(Assert.java:365)
at org.testng.Assert.assertEquals(Assert.java:375)
at org.apache.falcon.cli.FalconCLIIT.submitTestFiles(FalconCLIIT.java:974)
at org.apache.falcon.cli.FalconCLIIT.testMetadataRelationsCommands(FalconCLIIT.java:754)

testScheduleEntityValidCommands(org.apache.falcon.cli.FalconCLIIT)  Time elapsed: 0.649 sec
 <<< FAILURE!
java.lang.AssertionError: expected:<0> but was:<-1>
at org.testng.Assert.fail(Assert.java:89)
at org.testng.Assert.failNotEquals(Assert.java:489)
at org.testng.Assert.assertEquals(Assert.java:118)
at org.testng.Assert.assertEquals(Assert.java:365)
at org.testng.Assert.assertEquals(Assert.java:375)
at org.apache.falcon.cli.FalconCLIIT.submitTestFiles(FalconCLIIT.java:974)
at org.apache.falcon.cli.FalconCLIIT.testScheduleEntityValidCommands(FalconCLIIT.java:184)

testSkipDryRunValidCommands(org.apache.falcon.cli.FalconCLIIT)  Time elapsed: 0.636 sec  <<<
FAILURE!
java.lang.AssertionError: expected:<0> but was:<-1>
at org.testng.Assert.fail(Assert.java:89)
at org.testng.Assert.failNotEquals(Assert.java:489)
at org.testng.Assert.assertEquals(Assert.java:118)
at org.testng.Assert.assertEquals(Assert.java:365)
at org.testng.Assert.assertEquals(Assert.java:375)
at org.apache.falcon.cli.FalconCLIIT.submitTestFiles(FalconCLIIT.java:974)
at org.apache.falcon.cli.FalconCLIIT.testSkipDryRunValidCommands(FalconCLIIT.java:201)

testSubmitAndScheduleEntityValidCommands(org.apache.falcon.cli.FalconCLIIT)  Time elapsed:
0.761 sec  <<< FAILURE!
java.lang.AssertionError: expected:<0> but was:<-1>
at org.testng.Assert.fail(Assert.java:89)
at org.testng.Assert.failNotEquals(Assert.java:489)
at org.testng.Assert.assertEquals(Assert.java:118)
at org.testng.Assert.assertEquals(Assert.java:365)
at org.testng.Assert.assertEquals(Assert.java:375)
at org.apache.falcon.cli.FalconCLIIT.testSubmitAndScheduleEntityValidCommands(FalconCLIIT.java:115)

testSubmitEntityValidCommands(org.apache.falcon.cli.FalconCLIIT)  Time elapsed: 0.642 sec
 <<< FAILURE!
java.lang.AssertionError: expected:<0> but was:<-1>
at org.testng.Assert.fail(Assert.java:89)
at org.testng.Assert.failNotEquals(Assert.java:489)
at org.testng.Assert.assertEquals(Assert.java:118)
at org.testng.Assert.assertEquals(Assert.java:365)
at org.testng.Assert.assertEquals(Assert.java:375)
at org.apache.falcon.cli.FalconCLIIT.testSubmitEntityValidCommands(FalconCLIIT.java:67)

testSuspendResumeStatusEntityValidCommands(org.apache.falcon.cli.FalconCLIIT)  Time elapsed:
0.616 sec  <<< FAILURE!
java.lang.AssertionError: expected:<0> but was:<-1>
at org.testng.Assert.fail(Assert.java:89)
at org.testng.Assert.failNotEquals(Assert.java:489)
at org.testng.Assert.assertEquals(Assert.java:118)
at org.testng.Assert.assertEquals(Assert.java:365)
at org.testng.Assert.assertEquals(Assert.java:375)
at org.apache.falcon.cli.FalconCLIIT.submitTestFiles(FalconCLIIT.java:974)
at org.apache.falcon.cli.FalconCLIIT.testSuspendResumeStatusEntityValidCommands(FalconCLIIT.java:229)

testValidateValidCommands(org.apache.falcon.cli.FalconCLIIT)  Time elapsed: 0.936 sec  <<<
FAILURE!
java.lang.AssertionError: expected:<0> but was:<-1>
at org.testng.Assert.fail(Assert.java:89)
at org.testng.Assert.failNotEquals(Assert.java:489)
at org.testng.Assert.assertEquals(Assert.java:118)
at org.testng.Assert.assertEquals(Assert.java:365)
at org.testng.Assert.assertEquals(Assert.java:375)
at org.apache.falcon.cli.FalconCLIIT.testValidateValidCommands(FalconCLIIT.java:146)

Running org.apache.falcon.cli.FalconCLISmokeIT
Tests run: 1, Failures: 1, Errors: 0, Skipped: 0, Time elapsed: 3.604 sec <<< FAILURE!
- in org.apache.falcon.cli.FalconCLISmokeIT
testSubmitAndScheduleEntityValidCommands(org.apache.falcon.cli.FalconCLISmokeIT)  Time elapsed:
1.896 sec  <<< FAILURE!
java.lang.AssertionError: expected:<0> but was:<-1>
at org.testng.Assert.fail(Assert.java:89)
at org.testng.Assert.failNotEquals(Assert.java:489)
at org.testng.Assert.assertEquals(Assert.java:118)
at org.testng.Assert.assertEquals(Assert.java:365)
at org.testng.Assert.assertEquals(Assert.java:375)
at org.apache.falcon.cli.FalconCLISmokeIT.testSubmitAndScheduleEntityValidCommands(FalconCLISmokeIT.java:64)

Running org.apache.falcon.late.LateDataHandlerIT
Tests run: 2, Failures: 0, Errors: 0, Skipped: 0, Time elapsed: 5.61 sec - in org.apache.falcon.late.LateDataHandlerIT
Running org.apache.falcon.lifecycle.FeedExportIT
Tests run: 2, Failures: 1, Errors: 0, Skipped: 0, Time elapsed: 3.571 sec <<< FAILURE!
- in org.apache.falcon.lifecycle.FeedExportIT
testSqoopExport(org.apache.falcon.lifecycle.FeedExportIT)  Time elapsed: 1.324 sec  <<<
FAILURE!
junit.framework.AssertionFailedError: expected:<-1> but was:<0>
at junit.framework.Assert.fail(Assert.java:47)
at junit.framework.Assert.failNotEquals(Assert.java:282)
at junit.framework.Assert.assertEquals(Assert.java:64)
at junit.framework.Assert.assertEquals(Assert.java:201)
at junit.framework.Assert.assertEquals(Assert.java:207)
at org.apache.falcon.lifecycle.FeedExportIT.testSqoopExport(FeedExportIT.java:98)

Running org.apache.falcon.lifecycle.FeedImportIT
Tests run: 7, Failures: 6, Errors: 0, Skipped: 0, Time elapsed: 7.463 sec <<< FAILURE!
- in org.apache.falcon.lifecycle.FeedImportIT
testSqoopHCatImport(org.apache.falcon.lifecycle.FeedImportIT)  Time elapsed: 1.313 sec  <<<
FAILURE!
junit.framework.AssertionFailedError: expected:<-1> but was:<0>
at junit.framework.Assert.fail(Assert.java:47)
at junit.framework.Assert.failNotEquals(Assert.java:282)
at junit.framework.Assert.assertEquals(Assert.java:64)
at junit.framework.Assert.assertEquals(Assert.java:201)
at junit.framework.Assert.assertEquals(Assert.java:207)
at org.apache.falcon.lifecycle.FeedImportIT.testSqoopHCatImport(FeedImportIT.java:263)

testSqoopImport(org.apache.falcon.lifecycle.FeedImportIT)  Time elapsed: 0.752 sec  <<<
FAILURE!
junit.framework.AssertionFailedError: expected:<-1> but was:<0>
at junit.framework.Assert.fail(Assert.java:47)
at junit.framework.Assert.failNotEquals(Assert.java:282)
at junit.framework.Assert.assertEquals(Assert.java:64)
at junit.framework.Assert.assertEquals(Assert.java:201)
at junit.framework.Assert.assertEquals(Assert.java:207)
at org.apache.falcon.lifecycle.FeedImportIT.testSqoopImport(FeedImportIT.java:106)

testSqoopImport2(org.apache.falcon.lifecycle.FeedImportIT)  Time elapsed: 0.783 sec  <<<
FAILURE!
junit.framework.AssertionFailedError: expected:<-1> but was:<0>
at junit.framework.Assert.fail(Assert.java:47)
at junit.framework.Assert.failNotEquals(Assert.java:282)
at junit.framework.Assert.assertEquals(Assert.java:64)
at junit.framework.Assert.assertEquals(Assert.java:201)
at junit.framework.Assert.assertEquals(Assert.java:207)
at org.apache.falcon.lifecycle.FeedImportIT.testSqoopImport2(FeedImportIT.java:159)

testSqoopImport3(org.apache.falcon.lifecycle.FeedImportIT)  Time elapsed: 0.736 sec  <<<
FAILURE!
junit.framework.AssertionFailedError: expected:<-1> but was:<0>
at junit.framework.Assert.fail(Assert.java:47)
at junit.framework.Assert.failNotEquals(Assert.java:282)
at junit.framework.Assert.assertEquals(Assert.java:64)
at junit.framework.Assert.assertEquals(Assert.java:201)
at junit.framework.Assert.assertEquals(Assert.java:207)
at org.apache.falcon.lifecycle.FeedImportIT.testSqoopImport3(FeedImportIT.java:199)

testSqoopImportDeleteDatasource(org.apache.falcon.lifecycle.FeedImportIT)  Time elapsed: 0.725
sec  <<< FAILURE!
junit.framework.AssertionFailedError: expected:<-1> but was:<0>
at junit.framework.Assert.fail(Assert.java:47)
at junit.framework.Assert.failNotEquals(Assert.java:282)
at junit.framework.Assert.assertEquals(Assert.java:64)
at junit.framework.Assert.assertEquals(Assert.java:201)
at junit.framework.Assert.assertEquals(Assert.java:207)
at org.apache.falcon.lifecycle.FeedImportIT.testSqoopImportDeleteDatasource(FeedImportIT.java:128)

testSqoopImportUsingDefaultCredential(org.apache.falcon.lifecycle.FeedImportIT)  Time elapsed:
0.73 sec  <<< FAILURE!
junit.framework.AssertionFailedError: expected:<-1> but was:<0>
at junit.framework.Assert.fail(Assert.java:47)
at junit.framework.Assert.failNotEquals(Assert.java:282)
at junit.framework.Assert.assertEquals(Assert.java:64)
at junit.framework.Assert.assertEquals(Assert.java:201)
at junit.framework.Assert.assertEquals(Assert.java:207)
at org.apache.falcon.lifecycle.FeedImportIT.testSqoopImportUsingDefaultCredential(FeedImportIT.java:240)

Running org.apache.falcon.lifecycle.FileSystemFeedReplicationIT
Tests run: 0, Failures: 0, Errors: 0, Skipped: 0, Time elapsed: 2.49 sec - in org.apache.falcon.lifecycle.FileSystemFeedReplicationIT
Running org.apache.falcon.lifecycle.TableStorageFeedEvictorIT
Tests run: 20, Failures: 0, Errors: 0, Skipped: 0, Time elapsed: 18.129 sec - in org.apache.falcon.lifecycle.TableStorageFeedEvictorIT
Running org.apache.falcon.lifecycle.TableStorageFeedReplicationIT
Tests run: 0, Failures: 0, Errors: 0, Skipped: 0, Time elapsed: 1.761 sec - in org.apache.falcon.lifecycle.TableStorageFeedReplicationIT
Running org.apache.falcon.process.PigProcessIT
Tests run: 0, Failures: 0, Errors: 0, Skipped: 0, Time elapsed: 1.537 sec - in org.apache.falcon.process.PigProcessIT
Running org.apache.falcon.process.TableStorageProcessIT
Tests run: 0, Failures: 0, Errors: 0, Skipped: 0, Time elapsed: 1.478 sec - in org.apache.falcon.process.TableStorageProcessIT
Running org.apache.falcon.resource.AbstractSchedulerManagerJerseyIT
Tests run: 0, Failures: 0, Errors: 0, Skipped: 0, Time elapsed: 0.574 sec - in org.apache.falcon.resource.AbstractSchedulerManagerJerseyIT
Running org.apache.falcon.resource.EntityManagerJerseyIT
Tests run: 28, Failures: 22, Errors: 0, Skipped: 0, Time elapsed: 15.272 sec <<<
FAILURE! - in org.apache.falcon.resource.EntityManagerJerseyIT
testClusterSubmitScheduleSuspendResumeDelete(org.apache.falcon.resource.EntityManagerJerseyIT)
 Time elapsed: 0.642 sec  <<< FAILURE!
java.lang.ExceptionInInitializerError: null
at org.apache.falcon.extensions.store.ExtensionStore.<init>(ExtensionStore.java:70)
at org.apache.falcon.extensions.store.ExtensionStore.<clinit>(ExtensionStore.java:61)
at org.apache.falcon.service.SharedLibraryHostingService.pushExtensionArtifactsToCluster(SharedLibraryHostingService.java:86)
at org.apache.falcon.service.SharedLibraryHostingService.onAdd(SharedLibraryHostingService.java:236)
at org.apache.falcon.entity.store.ConfigurationStore.onAdd(ConfigurationStore.java:274)
at org.apache.falcon.entity.store.ConfigurationStore.publish(ConfigurationStore.java:229)
at org.apache.falcon.resource.AbstractEntityManager.submitInternal(AbstractEntityManager.java:444)
at org.apache.falcon.unit.LocalSchedulableEntityManager.submit(LocalSchedulableEntityManager.java:73)
at org.apache.falcon.unit.FalconUnitClient.submit(FalconUnitClient.java:102)
at org.apache.falcon.unit.FalconUnitTestBase.submit(FalconUnitTestBase.java:161)
at org.apache.falcon.unit.FalconUnitTestBase.submit(FalconUnitTestBase.java:157)
at org.apache.falcon.resource.AbstractSchedulerManagerJerseyIT.submitCluster(AbstractSchedulerManagerJerseyIT.java:146)
at org.apache.falcon.resource.EntityManagerJerseyIT.testClusterSubmitScheduleSuspendResumeDelete(EntityManagerJerseyIT.java:495)

testDelete(org.apache.falcon.resource.EntityManagerJerseyIT)  Time elapsed: 0.251 sec  <<<
FAILURE!
java.lang.NoClassDefFoundError: Could not initialize class org.apache.falcon.extensions.store.ExtensionStore
at org.apache.falcon.service.SharedLibraryHostingService.pushExtensionArtifactsToCluster(SharedLibraryHostingService.java:86)
at org.apache.falcon.service.SharedLibraryHostingService.onAdd(SharedLibraryHostingService.java:236)
at org.apache.falcon.entity.store.ConfigurationStore.onAdd(ConfigurationStore.java:274)
at org.apache.falcon.entity.store.ConfigurationStore.publish(ConfigurationStore.java:229)
at org.apache.falcon.resource.AbstractEntityManager.submitInternal(AbstractEntityManager.java:444)
at org.apache.falcon.unit.LocalSchedulableEntityManager.submit(LocalSchedulableEntityManager.java:73)
at org.apache.falcon.unit.FalconUnitClient.submit(FalconUnitClient.java:102)
at org.apache.falcon.unit.FalconUnitTestBase.submit(FalconUnitTestBase.java:161)
at org.apache.falcon.unit.FalconUnitTestBase.submit(FalconUnitTestBase.java:157)
at org.apache.falcon.resource.AbstractSchedulerManagerJerseyIT.submitCluster(AbstractSchedulerManagerJerseyIT.java:146)
at org.apache.falcon.resource.EntityManagerJerseyIT.testDelete(EntityManagerJerseyIT.java:697)

testDeleteDataSet(org.apache.falcon.resource.EntityManagerJerseyIT)  Time elapsed: 0.256 sec
 <<< FAILURE!
java.lang.NoClassDefFoundError: Could not initialize class org.apache.falcon.extensions.store.ExtensionStore
at org.apache.falcon.service.SharedLibraryHostingService.pushExtensionArtifactsToCluster(SharedLibraryHostingService.java:86)
at org.apache.falcon.service.SharedLibraryHostingService.onAdd(SharedLibraryHostingService.java:236)
at org.apache.falcon.entity.store.ConfigurationStore.onAdd(ConfigurationStore.java:274)
at org.apache.falcon.entity.store.ConfigurationStore.publish(ConfigurationStore.java:229)
at org.apache.falcon.resource.AbstractEntityManager.submitInternal(AbstractEntityManager.java:444)
at org.apache.falcon.unit.LocalSchedulableEntityManager.submit(LocalSchedulableEntityManager.java:73)
at org.apache.falcon.unit.FalconUnitClient.submit(FalconUnitClient.java:102)
at org.apache.falcon.unit.FalconUnitTestBase.submit(FalconUnitTestBase.java:161)
at org.apache.falcon.unit.FalconUnitTestBase.submit(FalconUnitTestBase.java:157)
at org.apache.falcon.resource.AbstractSchedulerManagerJerseyIT.submitCluster(AbstractSchedulerManagerJerseyIT.java:146)
at org.apache.falcon.resource.EntityManagerJerseyIT.testDeleteDataSet(EntityManagerJerseyIT.java:684)

testDryRun(org.apache.falcon.resource.EntityManagerJerseyIT)  Time elapsed: 0.332 sec  <<<
FAILURE!
java.lang.NoClassDefFoundError: Could not initialize class org.apache.falcon.extensions.store.ExtensionStore
at org.apache.falcon.service.SharedLibraryHostingService.pushExtensionArtifactsToCluster(SharedLibraryHostingService.java:86)
at org.apache.falcon.service.SharedLibraryHostingService.onAdd(SharedLibraryHostingService.java:236)
at org.apache.falcon.entity.store.ConfigurationStore.onAdd(ConfigurationStore.java:274)
at org.apache.falcon.entity.store.ConfigurationStore.publish(ConfigurationStore.java:229)
at org.apache.falcon.resource.AbstractEntityManager.submitInternal(AbstractEntityManager.java:444)
at org.apache.falcon.unit.LocalSchedulableEntityManager.submit(LocalSchedulableEntityManager.java:73)
at org.apache.falcon.unit.FalconUnitClient.submit(FalconUnitClient.java:102)
at org.apache.falcon.unit.FalconUnitTestBase.submit(FalconUnitTestBase.java:161)
at org.apache.falcon.unit.FalconUnitTestBase.submit(FalconUnitTestBase.java:157)
at org.apache.falcon.resource.AbstractSchedulerManagerJerseyIT.submitCluster(AbstractSchedulerManagerJerseyIT.java:146)
at org.apache.falcon.resource.AbstractSchedulerManagerJerseyIT.schedule(AbstractSchedulerManagerJerseyIT.java:180)
at org.apache.falcon.resource.EntityManagerJerseyIT.testDryRun(EntityManagerJerseyIT.java:225)

testDuplicateDeleteCommands(org.apache.falcon.resource.EntityManagerJerseyIT)  Time elapsed:
0.246 sec  <<< FAILURE!
java.lang.NoClassDefFoundError: Could not initialize class org.apache.falcon.extensions.store.ExtensionStore
at org.apache.falcon.service.SharedLibraryHostingService.pushExtensionArtifactsToCluster(SharedLibraryHostingService.java:86)
at org.apache.falcon.service.SharedLibraryHostingService.onAdd(SharedLibraryHostingService.java:236)
at org.apache.falcon.entity.store.ConfigurationStore.onAdd(ConfigurationStore.java:274)
at org.apache.falcon.entity.store.ConfigurationStore.publish(ConfigurationStore.java:229)
at org.apache.falcon.resource.AbstractEntityManager.submitInternal(AbstractEntityManager.java:444)
at org.apache.falcon.unit.LocalSchedulableEntityManager.submit(LocalSchedulableEntityManager.java:73)
at org.apache.falcon.unit.FalconUnitClient.submit(FalconUnitClient.java:102)
at org.apache.falcon.unit.FalconUnitTestBase.submit(FalconUnitTestBase.java:161)
at org.apache.falcon.unit.FalconUnitTestBase.submit(FalconUnitTestBase.java:157)
at org.apache.falcon.resource.AbstractSchedulerManagerJerseyIT.submitCluster(AbstractSchedulerManagerJerseyIT.java:146)
at org.apache.falcon.resource.EntityManagerJerseyIT.testDuplicateDeleteCommands(EntityManagerJerseyIT.java:561)

testDuplicateSubmitCommands(org.apache.falcon.resource.EntityManagerJerseyIT)  Time elapsed:
0.238 sec  <<< FAILURE!
java.lang.NoClassDefFoundError: Could not initialize class org.apache.falcon.extensions.store.ExtensionStore
at org.apache.falcon.service.SharedLibraryHostingService.pushExtensionArtifactsToCluster(SharedLibraryHostingService.java:86)
at org.apache.falcon.service.SharedLibraryHostingService.onAdd(SharedLibraryHostingService.java:236)
at org.apache.falcon.entity.store.ConfigurationStore.onAdd(ConfigurationStore.java:274)
at org.apache.falcon.entity.store.ConfigurationStore.publish(ConfigurationStore.java:229)
at org.apache.falcon.resource.AbstractEntityManager.submitInternal(AbstractEntityManager.java:444)
at org.apache.falcon.unit.LocalSchedulableEntityManager.submit(LocalSchedulableEntityManager.java:73)
at org.apache.falcon.unit.FalconUnitClient.submit(FalconUnitClient.java:102)
at org.apache.falcon.unit.FalconUnitTestBase.submit(FalconUnitTestBase.java:161)
at org.apache.falcon.unit.FalconUnitTestBase.submit(FalconUnitTestBase.java:157)
at org.apache.falcon.resource.AbstractSchedulerManagerJerseyIT.submitCluster(AbstractSchedulerManagerJerseyIT.java:146)
at org.apache.falcon.resource.EntityManagerJerseyIT.testDuplicateSubmitCommands(EntityManagerJerseyIT.java:539)

testDuplicateUpdateCommands(org.apache.falcon.resource.EntityManagerJerseyIT)  Time elapsed:
0.242 sec  <<< FAILURE!
java.lang.NoClassDefFoundError: Could not initialize class org.apache.falcon.extensions.store.ExtensionStore
at org.apache.falcon.service.SharedLibraryHostingService.pushExtensionArtifactsToCluster(SharedLibraryHostingService.java:86)
at org.apache.falcon.service.SharedLibraryHostingService.onAdd(SharedLibraryHostingService.java:236)
at org.apache.falcon.entity.store.ConfigurationStore.onAdd(ConfigurationStore.java:274)
at org.apache.falcon.entity.store.ConfigurationStore.publish(ConfigurationStore.java:229)
at org.apache.falcon.resource.AbstractEntityManager.submitInternal(AbstractEntityManager.java:444)
at org.apache.falcon.unit.LocalSchedulableEntityManager.submit(LocalSchedulableEntityManager.java:73)
at org.apache.falcon.unit.FalconUnitClient.submit(FalconUnitClient.java:102)
at org.apache.falcon.unit.FalconUnitTestBase.submit(FalconUnitTestBase.java:161)
at org.apache.falcon.unit.FalconUnitTestBase.submit(FalconUnitTestBase.java:157)
at org.apache.falcon.resource.AbstractSchedulerManagerJerseyIT.submitCluster(AbstractSchedulerManagerJerseyIT.java:146)
at org.apache.falcon.resource.AbstractSchedulerManagerJerseyIT.schedule(AbstractSchedulerManagerJerseyIT.java:180)
at org.apache.falcon.resource.EntityManagerJerseyIT.testDuplicateUpdateCommands(EntityManagerJerseyIT.java:772)

testFeedSchedule(org.apache.falcon.resource.EntityManagerJerseyIT)  Time elapsed: 0.255 sec
 <<< FAILURE!
java.lang.NoClassDefFoundError: Could not initialize class org.apache.falcon.extensions.store.ExtensionStore
at org.apache.falcon.service.SharedLibraryHostingService.pushExtensionArtifactsToCluster(SharedLibraryHostingService.java:86)
at org.apache.falcon.service.SharedLibraryHostingService.onAdd(SharedLibraryHostingService.java:236)
at org.apache.falcon.entity.store.ConfigurationStore.onAdd(ConfigurationStore.java:274)
at org.apache.falcon.entity.store.ConfigurationStore.publish(ConfigurationStore.java:229)
at org.apache.falcon.resource.AbstractEntityManager.submitInternal(AbstractEntityManager.java:444)
at org.apache.falcon.unit.LocalSchedulableEntityManager.submit(LocalSchedulableEntityManager.java:73)
at org.apache.falcon.unit.FalconUnitClient.submit(FalconUnitClient.java:102)
at org.apache.falcon.unit.FalconUnitTestBase.submit(FalconUnitTestBase.java:161)
at org.apache.falcon.unit.FalconUnitTestBase.submit(FalconUnitTestBase.java:157)
at org.apache.falcon.resource.AbstractSchedulerManagerJerseyIT.submitCluster(AbstractSchedulerManagerJerseyIT.java:146)
at org.apache.falcon.resource.EntityManagerJerseyIT.testFeedSchedule(EntityManagerJerseyIT.java:669)

testGetEntityDefinition(org.apache.falcon.resource.EntityManagerJerseyIT)  Time elapsed: 0.233
sec  <<< FAILURE!
java.lang.NoClassDefFoundError: Could not initialize class org.apache.falcon.extensions.store.ExtensionStore
at org.apache.falcon.service.SharedLibraryHostingService.pushExtensionArtifactsToCluster(SharedLibraryHostingService.java:86)
at org.apache.falcon.service.SharedLibraryHostingService.onAdd(SharedLibraryHostingService.java:236)
at org.apache.falcon.entity.store.ConfigurationStore.onAdd(ConfigurationStore.java:274)
at org.apache.falcon.entity.store.ConfigurationStore.publish(ConfigurationStore.java:229)
at org.apache.falcon.resource.AbstractEntityManager.submitInternal(AbstractEntityManager.java:444)
at org.apache.falcon.unit.LocalSchedulableEntityManager.submit(LocalSchedulableEntityManager.java:73)
at org.apache.falcon.unit.FalconUnitClient.submit(FalconUnitClient.java:102)
at org.apache.falcon.unit.FalconUnitTestBase.submit(FalconUnitTestBase.java:161)
at org.apache.falcon.unit.FalconUnitTestBase.submit(FalconUnitTestBase.java:157)
at org.apache.falcon.resource.AbstractSchedulerManagerJerseyIT.submitCluster(AbstractSchedulerManagerJerseyIT.java:146)
at org.apache.falcon.resource.EntityManagerJerseyIT.testGetEntityDefinition(EntityManagerJerseyIT.java:622)

testIdempotentSubmit(org.apache.falcon.resource.EntityManagerJerseyIT)  Time elapsed: 0.231
sec  <<< FAILURE!
java.lang.NoClassDefFoundError: Could not initialize class org.apache.falcon.extensions.store.ExtensionStore
at org.apache.falcon.service.SharedLibraryHostingService.pushExtensionArtifactsToCluster(SharedLibraryHostingService.java:86)
at org.apache.falcon.service.SharedLibraryHostingService.onAdd(SharedLibraryHostingService.java:236)
at org.apache.falcon.entity.store.ConfigurationStore.onAdd(ConfigurationStore.java:274)
at org.apache.falcon.entity.store.ConfigurationStore.publish(ConfigurationStore.java:229)
at org.apache.falcon.resource.AbstractEntityManager.submitInternal(AbstractEntityManager.java:444)
at org.apache.falcon.unit.LocalSchedulableEntityManager.submit(LocalSchedulableEntityManager.java:73)
at org.apache.falcon.unit.FalconUnitClient.submit(FalconUnitClient.java:102)
at org.apache.falcon.unit.FalconUnitTestBase.submit(FalconUnitTestBase.java:161)
at org.apache.falcon.unit.FalconUnitTestBase.submit(FalconUnitTestBase.java:157)
at org.apache.falcon.resource.AbstractSchedulerManagerJerseyIT.submitCluster(AbstractSchedulerManagerJerseyIT.java:146)
at org.apache.falcon.resource.EntityManagerJerseyIT.testIdempotentSubmit(EntityManagerJerseyIT.java:428)
{noformat}



--
This message was sent by Atlassian JIRA
(v6.3.4#6332)

Mime
View raw message