falcon-dev mailing list archives

Site index · List index
Message view « Date » · « Thread »
Top « Date » · « Thread »
From Apache Jenkins Server <jenk...@builds.apache.org>
Subject Build failed in Jenkins: Apache-falcon #965
Date Wed, 06 Apr 2016 23:00:51 GMT
See <https://builds.apache.org/job/Apache-falcon/965/changes>

Changes:

[bvellanki] FALCON-1881 Database export does not require fields tag in entity

[bvellanki] FALCON-1880 To support TDE encryption, add --skipcrccheck to distcp

------------------------------------------
[...truncated 3030 lines...]
[INFO] Exclude: **/target/**
[INFO] Exclude: **/activemq-data/**
[INFO] Exclude: **/build/**
[INFO] Exclude: **/*.patch
[INFO] Exclude: derby.log
[INFO] Exclude: **/logs/**
[INFO] Exclude: **/.classpath
[INFO] Exclude: **/.project
[INFO] Exclude: **/.settings/**
[INFO] Exclude: **/test-output/**
[INFO] Exclude: **/data.txt
[INFO] Exclude: **/maven-eclipse.xml
[INFO] Exclude: **/.externalToolBuilders/**
[INFO] Exclude: html5-ui/**
[INFO] Exclude: **/metastore_db/**
[INFO] Exclude: **/db1.log
[INFO] Exclude: **/db1.properties
[INFO] Exclude: **/db1.script
[INFO] Exclude: **/credential_provider.jceks
[INFO] 
[INFO] --- maven-checkstyle-plugin:2.9.1:check (checkstyle-check) @ falcon-oozie-adaptor ---
[INFO] Starting audit...
Audit done.

[INFO] 
[INFO] >>> findbugs-maven-plugin:3.0.3:check (findbugs-check) @ falcon-oozie-adaptor
>>>
[INFO] 
[INFO] --- findbugs-maven-plugin:3.0.3:findbugs (findbugs) @ falcon-oozie-adaptor ---
[INFO] Fork Value is true
[INFO] Done FindBugs Analysis....
[INFO] 
[INFO] <<< findbugs-maven-plugin:3.0.3:check (findbugs-check) @ falcon-oozie-adaptor
<<<
[INFO] 
[INFO] --- findbugs-maven-plugin:3.0.3:check (findbugs-check) @ falcon-oozie-adaptor ---
[INFO] BugInstance size is 0
[INFO] Error size is 0
[INFO] No errors/warnings found
[INFO]                                                                         
[INFO] ------------------------------------------------------------------------
[INFO] Building Apache Falcon Scheduler 0.10-SNAPSHOT
[INFO] ------------------------------------------------------------------------
[INFO] 
[INFO] --- maven-clean-plugin:2.5:clean (default-clean) @ falcon-scheduler ---
[INFO] Deleting <https://builds.apache.org/job/Apache-falcon/ws/scheduler/target>
[INFO] 
[INFO] --- maven-enforcer-plugin:1.3.1:enforce (enforce-property) @ falcon-scheduler ---
[INFO] 
[INFO] --- buildnumber-maven-plugin:1.0:create (default) @ falcon-scheduler ---
[INFO] Checking for local modifications: skipped.
[INFO] Updating project files from SCM: skipped.
[INFO] Executing: /bin/sh -c cd <https://builds.apache.org/job/Apache-falcon/ws/scheduler>
&& git show
[INFO] Working directory: <https://builds.apache.org/job/Apache-falcon/ws/scheduler>
[INFO] Storing buildNumber: c404da28cc5eeefa158ea5a2aca38b4b2cf731ee at timestamp: 1459983345580
[INFO] Executing: /bin/sh -c cd <https://builds.apache.org/job/Apache-falcon/ws/scheduler>
&& git show
[INFO] Working directory: <https://builds.apache.org/job/Apache-falcon/ws/scheduler>
[INFO] Storing buildScmBranch: UNKNOWN
[INFO] 
[INFO] --- maven-dependency-plugin:2.8:copy (copy-dependencies) @ falcon-scheduler ---
[INFO] Configured Artifact: org.apache.derby:derby:?:jar
[INFO] Configured Artifact: commons-dbcp:commons-dbcp:?:jar
[INFO] Configured Artifact: postgresql:postgresql:?:jar
[INFO] Copying derby-10.10.1.1.jar to <https://builds.apache.org/job/Apache-falcon/ws/scheduler/target/dependency/derby-10.10.1.1.jar>
[INFO] Copying commons-dbcp-1.4.jar to <https://builds.apache.org/job/Apache-falcon/ws/scheduler/target/dependency/commons-dbcp-1.4.jar>
[INFO] Copying postgresql-9.1-901-1.jdbc4.jar to <https://builds.apache.org/job/Apache-falcon/ws/scheduler/target/dependency/postgresql-9.1-901-1.jdbc4.jar>
[INFO] 
[INFO] --- maven-remote-resources-plugin:1.5:process (default) @ falcon-scheduler ---
[INFO] 
[INFO] --- maven-resources-plugin:2.7:resources (default-resources) @ falcon-scheduler ---
[INFO] Using 'UTF-8' encoding to copy filtered resources.
[INFO] Copying 1 resource
[INFO] Copying 0 resource
[INFO] Copying 0 resource
[INFO] Copying 2 resources to META-INF
[INFO] Copying 3 resources
[INFO] 
[INFO] --- maven-compiler-plugin:2.3.2:compile (default-compile) @ falcon-scheduler ---
[INFO] Compiling 51 source files to <https://builds.apache.org/job/Apache-falcon/ws/scheduler/target/classes>
[INFO] 
[INFO] --- maven-resources-plugin:2.7:testResources (default-testResources) @ falcon-scheduler
---
[INFO] Using 'UTF-8' encoding to copy filtered resources.
[INFO] Copying 6 resources
[INFO] Copying 3 resources
[INFO] 
[INFO] --- maven-compiler-plugin:2.3.2:testCompile (default-testCompile) @ falcon-scheduler
---
[INFO] Compiling 14 source files to <https://builds.apache.org/job/Apache-falcon/ws/scheduler/target/test-classes>
[INFO] 
[INFO] --- maven-surefire-plugin:2.16:test (default-test) @ falcon-scheduler ---
[WARNING] The parameter forkMode is deprecated since version 2.14. Use forkCount and reuseForks
instead.
[INFO] Surefire report directory: <https://builds.apache.org/job/Apache-falcon/ws/scheduler/target/surefire-reports>

-------------------------------------------------------
 T E S T S
-------------------------------------------------------

-------------------------------------------------------
 T E S T S
-------------------------------------------------------
Running org.apache.falcon.execution.SchedulerUtilTest
Tests run: 4, Failures: 0, Errors: 0, Skipped: 0, Time elapsed: 3.489 sec - in org.apache.falcon.execution.SchedulerUtilTest
Running org.apache.falcon.execution.FalconExecutionServiceTest
Tests run: 9, Failures: 0, Errors: 0, Skipped: 0, Time elapsed: 49.383 sec - in org.apache.falcon.execution.FalconExecutionServiceTest
Running org.apache.falcon.tools.TestFalconStateStoreDBCLI
Tests run: 1, Failures: 0, Errors: 0, Skipped: 0, Time elapsed: 22.928 sec - in org.apache.falcon.tools.TestFalconStateStoreDBCLI
Running org.apache.falcon.predicate.PredicateTest
Tests run: 2, Failures: 0, Errors: 0, Skipped: 0, Time elapsed: 4.937 sec - in org.apache.falcon.predicate.PredicateTest
Running org.apache.falcon.state.EntityStateServiceTest
Tests run: 5, Failures: 0, Errors: 0, Skipped: 0, Time elapsed: 10.158 sec - in org.apache.falcon.state.EntityStateServiceTest
Running org.apache.falcon.state.service.store.TestJDBCStateStore
Tests run: 8, Failures: 0, Errors: 0, Skipped: 0, Time elapsed: 34.851 sec - in org.apache.falcon.state.service.store.TestJDBCStateStore
Running org.apache.falcon.state.service.TestFalconJPAService
Tests run: 1, Failures: 0, Errors: 0, Skipped: 0, Time elapsed: 31.178 sec - in org.apache.falcon.state.service.TestFalconJPAService
Running org.apache.falcon.state.InstanceStateServiceTest
Tests run: 10, Failures: 0, Errors: 0, Skipped: 0, Time elapsed: 5.577 sec - in org.apache.falcon.state.InstanceStateServiceTest
Running org.apache.falcon.notification.service.AlarmServiceTest
Tests run: 1, Failures: 0, Errors: 0, Skipped: 0, Time elapsed: 10.271 sec - in org.apache.falcon.notification.service.AlarmServiceTest
Running org.apache.falcon.notification.service.DataAvailabilityServiceTest
Tests run: 1, Failures: 0, Errors: 0, Skipped: 0, Time elapsed: 14.551 sec - in org.apache.falcon.notification.service.DataAvailabilityServiceTest
Running org.apache.falcon.notification.service.SchedulerServiceTest
Tests run: 6, Failures: 1, Errors: 0, Skipped: 0, Time elapsed: 12.694 sec <<< FAILURE!
- in org.apache.falcon.notification.service.SchedulerServiceTest
testDeRegistration(org.apache.falcon.notification.service.SchedulerServiceTest)  Time elapsed:
0.838 sec  <<< FAILURE!
java.lang.AssertionError: expected:<1> but was:<null>
	at org.testng.Assert.fail(Assert.java:89)
	at org.testng.Assert.failNotEquals(Assert.java:489)
	at org.testng.Assert.assertEquals(Assert.java:118)
	at org.testng.Assert.assertEquals(Assert.java:160)
	at org.apache.falcon.notification.service.SchedulerServiceTest.testDeRegistration(SchedulerServiceTest.java:274)

Running org.apache.falcon.workflow.engine.WorkflowEngineFactoryTest
Tests run: 4, Failures: 0, Errors: 0, Skipped: 0, Time elapsed: 15.022 sec - in org.apache.falcon.workflow.engine.WorkflowEngineFactoryTest

Results :

Failed tests: 
  SchedulerServiceTest.testDeRegistration:274 expected:<1> but was:<null>

Tests run: 52, Failures: 1, Errors: 0, Skipped: 0

[INFO] ------------------------------------------------------------------------
[INFO] Reactor Summary:
[INFO] 
[INFO] Apache Falcon ..................................... SUCCESS [ 53.714 s]
[INFO] Apache Falcon UI .................................. SUCCESS [01:19 min]
[INFO] Build Tools ....................................... SUCCESS [ 25.145 s]
[INFO] Apache Falcon Java client ......................... SUCCESS [03:49 min]
[INFO] Apache Falcon CLI client .......................... SUCCESS [01:23 min]
[INFO] Apache Falcon Metrics ............................. SUCCESS [01:33 min]
[INFO] Apache Falcon Hadoop Dependencies ................. SUCCESS [01:06 min]
[INFO] Apache Falcon Test Utility ........................ SUCCESS [ 51.932 s]
[INFO] Apache Falcon Commons ............................. SUCCESS [11:35 min]
[INFO] Apache Falcon Oozie EL Extension .................. SUCCESS [01:00 min]
[INFO] Apache Falcon Embedded Hadoop - Test Cluster ...... SUCCESS [01:39 min]
[INFO] Apache Falcon Sharelib Hive - Test Cluster ........ SUCCESS [  4.025 s]
[INFO] Apache Falcon Sharelib Pig - Test Cluster ......... SUCCESS [  2.452 s]
[INFO] Apache Falcon Sharelib Hcatalog - Test Cluster .... SUCCESS [  2.974 s]
[INFO] Apache Falcon Sharelib Oozie - Test Cluster ....... SUCCESS [  2.535 s]
[INFO] Apache Falcon Test Tools - Test Cluster ........... SUCCESS [  2.173 s]
[INFO] Apache Falcon Messaging ........................... SUCCESS [02:02 min]
[INFO] Apache Falcon LIfecycle Module .................... SUCCESS [01:07 min]
[INFO] Apache Falcon Oozie Adaptor ....................... SUCCESS [05:25 min]
[INFO] Apache Falcon Scheduler ........................... FAILURE [04:28 min]
[INFO] Apache Falcon Acquisition ......................... SKIPPED
[INFO] Apache Falcon Distcp Replication .................. SKIPPED
[INFO] Apache Falcon Retention ........................... SKIPPED
[INFO] Apache Falcon Archival ............................ SKIPPED
[INFO] Apache Falcon Rerun ............................... SKIPPED
[INFO] Apache Falcon Prism ............................... SKIPPED
[INFO] falcon-unit ....................................... SKIPPED
[INFO] Apache Falcon Web Application ..................... SKIPPED
[INFO] Apache Falcon Documentation ....................... SKIPPED
[INFO] Apache Falcon Distro .............................. SKIPPED
[INFO] ------------------------------------------------------------------------
[INFO] BUILD FAILURE
[INFO] ------------------------------------------------------------------------
[INFO] Total time: 39:03 min
[INFO] Finished at: 2016-04-06T23:00:13+00:00
[INFO] Final Memory: 430M/1336M
[INFO] ------------------------------------------------------------------------
[ERROR] Failed to execute goal org.apache.maven.plugins:maven-surefire-plugin:2.16:test (default-test)
on project falcon-scheduler: There are test failures.
[ERROR] 
[ERROR] Please refer to <https://builds.apache.org/job/Apache-falcon/ws/scheduler/target/surefire-reports>
for the individual test results.
[ERROR] -> [Help 1]
[ERROR] 
[ERROR] To see the full stack trace of the errors, re-run Maven with the -e switch.
[ERROR] Re-run Maven using the -X switch to enable full debug logging.
[ERROR] 
[ERROR] For more information about the errors and possible solutions, please read the following
articles:
[ERROR] [Help 1] http://cwiki.apache.org/confluence/display/MAVEN/MojoFailureException
[ERROR] 
[ERROR] After correcting the problems, you can resume the build with the command
[ERROR]   mvn <goals> -rf :falcon-scheduler
Build step 'Execute shell' marked build as failure
[CHECKSTYLE] Collecting checkstyle analysis files...
[CHECKSTYLE] Finding all files that match the pattern **/target/checkstyle-result.xml
[CHECKSTYLE] Parsing 28 files in <https://builds.apache.org/job/Apache-falcon/ws/>
[CHECKSTYLE] Successfully parsed file <https://builds.apache.org/job/Apache-falcon/ws/acquisition/target/checkstyle-result.xml>
with 0 unique warnings and 0 duplicates.
[CHECKSTYLE] Successfully parsed file <https://builds.apache.org/job/Apache-falcon/ws/archival/target/checkstyle-result.xml>
with 0 unique warnings and 0 duplicates.
[CHECKSTYLE] Successfully parsed file <https://builds.apache.org/job/Apache-falcon/ws/build-tools/target/checkstyle-result.xml>
with 0 unique warnings and 0 duplicates.
[CHECKSTYLE] Successfully parsed file <https://builds.apache.org/job/Apache-falcon/ws/cli/target/checkstyle-result.xml>
with 0 unique warnings and 0 duplicates.
[CHECKSTYLE] Successfully parsed file <https://builds.apache.org/job/Apache-falcon/ws/client/target/checkstyle-result.xml>
with 0 unique warnings and 0 duplicates.
[CHECKSTYLE] Successfully parsed file <https://builds.apache.org/job/Apache-falcon/ws/common/target/checkstyle-result.xml>
with 0 unique warnings and 0 duplicates.
[CHECKSTYLE] Successfully parsed file <https://builds.apache.org/job/Apache-falcon/ws/docs/target/checkstyle-result.xml>
with 0 unique warnings and 0 duplicates.
[CHECKSTYLE] Successfully parsed file <https://builds.apache.org/job/Apache-falcon/ws/falcon-ui/target/checkstyle-result.xml>
with 0 unique warnings and 0 duplicates.
[CHECKSTYLE] Successfully parsed file <https://builds.apache.org/job/Apache-falcon/ws/hadoop-dependencies/target/checkstyle-result.xml>
with 0 unique warnings and 0 duplicates.
[CHECKSTYLE] Successfully parsed file <https://builds.apache.org/job/Apache-falcon/ws/lifecycle/target/checkstyle-result.xml>
with 0 unique warnings and 0 duplicates.
[CHECKSTYLE] Successfully parsed file <https://builds.apache.org/job/Apache-falcon/ws/messaging/target/checkstyle-result.xml>
with 0 unique warnings and 0 duplicates.
[CHECKSTYLE] Successfully parsed file <https://builds.apache.org/job/Apache-falcon/ws/metrics/target/checkstyle-result.xml>
with 0 unique warnings and 0 duplicates.
[CHECKSTYLE] Successfully parsed file <https://builds.apache.org/job/Apache-falcon/ws/oozie-el-extensions/target/checkstyle-result.xml>
with 0 unique warnings and 0 duplicates.
[CHECKSTYLE] Successfully parsed file <https://builds.apache.org/job/Apache-falcon/ws/oozie/target/checkstyle-result.xml>
with 0 unique warnings and 0 duplicates.
[CHECKSTYLE] Successfully parsed file <https://builds.apache.org/job/Apache-falcon/ws/prism/target/checkstyle-result.xml>
with 0 unique warnings and 0 duplicates.
[CHECKSTYLE] Successfully parsed file <https://builds.apache.org/job/Apache-falcon/ws/replication/target/checkstyle-result.xml>
with 0 unique warnings and 0 duplicates.
[CHECKSTYLE] Successfully parsed file <https://builds.apache.org/job/Apache-falcon/ws/rerun/target/checkstyle-result.xml>
with 0 unique warnings and 0 duplicates.
[CHECKSTYLE] Successfully parsed file <https://builds.apache.org/job/Apache-falcon/ws/retention/target/checkstyle-result.xml>
with 0 unique warnings and 0 duplicates.
[CHECKSTYLE] Successfully parsed file <https://builds.apache.org/job/Apache-falcon/ws/target/checkstyle-result.xml>
with 0 unique warnings and 0 duplicates.
[CHECKSTYLE] Successfully parsed file <https://builds.apache.org/job/Apache-falcon/ws/test-tools/hadoop-webapp/target/checkstyle-result.xml>
with 0 unique warnings and 0 duplicates.
[CHECKSTYLE] Successfully parsed file <https://builds.apache.org/job/Apache-falcon/ws/test-tools/hcatalog-sharelib/target/checkstyle-result.xml>
with 0 unique warnings and 0 duplicates.
[CHECKSTYLE] Successfully parsed file <https://builds.apache.org/job/Apache-falcon/ws/test-tools/hive-sharelib/target/checkstyle-result.xml>
with 0 unique warnings and 0 duplicates.
[CHECKSTYLE] Successfully parsed file <https://builds.apache.org/job/Apache-falcon/ws/test-tools/oozie-sharelib/target/checkstyle-result.xml>
with 0 unique warnings and 0 duplicates.
[CHECKSTYLE] Successfully parsed file <https://builds.apache.org/job/Apache-falcon/ws/test-tools/pig-sharelib/target/checkstyle-result.xml>
with 0 unique warnings and 0 duplicates.
[CHECKSTYLE] Successfully parsed file <https://builds.apache.org/job/Apache-falcon/ws/test-tools/target/checkstyle-result.xml>
with 0 unique warnings and 0 duplicates.
[CHECKSTYLE] Successfully parsed file <https://builds.apache.org/job/Apache-falcon/ws/test-util/target/checkstyle-result.xml>
with 0 unique warnings and 0 duplicates.
[CHECKSTYLE] Successfully parsed file <https://builds.apache.org/job/Apache-falcon/ws/unit/target/checkstyle-result.xml>
with 0 unique warnings and 0 duplicates.
[CHECKSTYLE] Successfully parsed file <https://builds.apache.org/job/Apache-falcon/ws/webapp/target/checkstyle-result.xml>
with 0 unique warnings and 0 duplicates.
[CHECKSTYLE] Computing warning deltas based on reference build #954
[FINDBUGS] Collecting findbugs analysis files...
[FINDBUGS] Finding all files that match the pattern **/target/findbugs.xml
[FINDBUGS] Parsing 17 files in <https://builds.apache.org/job/Apache-falcon/ws/>
[FINDBUGS] Successfully parsed file <https://builds.apache.org/job/Apache-falcon/ws/cli/target/findbugs.xml>
with 0 unique warnings and 0 duplicates.
[FINDBUGS] Successfully parsed file <https://builds.apache.org/job/Apache-falcon/ws/client/target/findbugs.xml>
with 0 unique warnings and 0 duplicates.
[FINDBUGS] Successfully parsed file <https://builds.apache.org/job/Apache-falcon/ws/common/target/findbugs.xml>
with 0 unique warnings and 0 duplicates.
[FINDBUGS] Successfully parsed file <https://builds.apache.org/job/Apache-falcon/ws/hadoop-dependencies/target/findbugs.xml>
with 0 unique warnings and 0 duplicates.
[FINDBUGS] Successfully parsed file <https://builds.apache.org/job/Apache-falcon/ws/lifecycle/target/findbugs.xml>
with 0 unique warnings and 0 duplicates.
[FINDBUGS] Successfully parsed file <https://builds.apache.org/job/Apache-falcon/ws/messaging/target/findbugs.xml>
with 0 unique warnings and 0 duplicates.
[FINDBUGS] Successfully parsed file <https://builds.apache.org/job/Apache-falcon/ws/metrics/target/findbugs.xml>
with 0 unique warnings and 0 duplicates.
[FINDBUGS] Successfully parsed file <https://builds.apache.org/job/Apache-falcon/ws/oozie-el-extensions/target/findbugs.xml>
with 0 unique warnings and 0 duplicates.
[FINDBUGS] Successfully parsed file <https://builds.apache.org/job/Apache-falcon/ws/oozie/target/findbugs.xml>
with 0 unique warnings and 0 duplicates.
[FINDBUGS] Successfully parsed file <https://builds.apache.org/job/Apache-falcon/ws/prism/target/findbugs.xml>
with 0 unique warnings and 0 duplicates.
[FINDBUGS] Successfully parsed file <https://builds.apache.org/job/Apache-falcon/ws/replication/target/findbugs.xml>
with 0 unique warnings and 0 duplicates.
[FINDBUGS] Successfully parsed file <https://builds.apache.org/job/Apache-falcon/ws/rerun/target/findbugs.xml>
with 0 unique warnings and 0 duplicates.
[FINDBUGS] Successfully parsed file <https://builds.apache.org/job/Apache-falcon/ws/retention/target/findbugs.xml>
with 0 unique warnings and 0 duplicates.
[FINDBUGS] Successfully parsed file <https://builds.apache.org/job/Apache-falcon/ws/test-tools/hadoop-webapp/target/findbugs.xml>
with 0 unique warnings and 0 duplicates.
[FINDBUGS] Successfully parsed file <https://builds.apache.org/job/Apache-falcon/ws/test-util/target/findbugs.xml>
with 0 unique warnings and 0 duplicates.
[FINDBUGS] Successfully parsed file <https://builds.apache.org/job/Apache-falcon/ws/unit/target/findbugs.xml>
with 0 unique warnings and 0 duplicates.
[FINDBUGS] Successfully parsed file <https://builds.apache.org/job/Apache-falcon/ws/webapp/target/findbugs.xml>
with 0 unique warnings and 0 duplicates.
[FINDBUGS] Computing warning deltas based on reference build #954
Archiving artifacts
Recording test results
TestNG Reports Processing: START
Looking for TestNG results report in workspace using pattern: **/target/testng-results.xml
Did not find any matching files.

Mime
View raw message