falcon-dev mailing list archives

Site index · List index
Message view « Date » · « Thread »
Top « Date » · « Thread »
From Apache Jenkins Server <jenk...@builds.apache.org>
Subject Build failed in Jenkins: Apache-falcon #956
Date Wed, 23 Mar 2016 17:08:27 GMT
See <https://builds.apache.org/job/Apache-falcon/956/changes>

Changes:

[pbishnoi] FALCON-1840 Archive older definition in case of update

------------------------------------------
[...truncated 5182 lines...]
[INFO] --- findbugs-maven-plugin:3.0.3:check (findbugs-check) @ falcon-webapp ---
[INFO] BugInstance size is 0
[INFO] Error size is 0
[INFO] No errors/warnings found
[INFO]                                                                         
[INFO] ------------------------------------------------------------------------
[INFO] Building Apache Falcon Documentation 0.10-SNAPSHOT
[INFO] ------------------------------------------------------------------------
[INFO] 
[INFO] --- maven-clean-plugin:2.5:clean (default-clean) @ falcon-docs ---
[INFO] Deleting <https://builds.apache.org/job/Apache-falcon/ws/docs/target>
[INFO] 
[INFO] --- maven-enforcer-plugin:1.3.1:enforce (enforce-property) @ falcon-docs ---
[INFO] 
[INFO] --- buildnumber-maven-plugin:1.0:create (default) @ falcon-docs ---
[INFO] Checking for local modifications: skipped.
[INFO] Updating project files from SCM: skipped.
[INFO] Executing: /bin/sh -c cd <https://builds.apache.org/job/Apache-falcon/ws/docs>
&& git show
[INFO] Working directory: <https://builds.apache.org/job/Apache-falcon/ws/docs>
[INFO] Storing buildNumber: 820572d8afb5b1244af7f8c36c810c4efd0b749d at timestamp: 1458752864329
[INFO] Executing: /bin/sh -c cd <https://builds.apache.org/job/Apache-falcon/ws/docs>
&& git show
[INFO] Working directory: <https://builds.apache.org/job/Apache-falcon/ws/docs>
[INFO] Storing buildScmBranch: UNKNOWN
[INFO] 
[INFO] --- maven-remote-resources-plugin:1.5:process (default) @ falcon-docs ---
[INFO] 
[INFO] --- maven-resources-plugin:2.7:resources (default-resources) @ falcon-docs ---
[INFO] Using 'UTF-8' encoding to copy filtered resources.
[INFO] skip non existing resourceDirectory <https://builds.apache.org/job/Apache-falcon/ws/docs/src/main/resources>
[INFO] skip non existing resourceDirectory <https://builds.apache.org/job/Apache-falcon/ws/docs/src/main/resources>
[INFO] skip non existing resourceDirectory <https://builds.apache.org/job/Apache-falcon/ws/docs/src/test/resources>
[INFO] Copying 2 resources to META-INF
[INFO] Copying 3 resources
[INFO] 
[INFO] --- maven-compiler-plugin:2.3.2:compile (default-compile) @ falcon-docs ---
[INFO] No sources to compile
[INFO] 
[INFO] --- maven-resources-plugin:2.7:testResources (default-testResources) @ falcon-docs
---
[INFO] Using 'UTF-8' encoding to copy filtered resources.
[INFO] skip non existing resourceDirectory <https://builds.apache.org/job/Apache-falcon/ws/docs/src/test/resources>
[INFO] Copying 3 resources
[INFO] 
[INFO] --- maven-compiler-plugin:2.3.2:testCompile (default-testCompile) @ falcon-docs ---
[INFO] No sources to compile
[INFO] 
[INFO] --- maven-surefire-plugin:2.16:test (default-test) @ falcon-docs ---
[INFO] Tests are skipped.
[INFO] 
[INFO] --- maven-site-plugin:3.4:site (default) @ falcon-docs ---
[INFO] Parent project loaded from repository: org.apache:apache:pom:17
[INFO] Relativizing decoration links with respect to project URL: http://falcon.apache.org/falcon-docs/
[INFO] Rendering site with org.apache.maven.skins:maven-fluido-skin:jar:1.3.0 skin.
[INFO] Rendering 105 Doxia documents: 105 twiki
[INFO] 
[INFO] --- maven-jar-plugin:2.5:jar (default-jar) @ falcon-docs ---
[INFO] Building jar: <https://builds.apache.org/job/Apache-falcon/ws/docs/target/falcon-docs-0.10-SNAPSHOT.jar>
[INFO] 
[INFO] --- maven-site-plugin:3.4:attach-descriptor (attach-descriptor) @ falcon-docs ---
[INFO] 
[INFO] --- maven-failsafe-plugin:2.16:integration-test (integration-test) @ falcon-docs ---
[INFO] Tests are skipped.
[INFO] 
[INFO] --- maven-failsafe-plugin:2.16:verify (verify) @ falcon-docs ---
[INFO] Tests are skipped.
[INFO] 
[INFO] --- apache-rat-plugin:0.7:check (rat-check) @ falcon-docs ---
[INFO] Exclude: *.txt
[INFO] Exclude: **/*.txt
[INFO] Exclude: *.md
[INFO] Exclude: **/*.md
[INFO] Exclude: .git/**
[INFO] Exclude: **/.idea/**
[INFO] Exclude: **/*.twiki
[INFO] Exclude: **/*.iml
[INFO] Exclude: **/target/**
[INFO] Exclude: **/activemq-data/**
[INFO] Exclude: **/build/**
[INFO] Exclude: **/*.patch
[INFO] Exclude: derby.log
[INFO] Exclude: **/logs/**
[INFO] Exclude: **/.classpath
[INFO] Exclude: **/.project
[INFO] Exclude: **/.settings/**
[INFO] Exclude: **/test-output/**
[INFO] Exclude: **/data.txt
[INFO] Exclude: **/maven-eclipse.xml
[INFO] Exclude: **/.externalToolBuilders/**
[INFO] Exclude: html5-ui/**
[INFO] Exclude: **/metastore_db/**
[INFO] Exclude: **/db1.log
[INFO] Exclude: **/db1.properties
[INFO] Exclude: **/db1.script
[INFO] Exclude: **/credential_provider.jceks
[INFO] 
[INFO] --- maven-checkstyle-plugin:2.9.1:check (checkstyle-check) @ falcon-docs ---
[INFO] Starting audit...
Audit done.

[INFO] 
[INFO] >>> findbugs-maven-plugin:3.0.3:check (findbugs-check) @ falcon-docs >>>
[INFO] 
[INFO] --- findbugs-maven-plugin:3.0.3:findbugs (findbugs) @ falcon-docs ---
[INFO] 
[INFO] <<< findbugs-maven-plugin:3.0.3:check (findbugs-check) @ falcon-docs <<<
[INFO] 
[INFO] --- findbugs-maven-plugin:3.0.3:check (findbugs-check) @ falcon-docs ---
[INFO]                                                                         
[INFO] ------------------------------------------------------------------------
[INFO] Building Apache Falcon Distro 0.10-SNAPSHOT
[INFO] ------------------------------------------------------------------------
[INFO] 
[INFO] --- maven-clean-plugin:2.5:clean (default-clean) @ falcon-distro ---
[INFO] Deleting <https://builds.apache.org/job/Apache-falcon/ws/distro/target>
[INFO] 
[INFO] --- maven-enforcer-plugin:1.3.1:enforce (enforce-property) @ falcon-distro ---
[INFO] 
[INFO] --- buildnumber-maven-plugin:1.0:create (default) @ falcon-distro ---
[INFO] Checking for local modifications: skipped.
[INFO] Updating project files from SCM: skipped.
[INFO] Executing: /bin/sh -c cd <https://builds.apache.org/job/Apache-falcon/ws/distro>
&& git show
[INFO] Working directory: <https://builds.apache.org/job/Apache-falcon/ws/distro>
[INFO] Storing buildNumber: 820572d8afb5b1244af7f8c36c810c4efd0b749d at timestamp: 1458752882493
[INFO] Executing: /bin/sh -c cd <https://builds.apache.org/job/Apache-falcon/ws/distro>
&& git show
[INFO] Working directory: <https://builds.apache.org/job/Apache-falcon/ws/distro>
[INFO] Storing buildScmBranch: UNKNOWN
[INFO] 
[INFO] --- maven-remote-resources-plugin:1.5:process (default) @ falcon-distro ---
[INFO] 
[INFO] --- maven-site-plugin:3.4:site (default) @ falcon-distro ---
[INFO] maven.site.skip = true: Skipping site generation
[INFO] 
[INFO] --- maven-assembly-plugin:2.2.1:single (dist-assembly) @ falcon-distro ---
[INFO] Reading assembly descriptor: ../src/main/assemblies/standalone-package.xml
[INFO] Reading assembly descriptor: ../src/main/assemblies/src-package.xml
[INFO] falcon-0.10-SNAPSHOT/client/lib/ already added, skipping
[INFO] ------------------------------------------------------------------------
[INFO] Reactor Summary:
[INFO] 
[INFO] Apache Falcon ..................................... SUCCESS [ 22.453 s]
[INFO] Apache Falcon UI .................................. SUCCESS [ 22.269 s]
[INFO] Build Tools ....................................... SUCCESS [  9.613 s]
[INFO] Apache Falcon Java client ......................... SUCCESS [01:15 min]
[INFO] Apache Falcon CLI client .......................... SUCCESS [ 21.985 s]
[INFO] Apache Falcon Metrics ............................. SUCCESS [ 31.701 s]
[INFO] Apache Falcon Hadoop Dependencies ................. SUCCESS [ 23.974 s]
[INFO] Apache Falcon Test Utility ........................ SUCCESS [ 23.512 s]
[INFO] Apache Falcon Commons ............................. SUCCESS [05:54 min]
[INFO] Apache Falcon Oozie EL Extension .................. SUCCESS [ 35.495 s]
[INFO] Apache Falcon Embedded Hadoop - Test Cluster ...... SUCCESS [01:07 min]
[INFO] Apache Falcon Sharelib Hive - Test Cluster ........ SUCCESS [  2.786 s]
[INFO] Apache Falcon Sharelib Pig - Test Cluster ......... SUCCESS [  1.258 s]
[INFO] Apache Falcon Sharelib Hcatalog - Test Cluster .... SUCCESS [  1.371 s]
[INFO] Apache Falcon Sharelib Oozie - Test Cluster ....... SUCCESS [  1.297 s]
[INFO] Apache Falcon Test Tools - Test Cluster ........... SUCCESS [  0.921 s]
[INFO] Apache Falcon Messaging ........................... SUCCESS [01:10 min]
[INFO] Apache Falcon LIfecycle Module .................... SUCCESS [ 41.500 s]
[INFO] Apache Falcon Oozie Adaptor ....................... SUCCESS [02:51 min]
[INFO] Apache Falcon Scheduler ........................... SUCCESS [02:52 min]
[INFO] Apache Falcon Acquisition ......................... SUCCESS [  2.447 s]
[INFO] Apache Falcon Distcp Replication .................. SUCCESS [ 34.632 s]
[INFO] Apache Falcon Retention ........................... SUCCESS [ 33.466 s]
[INFO] Apache Falcon Archival ............................ SUCCESS [  1.730 s]
[INFO] Apache Falcon Rerun ............................... SUCCESS [ 46.044 s]
[INFO] Apache Falcon Prism ............................... SUCCESS [03:48 min]
[INFO] falcon-unit ....................................... SUCCESS [04:01 min]
[INFO] Apache Falcon Web Application ..................... SUCCESS [24:12 min]
[INFO] Apache Falcon Documentation ....................... SUCCESS [ 18.103 s]
[INFO] Apache Falcon Distro .............................. FAILURE [  4.875 s]
[INFO] ------------------------------------------------------------------------
[INFO] BUILD FAILURE
[INFO] ------------------------------------------------------------------------
[INFO] Total time: 53:40 min
[INFO] Finished at: 2016-03-23T17:08:07+00:00
[INFO] Final Memory: 825M/2345M
[INFO] ------------------------------------------------------------------------
[ERROR] Failed to execute goal org.apache.maven.plugins:maven-assembly-plugin:2.2.1:single
(dist-assembly) on project falcon-distro: Failed to create assembly: Error creating assembly
archive bin: Failed to retrieve numeric file attributes using: '/bin/sh -c ls -1nlaR <https://builds.apache.org/job/Apache-falcon/ws/distro/../.'>
-> [Help 1]
[ERROR] 
[ERROR] To see the full stack trace of the errors, re-run Maven with the -e switch.
[ERROR] Re-run Maven using the -X switch to enable full debug logging.
[ERROR] 
[ERROR] For more information about the errors and possible solutions, please read the following
articles:
[ERROR] [Help 1] http://cwiki.apache.org/confluence/display/MAVEN/MojoExecutionException
[ERROR] 
[ERROR] After correcting the problems, you can resume the build with the command
[ERROR]   mvn <goals> -rf :falcon-distro
Shutting down hive metastore.
[INFO] Shutdown hook executing
[INFO] Shutdown hook complete
Build step 'Execute shell' marked build as failure
[CHECKSTYLE] Collecting checkstyle analysis files...
[CHECKSTYLE] Finding all files that match the pattern **/target/checkstyle-result.xml
[CHECKSTYLE] Parsing 29 files in <https://builds.apache.org/job/Apache-falcon/ws/>
[CHECKSTYLE] Successfully parsed file <https://builds.apache.org/job/Apache-falcon/ws/acquisition/target/checkstyle-result.xml>
with 0 unique warnings and 0 duplicates.
[CHECKSTYLE] Successfully parsed file <https://builds.apache.org/job/Apache-falcon/ws/archival/target/checkstyle-result.xml>
with 0 unique warnings and 0 duplicates.
[CHECKSTYLE] Successfully parsed file <https://builds.apache.org/job/Apache-falcon/ws/build-tools/target/checkstyle-result.xml>
with 0 unique warnings and 0 duplicates.
[CHECKSTYLE] Successfully parsed file <https://builds.apache.org/job/Apache-falcon/ws/cli/target/checkstyle-result.xml>
with 0 unique warnings and 0 duplicates.
[CHECKSTYLE] Successfully parsed file <https://builds.apache.org/job/Apache-falcon/ws/client/target/checkstyle-result.xml>
with 0 unique warnings and 0 duplicates.
[CHECKSTYLE] Successfully parsed file <https://builds.apache.org/job/Apache-falcon/ws/common/target/checkstyle-result.xml>
with 0 unique warnings and 0 duplicates.
[CHECKSTYLE] Successfully parsed file <https://builds.apache.org/job/Apache-falcon/ws/docs/target/checkstyle-result.xml>
with 0 unique warnings and 0 duplicates.
[CHECKSTYLE] Successfully parsed file <https://builds.apache.org/job/Apache-falcon/ws/falcon-ui/target/checkstyle-result.xml>
with 0 unique warnings and 0 duplicates.
[CHECKSTYLE] Successfully parsed file <https://builds.apache.org/job/Apache-falcon/ws/hadoop-dependencies/target/checkstyle-result.xml>
with 0 unique warnings and 0 duplicates.
[CHECKSTYLE] Successfully parsed file <https://builds.apache.org/job/Apache-falcon/ws/lifecycle/target/checkstyle-result.xml>
with 0 unique warnings and 0 duplicates.
[CHECKSTYLE] Successfully parsed file <https://builds.apache.org/job/Apache-falcon/ws/messaging/target/checkstyle-result.xml>
with 0 unique warnings and 0 duplicates.
[CHECKSTYLE] Successfully parsed file <https://builds.apache.org/job/Apache-falcon/ws/metrics/target/checkstyle-result.xml>
with 0 unique warnings and 0 duplicates.
[CHECKSTYLE] Successfully parsed file <https://builds.apache.org/job/Apache-falcon/ws/oozie-el-extensions/target/checkstyle-result.xml>
with 0 unique warnings and 0 duplicates.
[CHECKSTYLE] Successfully parsed file <https://builds.apache.org/job/Apache-falcon/ws/oozie/target/checkstyle-result.xml>
with 0 unique warnings and 0 duplicates.
[CHECKSTYLE] Successfully parsed file <https://builds.apache.org/job/Apache-falcon/ws/prism/target/checkstyle-result.xml>
with 0 unique warnings and 0 duplicates.
[CHECKSTYLE] Successfully parsed file <https://builds.apache.org/job/Apache-falcon/ws/replication/target/checkstyle-result.xml>
with 0 unique warnings and 0 duplicates.
[CHECKSTYLE] Successfully parsed file <https://builds.apache.org/job/Apache-falcon/ws/rerun/target/checkstyle-result.xml>
with 0 unique warnings and 0 duplicates.
[CHECKSTYLE] Successfully parsed file <https://builds.apache.org/job/Apache-falcon/ws/retention/target/checkstyle-result.xml>
with 0 unique warnings and 0 duplicates.
[CHECKSTYLE] Successfully parsed file <https://builds.apache.org/job/Apache-falcon/ws/scheduler/target/checkstyle-result.xml>
with 0 unique warnings and 0 duplicates.
[CHECKSTYLE] Successfully parsed file <https://builds.apache.org/job/Apache-falcon/ws/target/checkstyle-result.xml>
with 0 unique warnings and 0 duplicates.
[CHECKSTYLE] Successfully parsed file <https://builds.apache.org/job/Apache-falcon/ws/test-tools/hadoop-webapp/target/checkstyle-result.xml>
with 0 unique warnings and 0 duplicates.
[CHECKSTYLE] Successfully parsed file <https://builds.apache.org/job/Apache-falcon/ws/test-tools/hcatalog-sharelib/target/checkstyle-result.xml>
with 0 unique warnings and 0 duplicates.
[CHECKSTYLE] Successfully parsed file <https://builds.apache.org/job/Apache-falcon/ws/test-tools/hive-sharelib/target/checkstyle-result.xml>
with 0 unique warnings and 0 duplicates.
[CHECKSTYLE] Successfully parsed file <https://builds.apache.org/job/Apache-falcon/ws/test-tools/oozie-sharelib/target/checkstyle-result.xml>
with 0 unique warnings and 0 duplicates.
[CHECKSTYLE] Successfully parsed file <https://builds.apache.org/job/Apache-falcon/ws/test-tools/pig-sharelib/target/checkstyle-result.xml>
with 0 unique warnings and 0 duplicates.
[CHECKSTYLE] Successfully parsed file <https://builds.apache.org/job/Apache-falcon/ws/test-tools/target/checkstyle-result.xml>
with 0 unique warnings and 0 duplicates.
[CHECKSTYLE] Successfully parsed file <https://builds.apache.org/job/Apache-falcon/ws/test-util/target/checkstyle-result.xml>
with 0 unique warnings and 0 duplicates.
[CHECKSTYLE] Successfully parsed file <https://builds.apache.org/job/Apache-falcon/ws/unit/target/checkstyle-result.xml>
with 0 unique warnings and 0 duplicates.
[CHECKSTYLE] Successfully parsed file <https://builds.apache.org/job/Apache-falcon/ws/webapp/target/checkstyle-result.xml>
with 0 unique warnings and 0 duplicates.
[CHECKSTYLE] Computing warning deltas based on reference build #954
[FINDBUGS] Collecting findbugs analysis files...
[FINDBUGS] Finding all files that match the pattern **/target/findbugs.xml
[FINDBUGS] Parsing 18 files in <https://builds.apache.org/job/Apache-falcon/ws/>
[FINDBUGS] Successfully parsed file <https://builds.apache.org/job/Apache-falcon/ws/cli/target/findbugs.xml>
with 0 unique warnings and 0 duplicates.
[FINDBUGS] Successfully parsed file <https://builds.apache.org/job/Apache-falcon/ws/client/target/findbugs.xml>
with 0 unique warnings and 0 duplicates.
[FINDBUGS] Successfully parsed file <https://builds.apache.org/job/Apache-falcon/ws/common/target/findbugs.xml>
with 0 unique warnings and 0 duplicates.
[FINDBUGS] Successfully parsed file <https://builds.apache.org/job/Apache-falcon/ws/hadoop-dependencies/target/findbugs.xml>
with 0 unique warnings and 0 duplicates.
[FINDBUGS] Successfully parsed file <https://builds.apache.org/job/Apache-falcon/ws/lifecycle/target/findbugs.xml>
with 0 unique warnings and 0 duplicates.
[FINDBUGS] Successfully parsed file <https://builds.apache.org/job/Apache-falcon/ws/messaging/target/findbugs.xml>
with 0 unique warnings and 0 duplicates.
[FINDBUGS] Successfully parsed file <https://builds.apache.org/job/Apache-falcon/ws/metrics/target/findbugs.xml>
with 0 unique warnings and 0 duplicates.
[FINDBUGS] Successfully parsed file <https://builds.apache.org/job/Apache-falcon/ws/oozie-el-extensions/target/findbugs.xml>
with 0 unique warnings and 0 duplicates.
[FINDBUGS] Successfully parsed file <https://builds.apache.org/job/Apache-falcon/ws/oozie/target/findbugs.xml>
with 0 unique warnings and 0 duplicates.
[FINDBUGS] Successfully parsed file <https://builds.apache.org/job/Apache-falcon/ws/prism/target/findbugs.xml>
with 0 unique warnings and 0 duplicates.
[FINDBUGS] Successfully parsed file <https://builds.apache.org/job/Apache-falcon/ws/replication/target/findbugs.xml>
with 0 unique warnings and 0 duplicates.
[FINDBUGS] Successfully parsed file <https://builds.apache.org/job/Apache-falcon/ws/rerun/target/findbugs.xml>
with 0 unique warnings and 0 duplicates.
[FINDBUGS] Successfully parsed file <https://builds.apache.org/job/Apache-falcon/ws/retention/target/findbugs.xml>
with 0 unique warnings and 0 duplicates.
[FINDBUGS] Successfully parsed file <https://builds.apache.org/job/Apache-falcon/ws/scheduler/target/findbugs.xml>
with 0 unique warnings and 0 duplicates.
[FINDBUGS] Successfully parsed file <https://builds.apache.org/job/Apache-falcon/ws/test-tools/hadoop-webapp/target/findbugs.xml>
with 0 unique warnings and 0 duplicates.
[FINDBUGS] Successfully parsed file <https://builds.apache.org/job/Apache-falcon/ws/test-util/target/findbugs.xml>
with 0 unique warnings and 0 duplicates.
[FINDBUGS] Successfully parsed file <https://builds.apache.org/job/Apache-falcon/ws/unit/target/findbugs.xml>
with 0 unique warnings and 0 duplicates.
[FINDBUGS] Successfully parsed file <https://builds.apache.org/job/Apache-falcon/ws/webapp/target/findbugs.xml>
with 0 unique warnings and 0 duplicates.
[FINDBUGS] Computing warning deltas based on reference build #954
Archiving artifacts
Recording test results
TestNG Reports Processing: START
Looking for TestNG results report in workspace using pattern: **/target/testng-results.xml
Did not find any matching files.

Mime
View raw message