falcon-dev mailing list archives

Site index · List index
Message view « Date » · « Thread »
Top « Date » · « Thread »
From Apache Jenkins Server <jenk...@builds.apache.org>
Subject Build failed in Jenkins: Apache-falcon #888
Date Mon, 11 Jan 2016 06:23:04 GMT
See <https://builds.apache.org/job/Apache-falcon/888/changes>

Changes:

[sshivalingamurthy] FALCON-1721 Checkstyle module should have falcon-main as parent.

------------------------------------------
[...truncated 26 lines...]
++ FORREST_HOME=/home/jenkins/tools/forrest/latest
++ export JAVA5_HOME=/home/jenkins/tools/java/latest1.5
++ JAVA5_HOME=/home/jenkins/tools/java/latest1.5
++ export FINDBUGS_HOME=/home/jenkins/tools/findbugs/latest
++ FINDBUGS_HOME=/home/jenkins/tools/findbugs/latest
++ export CLOVER_HOME=/home/jenkins/tools/clover/latest
++ CLOVER_HOME=/home/jenkins/tools/clover/latest
++ export MAVEN_HOME=/home/jenkins/tools/maven/latest
++ MAVEN_HOME=/home/jenkins/tools/maven/latest
++ export PATH=/home/jenkins/jenkins-slave/tools/hudson.model.JDK/JDK_1.7_latest_/bin:/usr/local/sbin:/usr/local/bin:/usr/sbin:/usr/bin:/sbin:/bin:/usr/games:/usr/local/games:/home/jenkins/tools/java/latest/bin:/home/jenkins/tools/ant/latest/bin:
++ PATH=/home/jenkins/jenkins-slave/tools/hudson.model.JDK/JDK_1.7_latest_/bin:/usr/local/sbin:/usr/local/bin:/usr/sbin:/usr/bin:/sbin:/bin:/usr/games:/usr/local/games:/home/jenkins/tools/java/latest/bin:/home/jenkins/tools/ant/latest/bin:
++ export ANT_OPTS=-Xmx2048m
++ ANT_OPTS=-Xmx2048m
++ export MAVEN_OPTS=-Xmx2048m
++ MAVEN_OPTS=-Xmx2048m
++ TRUNK=<https://builds.apache.org/job/Apache-falcon/ws/trunk>
++ ulimit -n
60000
+ JAVA_HOME=/home/jenkins/tools/java/jdk1.7.0-64
+ PATH=/home/jenkins/tools/java/jdk1.7.0-64/bin:/home/jenkins/jenkins-slave/tools/hudson.model.JDK/JDK_1.7_latest_/bin:/usr/local/sbin:/usr/local/bin:/usr/sbin:/usr/bin:/sbin:/bin:/usr/games:/usr/local/games:/home/jenkins/tools/java/latest/bin:/home/jenkins/tools/ant/latest/bin:
+ export 'MAVEN_OPTS=-Xmx4096m -XX:MaxPermSize=1024m -noverify'
+ MAVEN_OPTS='-Xmx4096m -XX:MaxPermSize=1024m -noverify'
+ /home/jenkins/tools/maven/latest/bin/mvn clean verify -P test-patch,hadoop-2 -Drat.numUnapprovedLicenses=100
[INFO] Scanning for projects...
[WARNING] 
[WARNING] Some problems were encountered while building the effective model for org.apache.falcon:falcon-hadoop-webapp:war:0.10-SNAPSHOT
[WARNING] 'profiles.profile[hadoop-2].dependencies.dependency.(groupId:artifactId:type:classifier)'
must be unique: org.apache.hadoop:hadoop-distcp:jar -> duplicate declaration of version
(?) @ line 108, column 29
[WARNING] 
[WARNING] Some problems were encountered while building the effective model for org.apache.falcon:falcon-oozie-adaptor:jar:0.10-SNAPSHOT
[WARNING] 'build.plugins.plugin.version' for org.jvnet.jaxb2.maven2:maven-jaxb2-plugin is
missing. @ line 128, column 21
[WARNING] 
[WARNING] Some problems were encountered while building the effective model for org.apache.falcon:falcon-prism:war:0.10-SNAPSHOT
[WARNING] 'build.plugins.plugin.version' for org.codehaus.mojo:keytool-maven-plugin is missing.
@ line 182, column 21
[WARNING] 
[WARNING] Some problems were encountered while building the effective model for org.apache.falcon:falcon-feed-lifecycle:jar:0.10-SNAPSHOT
[WARNING] 'build.plugins.plugin.version' for org.jvnet.jaxb2.maven2:maven-jaxb2-plugin is
missing. @ line 100, column 21
[WARNING] 
[WARNING] Some problems were encountered while building the effective model for org.apache.falcon:falcon-webapp:war:0.10-SNAPSHOT
[WARNING] 'build.plugins.plugin.(groupId:artifactId)' must be unique but found duplicate declaration
of plugin org.apache.maven.plugins:maven-dependency-plugin @ line 423, column 21
[WARNING] 
[WARNING] It is highly recommended to fix these problems because they threaten the stability
of your build.
[WARNING] 
[WARNING] For this reason, future Maven versions might no longer support building such malformed
projects.
[WARNING] 
[INFO] ------------------------------------------------------------------------
[INFO] Reactor Build Order:
[INFO] 
[INFO] Apache Falcon
[INFO] Apache Falcon UI
[INFO] Build Tools
[INFO] Apache Falcon Java client
[INFO] Apache Falcon CLI client
[INFO] Apache Falcon Metrics
[INFO] Apache Falcon Hadoop Dependencies
[INFO] Apache Falcon Test Utility
[INFO] Apache Falcon Commons
[INFO] Apache Falcon Oozie EL Extension
[INFO] Apache Falcon Embedded Hadoop - Test Cluster
[INFO] Apache Falcon Sharelib Hive - Test Cluster
[INFO] Apache Falcon Sharelib Pig - Test Cluster
[INFO] Apache Falcon Sharelib Hcatalog - Test Cluster
[INFO] Apache Falcon Sharelib Oozie - Test Cluster
[INFO] Apache Falcon Test Tools - Test Cluster
[INFO] Apache Falcon Messaging
[INFO] Apache Falcon LIfecycle Module
[INFO] Apache Falcon Oozie Adaptor
[INFO] Apache Falcon Scheduler
[INFO] Apache Falcon Acquisition
[INFO] Apache Falcon Distcp Replication
[INFO] Apache Falcon Retention
[INFO] Apache Falcon Archival
[INFO] Apache Falcon Rerun
[INFO] Apache Falcon Prism
[INFO] falcon-unit
[INFO] Apache Falcon Web Application
[INFO] Apache Falcon Documentation
[INFO] 
[INFO] Using the builder org.apache.maven.lifecycle.internal.builder.singlethreaded.SingleThreadedBuilder
with a thread count of 1
[INFO]                                                                         
[INFO] ------------------------------------------------------------------------
[INFO] Building Apache Falcon 0.10-SNAPSHOT
[INFO] ------------------------------------------------------------------------
[INFO] 
[INFO] --- maven-clean-plugin:2.5:clean (default-clean) @ falcon-main ---
[INFO] Deleting <https://builds.apache.org/job/Apache-falcon/ws/target>
[INFO] 
[INFO] --- maven-enforcer-plugin:1.3.1:enforce (enforce-property) @ falcon-main ---
[INFO] 
[INFO] --- buildnumber-maven-plugin:1.0:create (default) @ falcon-main ---
[INFO] Checking for local modifications: skipped.
[INFO] Updating project files from SCM: skipped.
[INFO] Executing: /bin/sh -c cd <https://builds.apache.org/job/Apache-falcon/ws/> &&
git show
[INFO] Working directory: <https://builds.apache.org/job/Apache-falcon/ws/>
[INFO] Storing buildNumber: 13ad121bd5cfd62d3fe54010024d6df2e299e449 at timestamp: 1452493366221
[INFO] Executing: /bin/sh -c cd <https://builds.apache.org/job/Apache-falcon/ws/> &&
git show
[INFO] Working directory: <https://builds.apache.org/job/Apache-falcon/ws/>
[INFO] Storing buildScmBranch: UNKNOWN
[INFO] 
[INFO] --- maven-remote-resources-plugin:1.5:process (default) @ falcon-main ---
[INFO] 
[INFO] --- maven-site-plugin:3.4:site (default) @ falcon-main ---
[INFO] maven.site.skip = true: Skipping site generation
[INFO] 
[INFO] --- maven-site-plugin:3.4:attach-descriptor (attach-descriptor) @ falcon-main ---
[INFO] 
[INFO] --- maven-failsafe-plugin:2.16:integration-test (integration-test) @ falcon-main ---
[INFO] No tests to run.
[INFO] 
[INFO] --- maven-failsafe-plugin:2.16:verify (verify) @ falcon-main ---
[INFO] No tests to run.
[INFO] 
[INFO] --- apache-rat-plugin:0.7:check (rat-check) @ falcon-main ---
[INFO] Exclude: *.txt
[INFO] Exclude: **/*.txt
[INFO] Exclude: .git/**
[INFO] Exclude: **/.idea/**
[INFO] Exclude: **/*.twiki
[INFO] Exclude: **/*.iml
[INFO] Exclude: **/target/**
[INFO] Exclude: **/activemq-data/**
[INFO] Exclude: **/build/**
[INFO] Exclude: **/*.patch
[INFO] Exclude: derby.log
[INFO] Exclude: **/logs/**
[INFO] Exclude: **/.classpath
[INFO] Exclude: **/.project
[INFO] Exclude: **/.settings/**
[INFO] Exclude: **/test-output/**
[INFO] Exclude: **/data.txt
[INFO] Exclude: **/maven-eclipse.xml
[INFO] Exclude: **/.externalToolBuilders/**
[INFO] Exclude: html5-ui/**
[INFO] Exclude: **/metastore_db/**
[INFO] Exclude: **/db1.log
[INFO] Exclude: **/db1.properties
[INFO] Exclude: **/db1.script
[INFO] 
[INFO] --- maven-checkstyle-plugin:2.9.1:check (checkstyle-check) @ falcon-main ---
[INFO] ------------------------------------------------------------------------
[INFO] Reactor Summary:
[INFO] 
[INFO] Apache Falcon ..................................... FAILURE [ 15.627 s]
[INFO] Apache Falcon UI .................................. SKIPPED
[INFO] Build Tools ....................................... SKIPPED
[INFO] Apache Falcon Java client ......................... SKIPPED
[INFO] Apache Falcon CLI client .......................... SKIPPED
[INFO] Apache Falcon Metrics ............................. SKIPPED
[INFO] Apache Falcon Hadoop Dependencies ................. SKIPPED
[INFO] Apache Falcon Test Utility ........................ SKIPPED
[INFO] Apache Falcon Commons ............................. SKIPPED
[INFO] Apache Falcon Oozie EL Extension .................. SKIPPED
[INFO] Apache Falcon Embedded Hadoop - Test Cluster ...... SKIPPED
[INFO] Apache Falcon Sharelib Hive - Test Cluster ........ SKIPPED
[INFO] Apache Falcon Sharelib Pig - Test Cluster ......... SKIPPED
[INFO] Apache Falcon Sharelib Hcatalog - Test Cluster .... SKIPPED
[INFO] Apache Falcon Sharelib Oozie - Test Cluster ....... SKIPPED
[INFO] Apache Falcon Test Tools - Test Cluster ........... SKIPPED
[INFO] Apache Falcon Messaging ........................... SKIPPED
[INFO] Apache Falcon LIfecycle Module .................... SKIPPED
[INFO] Apache Falcon Oozie Adaptor ....................... SKIPPED
[INFO] Apache Falcon Scheduler ........................... SKIPPED
[INFO] Apache Falcon Acquisition ......................... SKIPPED
[INFO] Apache Falcon Distcp Replication .................. SKIPPED
[INFO] Apache Falcon Retention ........................... SKIPPED
[INFO] Apache Falcon Archival ............................ SKIPPED
[INFO] Apache Falcon Rerun ............................... SKIPPED
[INFO] Apache Falcon Prism ............................... SKIPPED
[INFO] falcon-unit ....................................... SKIPPED
[INFO] Apache Falcon Web Application ..................... SKIPPED
[INFO] Apache Falcon Documentation ....................... SKIPPED
[INFO] ------------------------------------------------------------------------
[INFO] BUILD FAILURE
[INFO] ------------------------------------------------------------------------
[INFO] Total time: 16.716 s
[INFO] Finished at: 2016-01-11T06:22:59+00:00
[INFO] Final Memory: 41M/1288M
[INFO] ------------------------------------------------------------------------
[ERROR] Failed to execute goal org.apache.maven.plugins:maven-checkstyle-plugin:2.9.1:check
(checkstyle-check) on project falcon-main: Failed during checkstyle execution: Unable to find
configuration file at location src/build/checkstyle.xml: Could not find resource 'src/build/checkstyle.xml'.
-> [Help 1]
[ERROR] 
[ERROR] To see the full stack trace of the errors, re-run Maven with the -e switch.
[ERROR] Re-run Maven using the -X switch to enable full debug logging.
[ERROR] 
[ERROR] For more information about the errors and possible solutions, please read the following
articles:
[ERROR] [Help 1] http://cwiki.apache.org/confluence/display/MAVEN/MojoExecutionException
Build step 'Execute shell' marked build as failure
[CHECKSTYLE] Collecting checkstyle analysis files...
[CHECKSTYLE] Finding all files that match the pattern **/target/checkstyle-result.xml
[CHECKSTYLE] Parsing 29 files in <https://builds.apache.org/job/Apache-falcon/ws/>
[CHECKSTYLE] Successfully parsed file <https://builds.apache.org/job/Apache-falcon/ws/acquisition/target/checkstyle-result.xml>
with 0 unique warnings and 0 duplicates.
[CHECKSTYLE] Successfully parsed file <https://builds.apache.org/job/Apache-falcon/ws/archival/target/checkstyle-result.xml>
with 0 unique warnings and 0 duplicates.
[CHECKSTYLE] Successfully parsed file <https://builds.apache.org/job/Apache-falcon/ws/build-tools/target/checkstyle-result.xml>
with 0 unique warnings and 0 duplicates.
[CHECKSTYLE] Successfully parsed file <https://builds.apache.org/job/Apache-falcon/ws/cli/target/checkstyle-result.xml>
with 0 unique warnings and 0 duplicates.
[CHECKSTYLE] Successfully parsed file <https://builds.apache.org/job/Apache-falcon/ws/client/target/checkstyle-result.xml>
with 0 unique warnings and 0 duplicates.
[CHECKSTYLE] Successfully parsed file <https://builds.apache.org/job/Apache-falcon/ws/common/target/checkstyle-result.xml>
with 0 unique warnings and 0 duplicates.
[CHECKSTYLE] Successfully parsed file <https://builds.apache.org/job/Apache-falcon/ws/docs/target/checkstyle-result.xml>
with 0 unique warnings and 0 duplicates.
[CHECKSTYLE] Successfully parsed file <https://builds.apache.org/job/Apache-falcon/ws/falcon-ui/target/checkstyle-result.xml>
with 0 unique warnings and 0 duplicates.
[CHECKSTYLE] Successfully parsed file <https://builds.apache.org/job/Apache-falcon/ws/hadoop-dependencies/target/checkstyle-result.xml>
with 0 unique warnings and 0 duplicates.
[CHECKSTYLE] Successfully parsed file <https://builds.apache.org/job/Apache-falcon/ws/lifecycle/target/checkstyle-result.xml>
with 0 unique warnings and 0 duplicates.
[CHECKSTYLE] Successfully parsed file <https://builds.apache.org/job/Apache-falcon/ws/messaging/target/checkstyle-result.xml>
with 0 unique warnings and 0 duplicates.
[CHECKSTYLE] Successfully parsed file <https://builds.apache.org/job/Apache-falcon/ws/metrics/target/checkstyle-result.xml>
with 0 unique warnings and 0 duplicates.
[CHECKSTYLE] Successfully parsed file <https://builds.apache.org/job/Apache-falcon/ws/oozie-el-extensions/target/checkstyle-result.xml>
with 0 unique warnings and 0 duplicates.
[CHECKSTYLE] Successfully parsed file <https://builds.apache.org/job/Apache-falcon/ws/oozie/target/checkstyle-result.xml>
with 0 unique warnings and 0 duplicates.
[CHECKSTYLE] Successfully parsed file <https://builds.apache.org/job/Apache-falcon/ws/prism/target/checkstyle-result.xml>
with 0 unique warnings and 0 duplicates.
[CHECKSTYLE] Successfully parsed file <https://builds.apache.org/job/Apache-falcon/ws/replication/target/checkstyle-result.xml>
with 0 unique warnings and 0 duplicates.
[CHECKSTYLE] Successfully parsed file <https://builds.apache.org/job/Apache-falcon/ws/rerun/target/checkstyle-result.xml>
with 0 unique warnings and 0 duplicates.
[CHECKSTYLE] Successfully parsed file <https://builds.apache.org/job/Apache-falcon/ws/retention/target/checkstyle-result.xml>
with 0 unique warnings and 0 duplicates.
[CHECKSTYLE] Successfully parsed file <https://builds.apache.org/job/Apache-falcon/ws/scheduler/target/checkstyle-result.xml>
with 0 unique warnings and 0 duplicates.
[CHECKSTYLE] Skipping file  of module <https://builds.apache.org/job/Apache-falcon/ws/target/checkstyle-result.xml>
because it's empty.
[CHECKSTYLE] Successfully parsed file <https://builds.apache.org/job/Apache-falcon/ws/test-tools/hadoop-webapp/target/checkstyle-result.xml>
with 0 unique warnings and 0 duplicates.
[CHECKSTYLE] Successfully parsed file <https://builds.apache.org/job/Apache-falcon/ws/test-tools/hcatalog-sharelib/target/checkstyle-result.xml>
with 0 unique warnings and 0 duplicates.
[CHECKSTYLE] Successfully parsed file <https://builds.apache.org/job/Apache-falcon/ws/test-tools/hive-sharelib/target/checkstyle-result.xml>
with 0 unique warnings and 0 duplicates.
[CHECKSTYLE] Successfully parsed file <https://builds.apache.org/job/Apache-falcon/ws/test-tools/oozie-sharelib/target/checkstyle-result.xml>
with 0 unique warnings and 0 duplicates.
[CHECKSTYLE] Successfully parsed file <https://builds.apache.org/job/Apache-falcon/ws/test-tools/pig-sharelib/target/checkstyle-result.xml>
with 0 unique warnings and 0 duplicates.
[CHECKSTYLE] Successfully parsed file <https://builds.apache.org/job/Apache-falcon/ws/test-tools/target/checkstyle-result.xml>
with 0 unique warnings and 0 duplicates.
[CHECKSTYLE] Successfully parsed file <https://builds.apache.org/job/Apache-falcon/ws/test-util/target/checkstyle-result.xml>
with 0 unique warnings and 0 duplicates.
[CHECKSTYLE] Successfully parsed file <https://builds.apache.org/job/Apache-falcon/ws/unit/target/checkstyle-result.xml>
with 0 unique warnings and 0 duplicates.
[CHECKSTYLE] Successfully parsed file <https://builds.apache.org/job/Apache-falcon/ws/webapp/target/checkstyle-result.xml>
with 0 unique warnings and 0 duplicates.
[CHECKSTYLE] Computing warning deltas based on reference build #887
[FINDBUGS] Collecting findbugs analysis files...
[FINDBUGS] Finding all files that match the pattern **/target/findbugs.xml
[FINDBUGS] Parsing 18 files in <https://builds.apache.org/job/Apache-falcon/ws/>
[FINDBUGS] Successfully parsed file <https://builds.apache.org/job/Apache-falcon/ws/cli/target/findbugs.xml>
with 0 unique warnings and 0 duplicates.
[FINDBUGS] Successfully parsed file <https://builds.apache.org/job/Apache-falcon/ws/client/target/findbugs.xml>
with 0 unique warnings and 0 duplicates.
[FINDBUGS] Successfully parsed file <https://builds.apache.org/job/Apache-falcon/ws/common/target/findbugs.xml>
with 0 unique warnings and 0 duplicates.
[FINDBUGS] Successfully parsed file <https://builds.apache.org/job/Apache-falcon/ws/hadoop-dependencies/target/findbugs.xml>
with 0 unique warnings and 0 duplicates.
[FINDBUGS] Successfully parsed file <https://builds.apache.org/job/Apache-falcon/ws/lifecycle/target/findbugs.xml>
with 0 unique warnings and 0 duplicates.
[FINDBUGS] Successfully parsed file <https://builds.apache.org/job/Apache-falcon/ws/messaging/target/findbugs.xml>
with 0 unique warnings and 0 duplicates.
[FINDBUGS] Successfully parsed file <https://builds.apache.org/job/Apache-falcon/ws/metrics/target/findbugs.xml>
with 0 unique warnings and 0 duplicates.
[FINDBUGS] Successfully parsed file <https://builds.apache.org/job/Apache-falcon/ws/oozie-el-extensions/target/findbugs.xml>
with 0 unique warnings and 0 duplicates.
[FINDBUGS] Successfully parsed file <https://builds.apache.org/job/Apache-falcon/ws/oozie/target/findbugs.xml>
with 0 unique warnings and 0 duplicates.
[FINDBUGS] Successfully parsed file <https://builds.apache.org/job/Apache-falcon/ws/prism/target/findbugs.xml>
with 0 unique warnings and 0 duplicates.
[FINDBUGS] Successfully parsed file <https://builds.apache.org/job/Apache-falcon/ws/replication/target/findbugs.xml>
with 0 unique warnings and 0 duplicates.
[FINDBUGS] Successfully parsed file <https://builds.apache.org/job/Apache-falcon/ws/rerun/target/findbugs.xml>
with 0 unique warnings and 0 duplicates.
[FINDBUGS] Successfully parsed file <https://builds.apache.org/job/Apache-falcon/ws/retention/target/findbugs.xml>
with 0 unique warnings and 0 duplicates.
[FINDBUGS] Successfully parsed file <https://builds.apache.org/job/Apache-falcon/ws/scheduler/target/findbugs.xml>
with 0 unique warnings and 0 duplicates.
[FINDBUGS] Successfully parsed file <https://builds.apache.org/job/Apache-falcon/ws/test-tools/hadoop-webapp/target/findbugs.xml>
with 0 unique warnings and 0 duplicates.
[FINDBUGS] Successfully parsed file <https://builds.apache.org/job/Apache-falcon/ws/test-util/target/findbugs.xml>
with 0 unique warnings and 0 duplicates.
[FINDBUGS] Successfully parsed file <https://builds.apache.org/job/Apache-falcon/ws/unit/target/findbugs.xml>
with 0 unique warnings and 0 duplicates.
[FINDBUGS] Successfully parsed file <https://builds.apache.org/job/Apache-falcon/ws/webapp/target/findbugs.xml>
with 0 unique warnings and 0 duplicates.
[FINDBUGS] Computing warning deltas based on reference build #887
Archiving artifacts
Compressed 16.76 MB of artifacts by 99.5% relative to #887
Recording test results
ERROR: Publisher 'Publish JUnit test result report' failed: Test reports were found but none
of them are new. Did tests run? 
For example, <https://builds.apache.org/job/Apache-falcon/ws/client/target/surefire-reports/junitreports/TEST-org.apache.falcon.cli.TestCLIParser.xml>
is 3 days 15 hr old

TestNG Reports Processing: START
Looking for TestNG results report in workspace using pattern: **/target/testng-results.xml
Did not find any matching files.

Mime
View raw message