falcon-dev mailing list archives

Site index · List index
Message view « Date » · « Thread »
Top « Date » · « Thread »
From Apache Jenkins Server <jenk...@builds.apache.org>
Subject Build failed in Jenkins: Apache-falcon #872
Date Tue, 29 Dec 2015 07:53:38 GMT
See <https://builds.apache.org/job/Apache-falcon/872/changes>

Changes:

[pallavi.rao] FALCON-1679 API to get type of scheduler(native/oozie)

------------------------------------------
Started by an SCM change
Started by an SCM change
[EnvInject] - Loading node environment variables.
Building remotely on H0 (Hadoop Tez) in workspace <https://builds.apache.org/job/Apache-falcon/ws/>
 > git rev-parse --is-inside-work-tree # timeout=10
Fetching changes from the remote Git repository
 > git config remote.origin.url https://git-wip-us.apache.org/repos/asf/falcon.git # timeout=10
Fetching upstream changes from https://git-wip-us.apache.org/repos/asf/falcon.git
 > git --version # timeout=10
 > git -c core.askpass=true fetch --tags --progress https://git-wip-us.apache.org/repos/asf/falcon.git
+refs/heads/*:refs/remotes/origin/*
 > git rev-parse refs/remotes/origin/master^{commit} # timeout=10
 > git rev-parse refs/remotes/origin/origin/master^{commit} # timeout=10
Checking out Revision 41631f955d17ac49e40f6360bba0c13cf51c7a4c (refs/remotes/origin/master)
 > git config core.sparsecheckout # timeout=10
 > git checkout -f 41631f955d17ac49e40f6360bba0c13cf51c7a4c
 > git rev-list 8671eae06c215e82597c90dd9388916d48ae3837 # timeout=10
Updating http://svn.apache.org/repos/asf/hadoop/nightly at revision '2015-12-29T07:53:21.560
+0000'
At revision 1722070
[Apache-falcon] $ /bin/bash -xe /tmp/hudson4383953129469128252.sh
+ source <https://builds.apache.org/job/Apache-falcon/ws/nightly/hudsonEnv.sh>
++ export TOOLS_HOME=/home/jenkins/tools
++ TOOLS_HOME=/home/jenkins/tools
++ export JAVA_HOME=/home/jenkins/tools/java/latest
++ JAVA_HOME=/home/jenkins/tools/java/latest
++ export ANT_HOME=/home/jenkins/tools/ant/latest
++ ANT_HOME=/home/jenkins/tools/ant/latest
++ export FORREST_HOME=/home/jenkins/tools/forrest/latest
++ FORREST_HOME=/home/jenkins/tools/forrest/latest
++ export JAVA5_HOME=/home/jenkins/tools/java/latest1.5
++ JAVA5_HOME=/home/jenkins/tools/java/latest1.5
++ export FINDBUGS_HOME=/home/jenkins/tools/findbugs/latest
++ FINDBUGS_HOME=/home/jenkins/tools/findbugs/latest
++ export CLOVER_HOME=/home/jenkins/tools/clover/latest
++ CLOVER_HOME=/home/jenkins/tools/clover/latest
++ export MAVEN_HOME=/home/jenkins/tools/maven/latest
++ MAVEN_HOME=/home/jenkins/tools/maven/latest
++ export PATH=/home/jenkins/jenkins-slave/tools/hudson.model.JDK/JDK_1.7_latest_/bin:/usr/local/sbin:/usr/local/bin:/usr/sbin:/usr/bin:/sbin:/bin:/usr/games:/usr/local/games:/home/jenkins/tools/java/latest/bin:/home/jenkins/tools/ant/latest/bin:
++ PATH=/home/jenkins/jenkins-slave/tools/hudson.model.JDK/JDK_1.7_latest_/bin:/usr/local/sbin:/usr/local/bin:/usr/sbin:/usr/bin:/sbin:/bin:/usr/games:/usr/local/games:/home/jenkins/tools/java/latest/bin:/home/jenkins/tools/ant/latest/bin:
++ export ANT_OPTS=-Xmx2048m
++ ANT_OPTS=-Xmx2048m
++ export MAVEN_OPTS=-Xmx2048m
++ MAVEN_OPTS=-Xmx2048m
++ TRUNK=<https://builds.apache.org/job/Apache-falcon/ws/trunk>
++ ulimit -n
60000
+ JAVA_HOME=/home/jenkins/tools/java/jdk1.7.0-64
+ PATH=/home/jenkins/tools/java/jdk1.7.0-64/bin:/home/jenkins/jenkins-slave/tools/hudson.model.JDK/JDK_1.7_latest_/bin:/usr/local/sbin:/usr/local/bin:/usr/sbin:/usr/bin:/sbin:/bin:/usr/games:/usr/local/games:/home/jenkins/tools/java/latest/bin:/home/jenkins/tools/ant/latest/bin:
+ export 'MAVEN_OPTS=-Xmx4096m -XX:MaxPermSize=1024m -noverify'
+ MAVEN_OPTS='-Xmx4096m -XX:MaxPermSize=1024m -noverify'
+ /home/jenkins/tools/maven/latest/bin/mvn clean verify -P test-patch,hadoop-2 -Drat.numUnapprovedLicenses=100
[INFO] Scanning for projects...
[WARNING] 
[WARNING] Some problems were encountered while building the effective model for org.apache.falcon:falcon-hadoop-webapp:war:0.9-SNAPSHOT
[WARNING] 'profiles.profile[hadoop-2].dependencies.dependency.(groupId:artifactId:type:classifier)'
must be unique: org.apache.hadoop:hadoop-distcp:jar -> duplicate declaration of version
(?) @ line 108, column 29
[WARNING] 
[WARNING] Some problems were encountered while building the effective model for org.apache.falcon:falcon-oozie-adaptor:jar:0.9-SNAPSHOT
[WARNING] 'build.plugins.plugin.version' for org.jvnet.jaxb2.maven2:maven-jaxb2-plugin is
missing. @ line 128, column 21
[WARNING] 
[WARNING] Some problems were encountered while building the effective model for org.apache.falcon:falcon-prism:war:0.9-SNAPSHOT
[WARNING] 'build.plugins.plugin.version' for org.codehaus.mojo:keytool-maven-plugin is missing.
@ line 182, column 21
[WARNING] 
[WARNING] Some problems were encountered while building the effective model for org.apache.falcon:falcon-feed-lifecycle:jar:0.9-SNAPSHOT
[WARNING] 'build.plugins.plugin.version' for org.jvnet.jaxb2.maven2:maven-jaxb2-plugin is
missing. @ line 100, column 21
[WARNING] 
[WARNING] Some problems were encountered while building the effective model for org.apache.falcon:falcon-webapp:war:0.9-SNAPSHOT
[WARNING] 'build.plugins.plugin.(groupId:artifactId)' must be unique but found duplicate declaration
of plugin org.apache.maven.plugins:maven-dependency-plugin @ line 423, column 21
[WARNING] 
[WARNING] It is highly recommended to fix these problems because they threaten the stability
of your build.
[WARNING] 
[WARNING] For this reason, future Maven versions might no longer support building such malformed
projects.
[WARNING] 
[INFO] ------------------------------------------------------------------------
[INFO] Reactor Build Order:
[INFO] 
[INFO] Apache Falcon
[INFO] Checkstyle
[INFO] Apache Falcon UI
[INFO] Build Tools
[INFO] Apache Falcon Java client
[INFO] Apache Falcon CLI client
[INFO] Apache Falcon Metrics
[INFO] Apache Falcon Hadoop Dependencies
[INFO] Apache Falcon Test Utility
[INFO] Apache Falcon Commons
[INFO] Apache Falcon Oozie EL Extension
[INFO] Apache Falcon Embedded Hadoop - Test Cluster
[INFO] Apache Falcon Sharelib Hive - Test Cluster
[INFO] Apache Falcon Sharelib Pig - Test Cluster
[INFO] Apache Falcon Sharelib Hcatalog - Test Cluster
[INFO] Apache Falcon Sharelib Oozie - Test Cluster
[INFO] Apache Falcon Test Tools - Test Cluster
[INFO] Apache Falcon Messaging
[INFO] Apache Falcon LIfecycle Module
[INFO] Apache Falcon Oozie Adaptor
[INFO] Apache Falcon Scheduler
[INFO] Apache Falcon Acquisition
[INFO] Apache Falcon Distcp Replication
[INFO] Apache Falcon Retention
[INFO] Apache Falcon Archival
[INFO] Apache Falcon Rerun
[INFO] Apache Falcon Prism
[INFO] falcon-unit
[INFO] Apache Falcon Web Application
[INFO] Apache Falcon Documentation
[INFO] 
[INFO] Using the builder org.apache.maven.lifecycle.internal.builder.singlethreaded.SingleThreadedBuilder
with a thread count of 1
[INFO]                                                                         
[INFO] ------------------------------------------------------------------------
[INFO] Building Apache Falcon 0.9-SNAPSHOT
[INFO] ------------------------------------------------------------------------
[INFO] 
[INFO] --- maven-clean-plugin:2.5:clean (default-clean) @ falcon-main ---
[INFO] Deleting <https://builds.apache.org/job/Apache-falcon/ws/target>
[INFO] 
[INFO] --- maven-enforcer-plugin:1.3.1:enforce (enforce-property) @ falcon-main ---
[INFO] 
[INFO] --- buildnumber-maven-plugin:1.0:create (default) @ falcon-main ---
[INFO] Checking for local modifications: skipped.
[INFO] Updating project files from SCM: skipped.
[INFO] Executing: /bin/sh -c cd <https://builds.apache.org/job/Apache-falcon/ws/> &&
git show
[INFO] Working directory: <https://builds.apache.org/job/Apache-falcon/ws/>
[INFO] Storing buildNumber: 41631f955d17ac49e40f6360bba0c13cf51c7a4c at timestamp: 1451375616771
[INFO] Executing: /bin/sh -c cd <https://builds.apache.org/job/Apache-falcon/ws/> &&
git show
[INFO] Working directory: <https://builds.apache.org/job/Apache-falcon/ws/>
[INFO] Storing buildScmBranch: UNKNOWN
[INFO] 
[INFO] --- maven-remote-resources-plugin:1.5:process (default) @ falcon-main ---
[INFO] 
[INFO] --- maven-site-plugin:3.4:site (default) @ falcon-main ---
[INFO] maven.site.skip = true: Skipping site generation
[INFO] 
[INFO] --- maven-site-plugin:3.4:attach-descriptor (attach-descriptor) @ falcon-main ---
[INFO] 
[INFO] --- maven-failsafe-plugin:2.16:integration-test (integration-test) @ falcon-main ---
[INFO] No tests to run.
[INFO] 
[INFO] --- maven-failsafe-plugin:2.16:verify (verify) @ falcon-main ---
[INFO] No tests to run.
[INFO] 
[INFO] --- apache-rat-plugin:0.7:check (rat-check) @ falcon-main ---
[INFO] Exclude: *.txt
[INFO] Exclude: **/*.txt
[INFO] Exclude: .git/**
[INFO] Exclude: **/.idea/**
[INFO] Exclude: **/*.twiki
[INFO] Exclude: **/*.iml
[INFO] Exclude: **/target/**
[INFO] Exclude: **/activemq-data/**
[INFO] Exclude: **/build/**
[INFO] Exclude: **/*.patch
[INFO] Exclude: derby.log
[INFO] Exclude: **/logs/**
[INFO] Exclude: **/.classpath
[INFO] Exclude: **/.project
[INFO] Exclude: **/.settings/**
[INFO] Exclude: **/test-output/**
[INFO] Exclude: **/data.txt
[INFO] Exclude: **/maven-eclipse.xml
[INFO] Exclude: **/.externalToolBuilders/**
[INFO] Exclude: html5-ui/**
[INFO] Exclude: **/metastore_db/**
[INFO] Exclude: **/db1.log
[INFO] Exclude: **/db1.properties
[INFO] Exclude: **/db1.script
[INFO] 
[INFO] --- maven-checkstyle-plugin:2.9.1:check (checkstyle-check) @ falcon-main ---
[INFO] ------------------------------------------------------------------------
[INFO] Reactor Summary:
[INFO] 
[INFO] Apache Falcon ..................................... FAILURE [  5.038 s]
[INFO] Checkstyle ........................................ SKIPPED
[INFO] Apache Falcon UI .................................. SKIPPED
[INFO] Build Tools ....................................... SKIPPED
[INFO] Apache Falcon Java client ......................... SKIPPED
[INFO] Apache Falcon CLI client .......................... SKIPPED
[INFO] Apache Falcon Metrics ............................. SKIPPED
[INFO] Apache Falcon Hadoop Dependencies ................. SKIPPED
[INFO] Apache Falcon Test Utility ........................ SKIPPED
[INFO] Apache Falcon Commons ............................. SKIPPED
[INFO] Apache Falcon Oozie EL Extension .................. SKIPPED
[INFO] Apache Falcon Embedded Hadoop - Test Cluster ...... SKIPPED
[INFO] Apache Falcon Sharelib Hive - Test Cluster ........ SKIPPED
[INFO] Apache Falcon Sharelib Pig - Test Cluster ......... SKIPPED
[INFO] Apache Falcon Sharelib Hcatalog - Test Cluster .... SKIPPED
[INFO] Apache Falcon Sharelib Oozie - Test Cluster ....... SKIPPED
[INFO] Apache Falcon Test Tools - Test Cluster ........... SKIPPED
[INFO] Apache Falcon Messaging ........................... SKIPPED
[INFO] Apache Falcon LIfecycle Module .................... SKIPPED
[INFO] Apache Falcon Oozie Adaptor ....................... SKIPPED
[INFO] Apache Falcon Scheduler ........................... SKIPPED
[INFO] Apache Falcon Acquisition ......................... SKIPPED
[INFO] Apache Falcon Distcp Replication .................. SKIPPED
[INFO] Apache Falcon Retention ........................... SKIPPED
[INFO] Apache Falcon Archival ............................ SKIPPED
[INFO] Apache Falcon Rerun ............................... SKIPPED
[INFO] Apache Falcon Prism ............................... SKIPPED
[INFO] falcon-unit ....................................... SKIPPED
[INFO] Apache Falcon Web Application ..................... SKIPPED
[INFO] Apache Falcon Documentation ....................... SKIPPED
[INFO] ------------------------------------------------------------------------
[INFO] BUILD FAILURE
[INFO] ------------------------------------------------------------------------
[INFO] Total time: 5.984 s
[INFO] Finished at: 2015-12-29T07:53:40+00:00
[INFO] Final Memory: 32M/911M
[INFO] ------------------------------------------------------------------------
[ERROR] Failed to execute goal org.apache.maven.plugins:maven-checkstyle-plugin:2.9.1:check
(checkstyle-check) on project falcon-main: Execution checkstyle-check of goal org.apache.maven.plugins:maven-checkstyle-plugin:2.9.1:check
failed: Plugin org.apache.maven.plugins:maven-checkstyle-plugin:2.9.1 or one of its dependencies
could not be resolved: Failure to find org.apache.falcon:checkstyle:jar:0.9-SNAPSHOT in http://repository.apache.org/snapshots
was cached in the local repository, resolution will not be reattempted until the update interval
of Nexus has elapsed or updates are forced -> [Help 1]
[ERROR] 
[ERROR] To see the full stack trace of the errors, re-run Maven with the -e switch.
[ERROR] Re-run Maven using the -X switch to enable full debug logging.
[ERROR] 
[ERROR] For more information about the errors and possible solutions, please read the following
articles:
[ERROR] [Help 1] http://cwiki.apache.org/confluence/display/MAVEN/PluginResolutionException
Build step 'Execute shell' marked build as failure
[CHECKSTYLE] Collecting checkstyle analysis files...
[CHECKSTYLE] Finding all files that match the pattern **/target/checkstyle-result.xml
[CHECKSTYLE] Computing warning deltas based on reference build #869
[FINDBUGS] Collecting findbugs analysis files...
[FINDBUGS] Finding all files that match the pattern **/target/findbugs.xml
[FINDBUGS] Computing warning deltas based on reference build #869
Archiving artifacts
Recording test results
ERROR: Publisher 'Publish JUnit test result report' failed: No test report files were found.
Configuration error?
TestNG Reports Processing: START
Looking for TestNG results report in workspace using pattern: **/target/testng-results.xml
Did not find any matching files.

Mime
View raw message