falcon-dev mailing list archives

Site index · List index
Message view « Date » · « Thread »
Top « Date » · « Thread »
From Apache Jenkins Server <jenk...@builds.apache.org>
Subject Build failed in Jenkins: Apache-falcon #870
Date Mon, 28 Dec 2015 16:10:51 GMT
See <https://builds.apache.org/job/Apache-falcon/870/changes>

Changes:

[pallavi.rao] FALCON-1577 Migration of EntityManagerJerseyIT to use falcon unit

[pallavi.rao] FALCON-1512 Implement touch feature for native scheduler

[pallavi.rao] FALCON-1562 Documentation for enabling native scheduler in falcon

[ajaynsit] FALCON-1617 Enable SLA monitoring for instances in past. Contributed by

[ajaynsit] FALCON-1641 Triage on an invalid feed instance throws

[ajaynsit] FALCON-1447 Integration Tests for native scheduler. Contributed by Pavan

[ajaynsit] FALCON-1644 Retention : Some feed instances are never deleted by

[ajaynsit] FALCON-1635 Migration of EntityManagerJerseySmokeIT to use falcon unit.

[ajaynsit] FALCON-1669 Falcon should show more helpful message when it is unable to

[ajaynsit] FALCON-1636 Add Rerun API In Falcon Native Scheduler. Contributed by

[pallavi.rao] FALCON-1639 Implement update feature for native scheduler

[bvellanki]   FALCON-1645 Ability to export to database. Contributed by Venkatesan

[sshivalingamurthy] FALCON-570 Falcon needs to publish maven artifacts. Contributed by

[ajaynsit] FALCON-1683 Inconsistent behavior when user tries to switch schedulers.

[ajaynsit] FALCON-1680 Error message is not intuitive when entity schedule fails.

[ajaynsit] FALCON-1681 Improve logging for idempotent behaviour while scheduling

[pragya] FALCON-1377 Add tests in falcon for the Triage API. Contributed by

[pragya] FALCON-1689 NoOutputProcessTest fails due to scheme missing in

[ajaynsit] FALCON-1640 Cascading Delete for instances in Native Scheduler.

------------------------------------------
Started by user abayer
[EnvInject] - Loading node environment variables.
Building remotely on H0 (Hadoop Tez) in workspace <https://builds.apache.org/job/Apache-falcon/ws/>
Cloning the remote Git repository
Cloning repository https://git-wip-us.apache.org/repos/asf/falcon.git
 > git init <https://builds.apache.org/job/Apache-falcon/ws/> # timeout=10
Fetching upstream changes from https://git-wip-us.apache.org/repos/asf/falcon.git
 > git --version # timeout=10
 > git -c core.askpass=true fetch --tags --progress https://git-wip-us.apache.org/repos/asf/falcon.git
+refs/heads/*:refs/remotes/origin/*
 > git config remote.origin.url https://git-wip-us.apache.org/repos/asf/falcon.git # timeout=10
 > git config --add remote.origin.fetch +refs/heads/*:refs/remotes/origin/* # timeout=10
 > git config remote.origin.url https://git-wip-us.apache.org/repos/asf/falcon.git # timeout=10
Fetching upstream changes from https://git-wip-us.apache.org/repos/asf/falcon.git
 > git -c core.askpass=true fetch --tags --progress https://git-wip-us.apache.org/repos/asf/falcon.git
+refs/heads/*:refs/remotes/origin/*
 > git rev-parse refs/remotes/origin/master^{commit} # timeout=10
 > git rev-parse refs/remotes/origin/origin/master^{commit} # timeout=10
Checking out Revision 7a74bb0c6ee25d1d0bc5944b3af0438527343956 (refs/remotes/origin/master)
 > git config core.sparsecheckout # timeout=10
 > git checkout -f 7a74bb0c6ee25d1d0bc5944b3af0438527343956
 > git rev-list 4445798bebd0420d86b5f091354b1155a3a09f77 # timeout=10
Checking out a fresh workspace because <https://builds.apache.org/job/Apache-falcon/ws/nightly>
doesn't exist
Cleaning local Directory nightly
Checking out http://svn.apache.org/repos/asf/hadoop/nightly at revision '2015-12-28T16:09:34.564
+0000'
AU        processHadoopPatchEmail.sh
A         README.txt
A         test-patch
A         test-patch/test-patch.sh
AU        tar-munge
A         commitBuild.sh
AU        jenkinsPrecommitAdmin.py
A         hudsonEnv.sh
A         jenkinsSetup
A         jenkinsSetup/installTools.sh
AU        hudsonBuildHadoopNightly.sh
A         buildMR-279Branch.sh
AU        hudsonBuildHadoopPatch.sh
AU        hudsonBuildHadoopRelease.sh
AU        processHadoopPatchEmailRemote.sh
At revision 1721942
[Apache-falcon] $ /bin/bash -xe /tmp/hudson722268365811622561.sh
+ source <https://builds.apache.org/job/Apache-falcon/ws/nightly/hudsonEnv.sh>
++ export TOOLS_HOME=/home/jenkins/tools
++ TOOLS_HOME=/home/jenkins/tools
++ export JAVA_HOME=/home/jenkins/tools/java/latest
++ JAVA_HOME=/home/jenkins/tools/java/latest
++ export ANT_HOME=/home/jenkins/tools/ant/latest
++ ANT_HOME=/home/jenkins/tools/ant/latest
++ export FORREST_HOME=/home/jenkins/tools/forrest/latest
++ FORREST_HOME=/home/jenkins/tools/forrest/latest
++ export JAVA5_HOME=/home/jenkins/tools/java/latest1.5
++ JAVA5_HOME=/home/jenkins/tools/java/latest1.5
++ export FINDBUGS_HOME=/home/jenkins/tools/findbugs/latest
++ FINDBUGS_HOME=/home/jenkins/tools/findbugs/latest
++ export CLOVER_HOME=/home/jenkins/tools/clover/latest
++ CLOVER_HOME=/home/jenkins/tools/clover/latest
++ export MAVEN_HOME=/home/jenkins/tools/maven/latest
++ MAVEN_HOME=/home/jenkins/tools/maven/latest
++ export PATH=/home/jenkins/jenkins-slave/tools/hudson.model.JDK/JDK_1.7_latest_/bin:/usr/local/sbin:/usr/local/bin:/usr/sbin:/usr/bin:/sbin:/bin:/usr/games:/usr/local/games:/home/jenkins/tools/java/latest/bin:/home/jenkins/tools/ant/latest/bin:
++ PATH=/home/jenkins/jenkins-slave/tools/hudson.model.JDK/JDK_1.7_latest_/bin:/usr/local/sbin:/usr/local/bin:/usr/sbin:/usr/bin:/sbin:/bin:/usr/games:/usr/local/games:/home/jenkins/tools/java/latest/bin:/home/jenkins/tools/ant/latest/bin:
++ export ANT_OPTS=-Xmx2048m
++ ANT_OPTS=-Xmx2048m
++ export MAVEN_OPTS=-Xmx2048m
++ MAVEN_OPTS=-Xmx2048m
++ TRUNK=<https://builds.apache.org/job/Apache-falcon/ws/trunk>
++ ulimit -n
60000
+ JAVA_HOME=/home/jenkins/tools/java/jdk1.7.0-64
+ PATH=/home/jenkins/tools/java/jdk1.7.0-64/bin:/home/jenkins/jenkins-slave/tools/hudson.model.JDK/JDK_1.7_latest_/bin:/usr/local/sbin:/usr/local/bin:/usr/sbin:/usr/bin:/sbin:/bin:/usr/games:/usr/local/games:/home/jenkins/tools/java/latest/bin:/home/jenkins/tools/ant/latest/bin:
+ export 'MAVEN_OPTS=-Xmx4096m -XX:MaxPermSize=1024m -noverify'
+ MAVEN_OPTS='-Xmx4096m -XX:MaxPermSize=1024m -noverify'
+ /home/jenkins/tools/maven/latest/bin/mvn clean verify -P test-patch,hadoop-2 -Drat.numUnapprovedLicenses=100
[INFO] Scanning for projects...
[WARNING] 
[WARNING] Some problems were encountered while building the effective model for org.apache.falcon:falcon-hadoop-webapp:war:0.9-SNAPSHOT
[WARNING] 'profiles.profile[hadoop-2].dependencies.dependency.(groupId:artifactId:type:classifier)'
must be unique: org.apache.hadoop:hadoop-distcp:jar -> duplicate declaration of version
(?) @ line 108, column 29
[WARNING] 
[WARNING] Some problems were encountered while building the effective model for org.apache.falcon:falcon-oozie-adaptor:jar:0.9-SNAPSHOT
[WARNING] 'build.plugins.plugin.version' for org.jvnet.jaxb2.maven2:maven-jaxb2-plugin is
missing. @ line 128, column 21
[WARNING] 
[WARNING] Some problems were encountered while building the effective model for org.apache.falcon:falcon-prism:war:0.9-SNAPSHOT
[WARNING] 'build.plugins.plugin.version' for org.codehaus.mojo:keytool-maven-plugin is missing.
@ line 182, column 21
[WARNING] 
[WARNING] Some problems were encountered while building the effective model for org.apache.falcon:falcon-feed-lifecycle:jar:0.9-SNAPSHOT
[WARNING] 'build.plugins.plugin.version' for org.jvnet.jaxb2.maven2:maven-jaxb2-plugin is
missing. @ line 100, column 21
[WARNING] 
[WARNING] Some problems were encountered while building the effective model for org.apache.falcon:falcon-webapp:war:0.9-SNAPSHOT
[WARNING] 'build.plugins.plugin.(groupId:artifactId)' must be unique but found duplicate declaration
of plugin org.apache.maven.plugins:maven-dependency-plugin @ line 423, column 21
[WARNING] 
[WARNING] It is highly recommended to fix these problems because they threaten the stability
of your build.
[WARNING] 
[WARNING] For this reason, future Maven versions might no longer support building such malformed
projects.
[WARNING] 
[INFO] ------------------------------------------------------------------------
[INFO] Reactor Build Order:
[INFO] 
[INFO] Apache Falcon
[INFO] Checkstyle
[INFO] Apache Falcon UI
[INFO] Build Tools
[INFO] Apache Falcon Java client
[INFO] Apache Falcon CLI client
[INFO] Apache Falcon Metrics
[INFO] Apache Falcon Hadoop Dependencies
[INFO] Apache Falcon Test Utility
[INFO] Apache Falcon Commons
[INFO] Apache Falcon Oozie EL Extension
[INFO] Apache Falcon Embedded Hadoop - Test Cluster
[INFO] Apache Falcon Sharelib Hive - Test Cluster
[INFO] Apache Falcon Sharelib Pig - Test Cluster
[INFO] Apache Falcon Sharelib Hcatalog - Test Cluster
[INFO] Apache Falcon Sharelib Oozie - Test Cluster
[INFO] Apache Falcon Test Tools - Test Cluster
[INFO] Apache Falcon Messaging
[INFO] Apache Falcon LIfecycle Module
[INFO] Apache Falcon Oozie Adaptor
[INFO] Apache Falcon Scheduler
[INFO] Apache Falcon Acquisition
[INFO] Apache Falcon Distcp Replication
[INFO] Apache Falcon Retention
[INFO] Apache Falcon Archival
[INFO] Apache Falcon Rerun
[INFO] Apache Falcon Prism
[INFO] falcon-unit
[INFO] Apache Falcon Web Application
[INFO] Apache Falcon Documentation
[INFO] 
[INFO] Using the builder org.apache.maven.lifecycle.internal.builder.singlethreaded.SingleThreadedBuilder
with a thread count of 1
[INFO]                                                                         
[INFO] ------------------------------------------------------------------------
[INFO] Building Apache Falcon 0.9-SNAPSHOT
[INFO] ------------------------------------------------------------------------
[INFO] 
[INFO] --- maven-clean-plugin:2.5:clean (default-clean) @ falcon-main ---
[INFO] 
[INFO] --- maven-enforcer-plugin:1.3.1:enforce (enforce-property) @ falcon-main ---
[INFO] 
[INFO] --- buildnumber-maven-plugin:1.0:create (default) @ falcon-main ---
[INFO] Checking for local modifications: skipped.
[INFO] Updating project files from SCM: skipped.
[INFO] Executing: /bin/sh -c cd <https://builds.apache.org/job/Apache-falcon/ws/> &&
git show
[INFO] Working directory: <https://builds.apache.org/job/Apache-falcon/ws/>
[INFO] Storing buildNumber: 7a74bb0c6ee25d1d0bc5944b3af0438527343956 at timestamp: 1451319044141
[INFO] Executing: /bin/sh -c cd <https://builds.apache.org/job/Apache-falcon/ws/> &&
git show
[INFO] Working directory: <https://builds.apache.org/job/Apache-falcon/ws/>
[INFO] Storing buildScmBranch: UNKNOWN
[INFO] 
[INFO] --- maven-remote-resources-plugin:1.5:process (default) @ falcon-main ---
[INFO] 
[INFO] --- maven-site-plugin:3.4:site (default) @ falcon-main ---
[INFO] maven.site.skip = true: Skipping site generation
[INFO] 
[INFO] --- maven-site-plugin:3.4:attach-descriptor (attach-descriptor) @ falcon-main ---
[INFO] 
[INFO] --- maven-failsafe-plugin:2.16:integration-test (integration-test) @ falcon-main ---
[INFO] No tests to run.
[INFO] 
[INFO] --- maven-failsafe-plugin:2.16:verify (verify) @ falcon-main ---
[INFO] No tests to run.
[INFO] 
[INFO] --- apache-rat-plugin:0.7:check (rat-check) @ falcon-main ---
[INFO] Exclude: *.txt
[INFO] Exclude: **/*.txt
[INFO] Exclude: .git/**
[INFO] Exclude: **/.idea/**
[INFO] Exclude: **/*.twiki
[INFO] Exclude: **/*.iml
[INFO] Exclude: **/target/**
[INFO] Exclude: **/activemq-data/**
[INFO] Exclude: **/build/**
[INFO] Exclude: **/*.patch
[INFO] Exclude: derby.log
[INFO] Exclude: **/logs/**
[INFO] Exclude: **/.classpath
[INFO] Exclude: **/.project
[INFO] Exclude: **/.settings/**
[INFO] Exclude: **/test-output/**
[INFO] Exclude: **/data.txt
[INFO] Exclude: **/maven-eclipse.xml
[INFO] Exclude: **/.externalToolBuilders/**
[INFO] Exclude: html5-ui/**
[INFO] Exclude: **/metastore_db/**
[INFO] Exclude: **/db1.log
[INFO] Exclude: **/db1.properties
[INFO] Exclude: **/db1.script
[INFO] 
[INFO] --- maven-checkstyle-plugin:2.9.1:check (checkstyle-check) @ falcon-main ---
Downloading: http://repository.apache.org/snapshots/org/apache/falcon/checkstyle/0.9-SNAPSHOT/maven-metadata.xml

Downloading: http://repository.apache.org/snapshots/org/apache/falcon/checkstyle/0.9-SNAPSHOT/checkstyle-0.9-SNAPSHOT.jar

[INFO] ------------------------------------------------------------------------
[INFO] Reactor Summary:
[INFO] 
[INFO] Apache Falcon ..................................... FAILURE [  4.496 s]
[INFO] Checkstyle ........................................ SKIPPED
[INFO] Apache Falcon UI .................................. SKIPPED
[INFO] Build Tools ....................................... SKIPPED
[INFO] Apache Falcon Java client ......................... SKIPPED
[INFO] Apache Falcon CLI client .......................... SKIPPED
[INFO] Apache Falcon Metrics ............................. SKIPPED
[INFO] Apache Falcon Hadoop Dependencies ................. SKIPPED
[INFO] Apache Falcon Test Utility ........................ SKIPPED
[INFO] Apache Falcon Commons ............................. SKIPPED
[INFO] Apache Falcon Oozie EL Extension .................. SKIPPED
[INFO] Apache Falcon Embedded Hadoop - Test Cluster ...... SKIPPED
[INFO] Apache Falcon Sharelib Hive - Test Cluster ........ SKIPPED
[INFO] Apache Falcon Sharelib Pig - Test Cluster ......... SKIPPED
[INFO] Apache Falcon Sharelib Hcatalog - Test Cluster .... SKIPPED
[INFO] Apache Falcon Sharelib Oozie - Test Cluster ....... SKIPPED
[INFO] Apache Falcon Test Tools - Test Cluster ........... SKIPPED
[INFO] Apache Falcon Messaging ........................... SKIPPED
[INFO] Apache Falcon LIfecycle Module .................... SKIPPED
[INFO] Apache Falcon Oozie Adaptor ....................... SKIPPED
[INFO] Apache Falcon Scheduler ........................... SKIPPED
[INFO] Apache Falcon Acquisition ......................... SKIPPED
[INFO] Apache Falcon Distcp Replication .................. SKIPPED
[INFO] Apache Falcon Retention ........................... SKIPPED
[INFO] Apache Falcon Archival ............................ SKIPPED
[INFO] Apache Falcon Rerun ............................... SKIPPED
[INFO] Apache Falcon Prism ............................... SKIPPED
[INFO] falcon-unit ....................................... SKIPPED
[INFO] Apache Falcon Web Application ..................... SKIPPED
[INFO] Apache Falcon Documentation ....................... SKIPPED
[INFO] ------------------------------------------------------------------------
[INFO] BUILD FAILURE
[INFO] ------------------------------------------------------------------------
[INFO] Total time: 5.239 s
[INFO] Finished at: 2015-12-28T16:10:47+00:00
[INFO] Final Memory: 34M/911M
[INFO] ------------------------------------------------------------------------
[ERROR] Failed to execute goal org.apache.maven.plugins:maven-checkstyle-plugin:2.9.1:check
(checkstyle-check) on project falcon-main: Execution checkstyle-check of goal org.apache.maven.plugins:maven-checkstyle-plugin:2.9.1:check
failed: Plugin org.apache.maven.plugins:maven-checkstyle-plugin:2.9.1 or one of its dependencies
could not be resolved: Could not find artifact org.apache.falcon:checkstyle:jar:0.9-SNAPSHOT
in Nexus (http://repository.apache.org/snapshots) -> [Help 1]
[ERROR] 
[ERROR] To see the full stack trace of the errors, re-run Maven with the -e switch.
[ERROR] Re-run Maven using the -X switch to enable full debug logging.
[ERROR] 
[ERROR] For more information about the errors and possible solutions, please read the following
articles:
[ERROR] [Help 1] http://cwiki.apache.org/confluence/display/MAVEN/PluginResolutionException
Build step 'Execute shell' marked build as failure
[CHECKSTYLE] Collecting checkstyle analysis files...
[CHECKSTYLE] Finding all files that match the pattern **/target/checkstyle-result.xml
[CHECKSTYLE] Computing warning deltas based on reference build #869
[FINDBUGS] Collecting findbugs analysis files...
[FINDBUGS] Finding all files that match the pattern **/target/findbugs.xml
[FINDBUGS] Computing warning deltas based on reference build #869
Archiving artifacts
Recording test results
ERROR: Publisher 'Publish JUnit test result report' failed: No test report files were found.
Configuration error?
TestNG Reports Processing: START
Looking for TestNG results report in workspace using pattern: **/target/testng-results.xml
Did not find any matching files.

Mime
View raw message