falcon-dev mailing list archives

Site index · List index
Message view « Date » · « Thread »
Top « Date » · « Thread »
From "Saktheesh Balaraj (JIRA)" <j...@apache.org>
Subject [jira] [Commented] (FALCON-1620) Unable to build Falcon: Failed to execute goal org.codehaus.mojo:exec-maven-plugin:1.2.1:exec (BUILD-OOZIE)
Date Fri, 20 Nov 2015 10:37:11 GMT

    [ https://issues.apache.org/jira/browse/FALCON-1620?page=com.atlassian.jira.plugin.system.issuetabpanels:comment-tabpanel&focusedCommentId=15015569#comment-15015569
] 

Saktheesh Balaraj commented on FALCON-1620:
-------------------------------------------

[~pavan kumar] yes, I'm using HDP 2.3.2 which comes with Falcon 0.6.1. I found an oozie issue
with this particular version. Should I try a different maven version? (Installation-steps.txt
says 3.x)

> Unable to build Falcon: Failed to execute goal org.codehaus.mojo:exec-maven-plugin:1.2.1:exec
(BUILD-OOZIE) 
> ------------------------------------------------------------------------------------------------------------
>
>                 Key: FALCON-1620
>                 URL: https://issues.apache.org/jira/browse/FALCON-1620
>             Project: Falcon
>          Issue Type: Bug
>    Affects Versions: 0.6.1
>         Environment: java version "1.7.0_91"
> OS name: "linux", version: "2.6.32-573.7.1.el6.x86_64", arch: "amd64", family: "unix"
> Apache Maven 3.3.9 
>            Reporter: Saktheesh Balaraj
>            Assignee: pavan kumar kolamuri
>            Priority: Blocker
>
> Steps Followed:
> ~~~~~~~~~~~~~
> git clone https://git-wip-us.apache.org/repos/asf/falcon.git falcon
>  cd falcon
> export MAVEN_OPTS="-Xmx1024m -XX:MaxPermSize=256m -noverify" && mvn clean install
> Trace:
> ~~~~~
> /usr/share/apache-maven/bin/mvn clean source:jar install -DjavaVersion=1.7 -DtargetJavaVersion=1.6
-DskipTests -Phadoop-2
> -Dmaven.multiModuleProjectDirectory system property is not set. Check $M2_HOME environment
variable and mvn script match.[INFO] ------------------------------------------------------------------------
> [INFO] Reactor Summary:
> [INFO] 
> [INFO] Apache Falcon ...................................... SUCCESS [  6.314 s]
> [INFO] Apache Falcon UI ................................... SUCCESS [ 23.955 s]
> [INFO] Checkstyle ......................................... SUCCESS [  2.881 s]
> [INFO] Build Tools ........................................ FAILURE [  3.421 s]
> [INFO] Apache Falcon CLI client ........................... SKIPPED
> [INFO] Apache Falcon Metrics .............................. SKIPPED
> [INFO] Apache Falcon Hadoop Dependencies .................. SKIPPED
> [INFO] Apache Falcon Test Utility ......................... SKIPPED
> [INFO] Apache Falcon Commons .............................. SKIPPED
> [INFO] Apache Falcon Oozie EL Extension ................... SKIPPED
> [INFO] Apache Falcon Embedded Hadoop - Test Cluster ....... SKIPPED
> [INFO] Apache Falcon Sharelib Hive - Test Cluster ......... SKIPPED
> [INFO] Apache Falcon Sharelib Pig - Test Cluster .......... SKIPPED
> [INFO] Apache Falcon Sharelib Hcatalog - Test Cluster ..... SKIPPED
> [INFO] Apache Falcon Sharelib Oozie - Test Cluster ........ SKIPPED
> [INFO] Apache Falcon Test Tools - Test Cluster ............ SKIPPED
> [INFO] Apache Falcon Messaging ............................ SKIPPED
> [INFO] Apache Falcon Oozie Adaptor ........................ SKIPPED
> [INFO] Apache Falcon Acquisition .......................... SKIPPED
> [INFO] Apache Falcon Replication .......................... SKIPPED
> [INFO] Apache Falcon Retention ............................ SKIPPED
> [INFO] Apache Falcon Archival ............................. SKIPPED
> [INFO] Apache Falcon Rerun ................................ SKIPPED
> [INFO] Apache Falcon Prism ................................ SKIPPED
> [INFO] Apache Falcon Web Application ...................... SKIPPED
> [INFO] Apache Falcon Documentation ........................ SKIPPED
> [INFO] ------------------------------------------------------------------------
> [INFO] BUILD FAILURE
> [INFO] ------------------------------------------------------------------------
> [INFO] Total time: 38.475 s
> [INFO] Finished at: 2015-11-20T09:50:34+00:00
> [INFO] Final Memory: 32M/348M
> [INFO] ------------------------------------------------------------------------
> [ERROR] Failed to execute goal org.codehaus.mojo:exec-maven-plugin:1.2.1:exec (BUILD-OOZIE)
on project build-tools: Command execution failed. Process exited with an error: 1 (Exit value:
1) -> [Help 1]
> org.apache.maven.lifecycle.LifecycleExecutionException: Failed to execute goal org.codehaus.mojo:exec-maven-plugin:1.2.1:exec
(BUILD-OOZIE) on project build-tools: Command execution failed.
> 	at org.apache.maven.lifecycle.internal.MojoExecutor.execute(MojoExecutor.java:212)
> 	at org.apache.maven.lifecycle.internal.MojoExecutor.execute(MojoExecutor.java:153)
> 	at org.apache.maven.lifecycle.internal.MojoExecutor.execute(MojoExecutor.java:145)
> 	at org.apache.maven.lifecycle.internal.LifecycleModuleBuilder.buildProject(LifecycleModuleBuilder.java:116)
> 	at org.apache.maven.lifecycle.internal.LifecycleModuleBuilder.buildProject(LifecycleModuleBuilder.java:80)
> 	at org.apache.maven.lifecycle.internal.builder.singlethreaded.SingleThreadedBuilder.build(SingleThreadedBuilder.java:51)
> 	at org.apache.maven.lifecycle.internal.LifecycleStarter.execute(LifecycleStarter.java:128)
> 	at org.apache.maven.DefaultMaven.doExecute(DefaultMaven.java:307)
> 	at org.apache.maven.DefaultMaven.doExecute(DefaultMaven.java:193)
> 	at org.apache.maven.DefaultMaven.execute(DefaultMaven.java:106)
> 	at org.apache.maven.cli.MavenCli.execute(MavenCli.java:863)
> 	at org.apache.maven.cli.MavenCli.doMain(MavenCli.java:288)
> 	at org.apache.maven.cli.MavenCli.main(MavenCli.java:199)
> 	at sun.reflect.NativeMethodAccessorImpl.invoke0(Native Method)
> 	at sun.reflect.NativeMethodAccessorImpl.invoke(NativeMethodAccessorImpl.java:57)
> 	at sun.reflect.DelegatingMethodAccessorImpl.invoke(DelegatingMethodAccessorImpl.java:43)
> 	at java.lang.reflect.Method.invoke(Method.java:606)
> 	at org.codehaus.plexus.classworlds.launcher.Launcher.launchEnhanced(Launcher.java:289)
> 	at org.codehaus.plexus.classworlds.launcher.Launcher.launch(Launcher.java:229)
> 	at org.codehaus.plexus.classworlds.launcher.Launcher.mainWithExitCode(Launcher.java:415)
> 	at org.codehaus.plexus.classworlds.launcher.Launcher.main(Launcher.java:356)
> Caused by: org.apache.maven.plugin.MojoExecutionException: Command execution failed.
> 	at org.codehaus.mojo.exec.ExecMojo.execute(ExecMojo.java:362)
> 	at org.apache.maven.plugin.DefaultBuildPluginManager.executeMojo(DefaultBuildPluginManager.java:134)
> 	at org.apache.maven.lifecycle.internal.MojoExecutor.execute(MojoExecutor.java:207)
> 	... 20 more
> Caused by: org.apache.commons.exec.ExecuteException: Process exited with an error: 1
(Exit value: 1)
> 	at org.apache.commons.exec.DefaultExecutor.executeInternal(DefaultExecutor.java:377)
> 	at org.apache.commons.exec.DefaultExecutor.execute(DefaultExecutor.java:160)
> 	at org.codehaus.mojo.exec.ExecMojo.executeCommandLine(ExecMojo.java:610)
> 	at org.codehaus.mojo.exec.ExecMojo.execute(ExecMojo.java:352)
> 	... 22 more
> [ERROR] 
> [ERROR] Re-run Maven using the -X switch to enable full debug logging.



--
This message was sent by Atlassian JIRA
(v6.3.4#6332)

Mime
View raw message