falcon-dev mailing list archives

Site index · List index
Message view « Date » · « Thread »
Top « Date » · « Thread »
From "Ajay Yadava (JIRA)" <j...@apache.org>
Subject [jira] [Updated] (FALCON-1603) FeedHelperTest::testGetDateFromPath fails in different environments
Date Mon, 16 Nov 2015 15:49:11 GMT

     [ https://issues.apache.org/jira/browse/FALCON-1603?page=com.atlassian.jira.plugin.system.issuetabpanels:all-tabpanel
]

Ajay Yadava updated FALCON-1603:
--------------------------------
    Summary: FeedHelperTest::testGetDateFromPath fails in different environments  (was: FeedHelperTest::testGetDateFromPath
fails in different timezones)

> FeedHelperTest::testGetDateFromPath fails in different environments
> -------------------------------------------------------------------
>
>                 Key: FALCON-1603
>                 URL: https://issues.apache.org/jira/browse/FALCON-1603
>             Project: Falcon
>          Issue Type: Bug
>            Reporter: Ajay Yadava
>            Assignee: Balu Vellanki
>            Priority: Critical
>         Attachments: FALCON-1603.patch
>
>
> Tests run: 48, Failures: 3, Errors: 0, Skipped: 0, Time elapsed: 3.116 sec <<<
FAILURE! - in org.apache.falcon.entity.FeedHelperTest
> testGetDateFromPath(org.apache.falcon.entity.FeedHelperTest)  Time elapsed: 0.006 sec
 <<< FAILURE!
> java.lang.AssertionError: expected:<2015-11-01T07:00Z> but was:<2015-11-01T00:00Z>
>         at org.testng.Assert.fail(Assert.java:89)
>         at org.testng.Assert.failNotEquals(Assert.java:489)
>         at org.testng.Assert.assertEquals(Assert.java:118)
>         at org.testng.Assert.assertEquals(Assert.java:171)
>         at org.testng.Assert.assertEquals(Assert.java:181)
>         at org.apache.falcon.entity.FeedHelperTest.testGetDateFromPath(FeedHelperTest.java:319)
> testGetDateFromPath(org.apache.falcon.entity.FeedHelperTest)  Time elapsed: 0 sec  <<<
FAILURE!
> java.lang.AssertionError: expected:<2015-11-02T08:00Z> but was:<2015-11-02T00:00Z>
>         at org.testng.Assert.fail(Assert.java:89)
>         at org.testng.Assert.failNotEquals(Assert.java:489)
>         at org.testng.Assert.assertEquals(Assert.java:118)
>         at org.testng.Assert.assertEquals(Assert.java:171)
>         at org.testng.Assert.assertEquals(Assert.java:181)
>         at org.apache.falcon.entity.FeedHelperTest.testGetDateFromPath(FeedHelperTest.java:319)
> testGetDateFromPath(org.apache.falcon.entity.FeedHelperTest)  Time elapsed: 0 sec  <<<
FAILURE!
> java.lang.AssertionError: expected:<2015-11-01T12:00Z> but was:<2015-11-01T04:00Z>
>         at org.testng.Assert.fail(Assert.java:89)
>         at org.testng.Assert.failNotEquals(Assert.java:489)
>         at org.testng.Assert.assertEquals(Assert.java:118)
>         at org.testng.Assert.assertEquals(Assert.java:171)
>         at org.testng.Assert.assertEquals(Assert.java:181)
>         at org.apache.falcon.entity.FeedHelperTest.testGetDateFromPath(FeedHelperTest.java:319)



--
This message was sent by Atlassian JIRA
(v6.3.4#6332)

Mime
View raw message