falcon-dev mailing list archives

Site index · List index
Message view « Date » · « Thread »
Top « Date » · « Thread »
From Ajay Yadav <ajayn...@gmail.com>
Subject Re: Build failed in Jenkins: Apache-falcon #848
Date Fri, 20 Nov 2015 05:33:27 GMT
Ran tests on my local and it ran fine. I will raise a JIRA for it.

On Fri, Nov 20, 2015 at 9:36 AM, Apache Jenkins Server <
jenkins@builds.apache.org> wrote:

> See <https://builds.apache.org/job/Apache-falcon/848/changes>
>
> Changes:
>
> [ajay.yadav] FALCON-1605 Instance API is not working as expected in case
> of Native
>
> [ajay.yadav] FALCON-1606 Process schedule fails in some cases in case of
>
> ------------------------------------------
> [...truncated 1108 lines...]
> [INFO] Working directory: <
> https://builds.apache.org/job/Apache-falcon/ws/common>
> [INFO] Storing buildNumber: 7953e8aecf02b873aa3227f00bf61800cfeb7170 at
> timestamp: 1447992254288
> [INFO] Executing: /bin/sh -c cd <
> https://builds.apache.org/job/Apache-falcon/ws/common> && git show
> [INFO] Working directory: <
> https://builds.apache.org/job/Apache-falcon/ws/common>
> [INFO] Storing buildScmBranch: UNKNOWN
> [INFO]
> [INFO] --- maven-remote-resources-plugin:1.4:process (default) @
> falcon-common ---
> [INFO]
> [INFO] --- maven-resources-plugin:2.6:resources (default-resources) @
> falcon-common ---
> [INFO] Using 'UTF-8' encoding to copy filtered resources.
> [INFO] Copying 0 resource
> [INFO] Copying 3 resources
> [INFO] Copying 0 resource
> [INFO] Copying 2 resources to META-INF
> [INFO] Copying 3 resources
> [INFO]
> [INFO] --- maven-compiler-plugin:2.3.2:compile (default-compile) @
> falcon-common ---
> [INFO] Compiling 97 source files to <
> https://builds.apache.org/job/Apache-falcon/ws/common/target/classes>
> [INFO]
> [INFO] --- maven-resources-plugin:2.6:testResources
> (default-testResources) @ falcon-common ---
> [INFO] Using 'UTF-8' encoding to copy filtered resources.
> [INFO] Copying 29 resources
> [INFO] Copying 3 resources
> [INFO]
> [INFO] --- maven-compiler-plugin:2.3.2:testCompile (default-testCompile) @
> falcon-common ---
> [INFO] Compiling 41 source files to <
> https://builds.apache.org/job/Apache-falcon/ws/common/target/test-classes>
> [INFO]
> [INFO] --- maven-surefire-plugin:2.16:test (default-test) @ falcon-common
> ---
> [WARNING] The parameter forkMode is deprecated since version 2.14. Use
> forkCount and reuseForks instead.
> [INFO] Surefire report directory: <
> https://builds.apache.org/job/Apache-falcon/ws/common/target/surefire-reports
> >
>
> -------------------------------------------------------
>  T E S T S
> -------------------------------------------------------
>
> -------------------------------------------------------
>  T E S T S
> -------------------------------------------------------
> Running org.apache.falcon.expression.ExpressionHelperTest
> Tests run: 23, Failures: 0, Errors: 0, Skipped: 0, Time elapsed: 0.609 sec
> - in org.apache.falcon.expression.ExpressionHelperTest
> Running org.apache.falcon.cleanup.LogCleanupServiceTest
> Tests run: 2, Failures: 0, Errors: 0, Skipped: 0, Time elapsed: 4.15 sec -
> in org.apache.falcon.cleanup.LogCleanupServiceTest
> Running org.apache.falcon.service.GroupsServiceTest
> Tests run: 2, Failures: 0, Errors: 0, Skipped: 0, Time elapsed: 0.842 sec
> - in org.apache.falcon.service.GroupsServiceTest
> Running org.apache.falcon.service.ProxyUserServiceTest
> Tests run: 13, Failures: 0, Errors: 0, Skipped: 0, Time elapsed: 1.302 sec
> - in org.apache.falcon.service.ProxyUserServiceTest
> Running org.apache.falcon.retention.EvictedInstanceSerDeTest
> Tests run: 4, Failures: 0, Errors: 0, Skipped: 0, Time elapsed: 1.182 sec
> - in org.apache.falcon.retention.EvictedInstanceSerDeTest
> Running org.apache.falcon.update.UpdateHelperTest
> Tests run: 5, Failures: 0, Errors: 0, Skipped: 0, Time elapsed: 4.373 sec
> - in org.apache.falcon.update.UpdateHelperTest
> Running org.apache.falcon.group.FeedGroupMapTest
> Tests run: 3, Failures: 0, Errors: 0, Skipped: 0, Time elapsed: 2.327 sec
> - in org.apache.falcon.group.FeedGroupMapTest
> Running org.apache.falcon.entity.HiveUtilTest
> Tests run: 2, Failures: 0, Errors: 0, Skipped: 0, Time elapsed: 0.462 sec
> - in org.apache.falcon.entity.HiveUtilTest
> Running org.apache.falcon.entity.store.ConfigurationStoreTest
> Tests run: 15, Failures: 0, Errors: 0, Skipped: 0, Time elapsed: 2.006 sec
> - in org.apache.falcon.entity.store.ConfigurationStoreTest
> Running org.apache.falcon.entity.store.FeedLocationStoreTest
> Tests run: 6, Failures: 0, Errors: 0, Skipped: 0, Time elapsed: 2.27 sec -
> in org.apache.falcon.entity.store.FeedLocationStoreTest
> Running org.apache.falcon.entity.StorageFactoryTest
> Tests run: 36, Failures: 0, Errors: 0, Skipped: 0, Time elapsed: 2.198 sec
> - in org.apache.falcon.entity.StorageFactoryTest
> Running org.apache.falcon.entity.lock.MemoryLocksTest
> Tests run: 3, Failures: 0, Errors: 0, Skipped: 0, Time elapsed: 1.325 sec
> - in org.apache.falcon.entity.lock.MemoryLocksTest
> Running org.apache.falcon.entity.FeedDataPathTest
> Tests run: 5, Failures: 0, Errors: 0, Skipped: 0, Time elapsed: 0.32 sec -
> in org.apache.falcon.entity.FeedDataPathTest
> Running org.apache.falcon.entity.CatalogStorageTest
> Tests run: 17, Failures: 0, Errors: 0, Skipped: 0, Time elapsed: 0.514 sec
> - in org.apache.falcon.entity.CatalogStorageTest
> Running org.apache.falcon.entity.FileSystemStorageTest
> Tests run: 38, Failures: 0, Errors: 0, Skipped: 0, Time elapsed: 3.583 sec
> - in org.apache.falcon.entity.FileSystemStorageTest
> Running org.apache.falcon.entity.parser.FeedEntityParserTest
> Tests run: 53, Failures: 0, Errors: 0, Skipped: 0, Time elapsed: 6.909 sec
> - in org.apache.falcon.entity.parser.FeedEntityParserTest
> Running org.apache.falcon.entity.parser.ClusterEntityParserTest
> Tests run: 15, Failures: 0, Errors: 0, Skipped: 0, Time elapsed: 3.921 sec
> - in org.apache.falcon.entity.parser.ClusterEntityParserTest
> Running org.apache.falcon.entity.parser.ProcessEntityParserTest
> Tests run: 36, Failures: 0, Errors: 0, Skipped: 0, Time elapsed: 9.113 sec
> - in org.apache.falcon.entity.parser.ProcessEntityParserTest
> Running org.apache.falcon.entity.parser.FeedUpdateTest
> Tests run: 4, Failures: 0, Errors: 0, Skipped: 0, Time elapsed: 2.649 sec
> - in org.apache.falcon.entity.parser.FeedUpdateTest
> Running org.apache.falcon.entity.parser.DatasourceEntityParserTest
> Tests run: 2, Failures: 0, Errors: 0, Skipped: 0, Time elapsed: 2.087 sec
> - in org.apache.falcon.entity.parser.DatasourceEntityParserTest
> Running org.apache.falcon.entity.ProcessHelperTest
> Tests run: 6, Failures: 0, Errors: 0, Skipped: 0, Time elapsed: 2.223 sec
> - in org.apache.falcon.entity.ProcessHelperTest
> Running org.apache.falcon.entity.EntityTypeTest
> Tests run: 4, Failures: 0, Errors: 0, Skipped: 0, Time elapsed: 1.047 sec
> - in org.apache.falcon.entity.EntityTypeTest
> Running org.apache.falcon.entity.v0.EntityGraphTest
> Tests run: 6, Failures: 0, Errors: 0, Skipped: 0, Time elapsed: 2.153 sec
> - in org.apache.falcon.entity.v0.EntityGraphTest
> Running org.apache.falcon.entity.EntityUtilTest
> Tests run: 40, Failures: 0, Errors: 0, Skipped: 0, Time elapsed: 3.085 sec
> - in org.apache.falcon.entity.EntityUtilTest
> Running org.apache.falcon.entity.ColoClusterRelationTest
> Tests run: 1, Failures: 0, Errors: 0, Skipped: 0, Time elapsed: 2.01 sec -
> in org.apache.falcon.entity.ColoClusterRelationTest
> Running org.apache.falcon.entity.FeedHelperTest
> Tests run: 48, Failures: 0, Errors: 0, Skipped: 0, Time elapsed: 3.302 sec
> - in org.apache.falcon.entity.FeedHelperTest
> Running org.apache.falcon.entity.TestWorkflowNameBuilder
> Tests run: 7, Failures: 0, Errors: 0, Skipped: 0, Time elapsed: 1.103 sec
> - in org.apache.falcon.entity.TestWorkflowNameBuilder
> Running org.apache.falcon.security.DefaultAuthorizationProviderTest
> Tests run: 34, Failures: 0, Errors: 0, Skipped: 0, Time elapsed: 2.274 sec
> - in org.apache.falcon.security.DefaultAuthorizationProviderTest
> Running org.apache.falcon.security.SecurityUtilTest
> Tests run: 9, Failures: 0, Errors: 0, Skipped: 0, Time elapsed: 1.316 sec
> - in org.apache.falcon.security.SecurityUtilTest
> Running org.apache.falcon.security.AuthenticationInitializationServiceTest
> Tests run: 5, Failures: 0, Errors: 0, Skipped: 0, Time elapsed: 1.138 sec
> - in org.apache.falcon.security.AuthenticationInitializationServiceTest
> Running org.apache.falcon.security.CurrentUserTest
> Tests run: 22, Failures: 0, Errors: 0, Skipped: 0, Time elapsed: 1.208 sec
> - in org.apache.falcon.security.CurrentUserTest
> Running org.apache.falcon.util.RadixNodeTest
> Tests run: 9, Failures: 0, Errors: 0, Skipped: 0, Time elapsed: 0.362 sec
> - in org.apache.falcon.util.RadixNodeTest
> Running org.apache.falcon.util.ApplicationPropertiesTest
> Tests run: 4, Failures: 0, Errors: 0, Skipped: 0, Time elapsed: 0.473 sec
> - in org.apache.falcon.util.ApplicationPropertiesTest
> Running org.apache.falcon.util.RadixTreeTest
> Tests run: 26, Failures: 0, Errors: 0, Skipped: 0, Time elapsed: 0.729 sec
> - in org.apache.falcon.util.RadixTreeTest
> Running org.apache.falcon.util.ReflectionUtilsTest
> Tests run: 1, Failures: 0, Errors: 0, Skipped: 0, Time elapsed: 1.162 sec
> - in org.apache.falcon.util.ReflectionUtilsTest
> Running org.apache.falcon.metadata.MetadataMappingServiceTest
> Tests run: 17, Failures: 0, Errors: 0, Skipped: 0, Time elapsed: 8.655 sec
> - in org.apache.falcon.metadata.MetadataMappingServiceTest
> Running org.apache.falcon.hadoop.HadoopClientFactoryTest
> Tests run: 3, Failures: 0, Errors: 0, Skipped: 0, Time elapsed: 1.246 sec
> - in org.apache.falcon.hadoop.HadoopClientFactoryTest
> Running org.apache.falcon.workflow.WorkflowJobEndNotificationServiceTest
> Tests run: 3, Failures: 0, Errors: 0, Skipped: 0, Time elapsed: 2.078 sec
> - in org.apache.falcon.workflow.WorkflowJobEndNotificationServiceTest
> Running org.apache.falcon.workflow.WorkflowExecutionContextTest
> Tests run: 41, Failures: 1, Errors: 0, Skipped: 0, Time elapsed: 3.397 sec
> <<< FAILURE! - in org.apache.falcon.workflow.WorkflowExecutionContextTest
> testWorkflowStartEnd(org.apache.falcon.workflow.WorkflowExecutionContextTest)
> Time elapsed: 0.015 sec  <<< FAILURE!
> java.lang.AssertionError: expected:<1000000> but was:<1000001>
>         at org.testng.Assert.fail(Assert.java:89)
>         at org.testng.Assert.failNotEquals(Assert.java:489)
>         at org.testng.Assert.assertEquals(Assert.java:118)
>         at org.testng.Assert.assertEquals(Assert.java:260)
>         at org.testng.Assert.assertEquals(Assert.java:270)
>         at
> org.apache.falcon.workflow.WorkflowExecutionContextTest.testWorkflowStartEnd(WorkflowExecutionContextTest.java:247)
>
>
> Results :
>
> Failed tests:
>   WorkflowExecutionContextTest.testWorkflowStartEnd:247 expected:<1000000>
> but was:<1000001>
>
> Tests run: 570, Failures: 1, Errors: 0, Skipped: 0
>
> [INFO]
> ------------------------------------------------------------------------
> [INFO] Reactor Summary:
> [INFO]
> [INFO] Checkstyle ........................................ SUCCESS [
> 0.990 s]
> [INFO] Apache Falcon ..................................... SUCCESS [
> 19.506 s]
> [INFO] Apache Falcon UI .................................. SUCCESS [
> 16.847 s]
> [INFO] Build Tools ....................................... SUCCESS [
> 4.264 s]
> [INFO] Apache Falcon CLI client .......................... SUCCESS [
> 40.769 s]
> [INFO] Apache Falcon Metrics ............................. SUCCESS [
> 21.058 s]
> [INFO] Apache Falcon Hadoop Dependencies ................. SUCCESS [
> 15.537 s]
> [INFO] Apache Falcon Test Utility ........................ SUCCESS [
> 11.932 s]
> [INFO] Apache Falcon Commons ............................. FAILURE [01:51
> min]
> [INFO] Apache Falcon Oozie EL Extension .................. SKIPPED
> [INFO] Apache Falcon Embedded Hadoop - Test Cluster ...... SKIPPED
> [INFO] Apache Falcon Sharelib Hive - Test Cluster ........ SKIPPED
> [INFO] Apache Falcon Sharelib Pig - Test Cluster ......... SKIPPED
> [INFO] Apache Falcon Sharelib Hcatalog - Test Cluster .... SKIPPED
> [INFO] Apache Falcon Sharelib Oozie - Test Cluster ....... SKIPPED
> [INFO] Apache Falcon Test Tools - Test Cluster ........... SKIPPED
> [INFO] Apache Falcon Messaging ........................... SKIPPED
> [INFO] Apache Falcon LIfecycle Module .................... SKIPPED
> [INFO] Apache Falcon Oozie Adaptor ....................... SKIPPED
> [INFO] Apache Falcon Scheduler ........................... SKIPPED
> [INFO] Apache Falcon Acquisition ......................... SKIPPED
> [INFO] Apache Falcon Distcp Replication .................. SKIPPED
> [INFO] Apache Falcon Retention ........................... SKIPPED
> [INFO] Apache Falcon Archival ............................ SKIPPED
> [INFO] Apache Falcon Rerun ............................... SKIPPED
> [INFO] Apache Falcon Prism ............................... SKIPPED
> [INFO] falcon-unit ....................................... SKIPPED
> [INFO] Apache Falcon Web Application ..................... SKIPPED
> [INFO] Apache Falcon Documentation ....................... SKIPPED
> [INFO]
> ------------------------------------------------------------------------
> [INFO] BUILD FAILURE
> [INFO]
> ------------------------------------------------------------------------
> [INFO] Total time: 04:03 min
> [INFO] Finished at: 2015-11-20T04:06:05+00:00
> [INFO] Final Memory: 191M/1718M
> [INFO]
> ------------------------------------------------------------------------
> [ERROR] Failed to execute goal
> org.apache.maven.plugins:maven-surefire-plugin:2.16:test (default-test) on
> project falcon-common: There are test failures.
> [ERROR]
> [ERROR] Please refer to <
> https://builds.apache.org/job/Apache-falcon/ws/common/target/surefire-reports>
> for the individual test results.
> [ERROR] -> [Help 1]
> [ERROR]
> [ERROR] To see the full stack trace of the errors, re-run Maven with the
> -e switch.
> [ERROR] Re-run Maven using the -X switch to enable full debug logging.
> [ERROR]
> [ERROR] For more information about the errors and possible solutions,
> please read the following articles:
> [ERROR] [Help 1]
> http://cwiki.apache.org/confluence/display/MAVEN/MojoFailureException
> [ERROR]
> [ERROR] After correcting the problems, you can resume the build with the
> command
> [ERROR]   mvn <goals> -rf :falcon-common
> Build step 'Execute shell' marked build as failure
> [CHECKSTYLE] Collecting checkstyle analysis files...
> [CHECKSTYLE] Finding all files that match the pattern
> **/target/checkstyle-result.xml
> [CHECKSTYLE] Parsing 30 files in <
> https://builds.apache.org/job/Apache-falcon/ws/>
> [CHECKSTYLE] Successfully parsed file <
> https://builds.apache.org/job/Apache-falcon/ws/acquisition/target/checkstyle-result.xml>
> with 0 unique warnings and 0 duplicates.
> [CHECKSTYLE] Successfully parsed file <
> https://builds.apache.org/job/Apache-falcon/ws/archival/target/checkstyle-result.xml>
> with 0 unique warnings and 0 duplicates.
> [CHECKSTYLE] Successfully parsed file <
> https://builds.apache.org/job/Apache-falcon/ws/build-tools/target/checkstyle-result.xml>
> with 0 unique warnings and 0 duplicates.
> [CHECKSTYLE] Successfully parsed file <
> https://builds.apache.org/job/Apache-falcon/ws/client/target/checkstyle-result.xml>
> with 0 unique warnings and 0 duplicates.
> [CHECKSTYLE] Successfully parsed file <
> https://builds.apache.org/job/Apache-falcon/ws/docs/target/checkstyle-result.xml>
> with 0 unique warnings and 0 duplicates.
> [CHECKSTYLE] Successfully parsed file <
> https://builds.apache.org/job/Apache-falcon/ws/falcon-ui/target/checkstyle-result.xml>
> with 0 unique warnings and 0 duplicates.
> [CHECKSTYLE] Successfully parsed file <
> https://builds.apache.org/job/Apache-falcon/ws/feed/target/checkstyle-result.xml>
> with 0 unique warnings and 0 duplicates.
> [CHECKSTYLE] Successfully parsed file <
> https://builds.apache.org/job/Apache-falcon/ws/hadoop-dependencies/target/checkstyle-result.xml>
> with 0 unique warnings and 0 duplicates.
> [CHECKSTYLE] Successfully parsed file <
> https://builds.apache.org/job/Apache-falcon/ws/hadoop-webapp/target/checkstyle-result.xml>
> with 0 unique warnings and 0 duplicates.
> [CHECKSTYLE] Successfully parsed file <
> https://builds.apache.org/job/Apache-falcon/ws/lifecycle/target/checkstyle-result.xml>
> with 0 unique warnings and 0 duplicates.
> [CHECKSTYLE] Successfully parsed file <
> https://builds.apache.org/job/Apache-falcon/ws/messaging/target/checkstyle-result.xml>
> with 0 unique warnings and 0 duplicates.
> [CHECKSTYLE] Successfully parsed file <
> https://builds.apache.org/job/Apache-falcon/ws/metrics/target/checkstyle-result.xml>
> with 0 unique warnings and 0 duplicates.
> [CHECKSTYLE] Successfully parsed file <
> https://builds.apache.org/job/Apache-falcon/ws/oozie-el-extensions/target/checkstyle-result.xml>
> with 0 unique warnings and 0 duplicates.
> [CHECKSTYLE] Successfully parsed file <
> https://builds.apache.org/job/Apache-falcon/ws/oozie/target/checkstyle-result.xml>
> with 0 unique warnings and 0 duplicates.
> [CHECKSTYLE] Successfully parsed file <
> https://builds.apache.org/job/Apache-falcon/ws/prism/target/checkstyle-result.xml>
> with 0 unique warnings and 0 duplicates.
> [CHECKSTYLE] Successfully parsed file <
> https://builds.apache.org/job/Apache-falcon/ws/process/target/checkstyle-result.xml>
> with 0 unique warnings and 0 duplicates.
> [CHECKSTYLE] Successfully parsed file <
> https://builds.apache.org/job/Apache-falcon/ws/replication/target/checkstyle-result.xml>
> with 0 unique warnings and 0 duplicates.
> [CHECKSTYLE] Successfully parsed file <
> https://builds.apache.org/job/Apache-falcon/ws/rerun/target/checkstyle-result.xml>
> with 0 unique warnings and 0 duplicates.
> [CHECKSTYLE] Successfully parsed file <
> https://builds.apache.org/job/Apache-falcon/ws/retention/target/checkstyle-result.xml>
> with 0 unique warnings and 0 duplicates.
> [CHECKSTYLE] Successfully parsed file <
> https://builds.apache.org/job/Apache-falcon/ws/scheduler/target/checkstyle-result.xml>
> with 0 unique warnings and 0 duplicates.
> [CHECKSTYLE] Successfully parsed file <
> https://builds.apache.org/job/Apache-falcon/ws/target/checkstyle-result.xml>
> with 0 unique warnings and 0 duplicates.
> [CHECKSTYLE] Successfully parsed file <
> https://builds.apache.org/job/Apache-falcon/ws/test-tools/hadoop-webapp/target/checkstyle-result.xml>
> with 0 unique warnings and 0 duplicates.
> [CHECKSTYLE] Successfully parsed file <
> https://builds.apache.org/job/Apache-falcon/ws/test-tools/hcatalog-sharelib/target/checkstyle-result.xml>
> with 0 unique warnings and 0 duplicates.
> [CHECKSTYLE] Successfully parsed file <
> https://builds.apache.org/job/Apache-falcon/ws/test-tools/hive-sharelib/target/checkstyle-result.xml>
> with 0 unique warnings and 0 duplicates.
> [CHECKSTYLE] Successfully parsed file <
> https://builds.apache.org/job/Apache-falcon/ws/test-tools/oozie-sharelib/target/checkstyle-result.xml>
> with 0 unique warnings and 0 duplicates.
> [CHECKSTYLE] Successfully parsed file <
> https://builds.apache.org/job/Apache-falcon/ws/test-tools/pig-sharelib/target/checkstyle-result.xml>
> with 0 unique warnings and 0 duplicates.
> [CHECKSTYLE] Successfully parsed file <
> https://builds.apache.org/job/Apache-falcon/ws/test-tools/target/checkstyle-result.xml>
> with 0 unique warnings and 0 duplicates.
> [CHECKSTYLE] Successfully parsed file <
> https://builds.apache.org/job/Apache-falcon/ws/test-util/target/checkstyle-result.xml>
> with 0 unique warnings and 0 duplicates.
> [CHECKSTYLE] Successfully parsed file <
> https://builds.apache.org/job/Apache-falcon/ws/unit/target/checkstyle-result.xml>
> with 0 unique warnings and 0 duplicates.
> [CHECKSTYLE] Successfully parsed file <
> https://builds.apache.org/job/Apache-falcon/ws/webapp/target/checkstyle-result.xml>
> with 0 unique warnings and 0 duplicates.
> [CHECKSTYLE] Computing warning deltas based on reference build #847
> [FINDBUGS] Collecting findbugs analysis files...
> [FINDBUGS] Finding all files that match the pattern **/target/findbugs.xml
> [FINDBUGS] Parsing 19 files in <
> https://builds.apache.org/job/Apache-falcon/ws/>
> [FINDBUGS] Successfully parsed file <
> https://builds.apache.org/job/Apache-falcon/ws/client/target/findbugs.xml>
> with 0 unique warnings and 0 duplicates.
> [FINDBUGS] Successfully parsed file <
> https://builds.apache.org/job/Apache-falcon/ws/feed/target/findbugs.xml>
> with 0 unique warnings and 0 duplicates.
> [FINDBUGS] Successfully parsed file <
> https://builds.apache.org/job/Apache-falcon/ws/hadoop-dependencies/target/findbugs.xml>
> with 0 unique warnings and 0 duplicates.
> [FINDBUGS] Successfully parsed file <
> https://builds.apache.org/job/Apache-falcon/ws/hadoop-webapp/target/findbugs.xml>
> with 0 unique warnings and 0 duplicates.
> [FINDBUGS] Successfully parsed file <
> https://builds.apache.org/job/Apache-falcon/ws/lifecycle/target/findbugs.xml>
> with 0 unique warnings and 0 duplicates.
> [FINDBUGS] Successfully parsed file <
> https://builds.apache.org/job/Apache-falcon/ws/messaging/target/findbugs.xml>
> with 0 unique warnings and 0 duplicates.
> [FINDBUGS] Successfully parsed file <
> https://builds.apache.org/job/Apache-falcon/ws/metrics/target/findbugs.xml>
> with 0 unique warnings and 0 duplicates.
> [FINDBUGS] Successfully parsed file <
> https://builds.apache.org/job/Apache-falcon/ws/oozie-el-extensions/target/findbugs.xml>
> with 0 unique warnings and 0 duplicates.
> [FINDBUGS] Successfully parsed file <
> https://builds.apache.org/job/Apache-falcon/ws/oozie/target/findbugs.xml>
> with 0 unique warnings and 0 duplicates.
> [FINDBUGS] Successfully parsed file <
> https://builds.apache.org/job/Apache-falcon/ws/prism/target/findbugs.xml>
> with 0 unique warnings and 0 duplicates.
> [FINDBUGS] Successfully parsed file <
> https://builds.apache.org/job/Apache-falcon/ws/process/target/findbugs.xml>
> with 0 unique warnings and 0 duplicates.
> [FINDBUGS] Successfully parsed file <
> https://builds.apache.org/job/Apache-falcon/ws/replication/target/findbugs.xml>
> with 0 unique warnings and 0 duplicates.
> [FINDBUGS] Successfully parsed file <
> https://builds.apache.org/job/Apache-falcon/ws/rerun/target/findbugs.xml>
> with 0 unique warnings and 0 duplicates.
> [FINDBUGS] Successfully parsed file <
> https://builds.apache.org/job/Apache-falcon/ws/retention/target/findbugs.xml>
> with 0 unique warnings and 0 duplicates.
> [FINDBUGS] Successfully parsed file <
> https://builds.apache.org/job/Apache-falcon/ws/scheduler/target/findbugs.xml>
> with 0 unique warnings and 0 duplicates.
> [FINDBUGS] Successfully parsed file <
> https://builds.apache.org/job/Apache-falcon/ws/test-tools/hadoop-webapp/target/findbugs.xml>
> with 0 unique warnings and 0 duplicates.
> [FINDBUGS] Successfully parsed file <
> https://builds.apache.org/job/Apache-falcon/ws/test-util/target/findbugs.xml>
> with 0 unique warnings and 0 duplicates.
> [FINDBUGS] Successfully parsed file <
> https://builds.apache.org/job/Apache-falcon/ws/unit/target/findbugs.xml>
> with 0 unique warnings and 0 duplicates.
> [FINDBUGS] Successfully parsed file <
> https://builds.apache.org/job/Apache-falcon/ws/webapp/target/findbugs.xml>
> with 0 unique warnings and 0 duplicates.
> [FINDBUGS] Computing warning deltas based on reference build #847
> Archiving artifacts
> Compressed 14.64 MB of artifacts by 82.4% relative to #847
> Recording test results
> TestNG Reports Processing: START
> Looking for TestNG results report in workspace using pattern:
> **/target/testng-results.xml
> Did not find any matching files.
>

Mime
  • Unnamed multipart/alternative (inline, None, 0 bytes)
View raw message