falcon-dev mailing list archives

Site index · List index
Message view « Date » · « Thread »
Top « Date » · « Thread »
From Apache Jenkins Server <jenk...@builds.apache.org>
Subject Build failed in Jenkins: Apache-falcon #851
Date Mon, 23 Nov 2015 15:41:50 GMT
See <https://builds.apache.org/job/Apache-falcon/851/changes>

Changes:

[ajaynsit] FALCON-1607 Native Scheduler - Code refactoring: Refactor ID into more

------------------------------------------
[...truncated 4493 lines...]
[INFO] Context path = /falcon-webapp
[INFO] Tmp directory =  determined at runtime
[INFO] Web defaults = org/mortbay/jetty/webapp/webdefault.xml
[INFO] Web overrides =  none
[INFO] Adding overlay: jar:<https://builds.apache.org/job/Apache-falcon/ws/test-tools/hadoop-webapp/target/falcon-hadoop-webapp-0.9-SNAPSHOT.war!/>
[INFO] web.xml file = <https://builds.apache.org/job/Apache-falcon/ws/webapp/src/main/webapp/WEB-INF/web.xml>
[INFO] Webapp directory = <https://builds.apache.org/job/Apache-falcon/ws/webapp/src/main/webapp>
[INFO] Starting jetty 6.1.26 ...
[INFO] jetty-6.1.26
SLF4J: Class path contains multiple SLF4J bindings.
SLF4J: Found binding in [jar:<https://builds.apache.org/job/Apache-falcon/ws/webapp/target/work/lib/Jetty-2819831062833253362.jar!/org/slf4j/impl/StaticLoggerBinder.class]>
SLF4J: Found binding in [jar:<https://builds.apache.org/job/Apache-falcon/ws/webapp/target/work/lib/Jetty-5283014160452002451.jar!/org/slf4j/impl/StaticLoggerBinder.class]>
SLF4J: Found binding in [jar:file:/home/jenkins/.m2/repository/org/slf4j/slf4j-log4j12/1.7.5/slf4j-log4j12-1.7.5.jar!/org/slf4j/impl/StaticLoggerBinder.class]
SLF4J: Found binding in [jar:file:/home/jenkins/.m2/repository/org/apache/activemq/activemq-all/5.12.0/activemq-all-5.12.0.jar!/org/slf4j/impl/StaticLoggerBinder.class]
SLF4J: See http://www.slf4j.org/codes.html#multiple_bindings for an explanation.
SLF4J: Actual binding is of type [org.slf4j.impl.Log4jLoggerFactory]
[INFO] No Transaction manager found - if your webapp requires one, please configure one.
Nov 23, 2015 3:34:26 PM com.sun.jersey.api.core.PackagesResourceConfig init
INFO: Scanning for root resource and provider classes in the packages:
  org.apache.falcon.resource.admin
  org.apache.falcon.resource.proxy
  org.apache.falcon.resource.provider
  org.apache.falcon.resource.metadata
Nov 23, 2015 3:34:26 PM com.sun.jersey.api.core.ScanningResourceConfig logClasses
INFO: Root resource classes found:
  class org.apache.falcon.resource.metadata.LineageMetadataResource
  class org.apache.falcon.resource.admin.AdminResource
  class org.apache.falcon.resource.proxy.InstanceManagerProxy
  class org.apache.falcon.resource.metadata.MetadataDiscoveryResource
  class org.apache.falcon.resource.proxy.SchedulableEntityManagerProxy
Nov 23, 2015 3:34:26 PM com.sun.jersey.api.core.ScanningResourceConfig logClasses
INFO: Provider classes found:
  class org.apache.falcon.resource.provider.JAXBContextResolver
Nov 23, 2015 3:34:26 PM com.sun.jersey.server.impl.application.WebApplicationImpl _initiate
INFO: Initiating Jersey application, version 'Jersey: 1.9 09/02/2011 11:17 AM'
[INFO] Extract <https://builds.apache.org/job/Apache-falcon/ws/webapp/target/webapps/hadoop.war>
to /tmp/Jetty_0_0_0_0_41443_hadoop.war__hadoop__.nyu8ob/webapp
SLF4J: Class path contains multiple SLF4J bindings.
SLF4J: Found binding in [jar:file:/tmp/Jetty_0_0_0_0_41443_hadoop.war__hadoop__.nyu8ob/webapp/WEB-INF/lib/slf4j-log4j12-1.7.5.jar!/org/slf4j/impl/StaticLoggerBinder.class]
SLF4J: Found binding in [jar:file:/tmp/Jetty_0_0_0_0_41443_hadoop.war__hadoop__.nyu8ob/webapp/WEB-INF/lib/activemq-all-5.12.0.jar!/org/slf4j/impl/StaticLoggerBinder.class]
SLF4J: See http://www.slf4j.org/codes.html#multiple_bindings for an explanation.
SLF4J: Actual binding is of type [org.slf4j.impl.Log4jLoggerFactory]
[INFO] Extract <https://builds.apache.org/job/Apache-falcon/ws/webapp/target/webapps/oozie.war>
to /tmp/Jetty_0_0_0_0_41443_oozie.war__oozie__.lf8rot/webapp
Starting hive metastore on port 49083
SLF4J: Class path contains multiple SLF4J bindings.
SLF4J: Found binding in [jar:file:/tmp/Jetty_0_0_0_0_41443_oozie.war__oozie__.lf8rot/webapp/WEB-INF/lib/slf4j-log4j12-1.7.5.jar!/org/slf4j/impl/StaticLoggerBinder.class]
SLF4J: Found binding in [jar:file:/tmp/Jetty_0_0_0_0_41443_oozie.war__oozie__.lf8rot/webapp/WEB-INF/lib/slf4j-log4j12-1.6.6.jar!/org/slf4j/impl/StaticLoggerBinder.class]
SLF4J: Found binding in [jar:file:/tmp/Jetty_0_0_0_0_41443_oozie.war__oozie__.lf8rot/webapp/WEB-INF/lib/activemq-all-5.12.0.jar!/org/slf4j/impl/StaticLoggerBinder.class]
SLF4J: Found binding in [jar:file:/tmp/Jetty_0_0_0_0_41443_oozie.war__oozie__.lf8rot/webapp/WEB-INF/lib/slf4j-simple-1.6.6.jar!/org/slf4j/impl/StaticLoggerBinder.class]
SLF4J: See http://www.slf4j.org/codes.html#multiple_bindings for an explanation.
SLF4J: Actual binding is of type [org.slf4j.impl.Log4jLoggerFactory]
log4j:WARN No appenders could be found for logger (oozieops).
log4j:WARN Please initialize the log4j system properly.
log4j:WARN See http://logging.apache.org/log4j/1.2/faq.html#noconfig for more info.
[INFO] Started SslSocketConnector@0.0.0.0:41443
[INFO] Started SelectChannelConnector@0.0.0.0:41000
[INFO] Started Jetty Server
[INFO] 
[INFO] --- maven-failsafe-plugin:2.16:integration-test (integration-test) @ falcon-webapp
---
[WARNING] The parameter forkMode is deprecated since version 2.14. Use forkCount and reuseForks
instead.
[INFO] Failsafe report directory: <https://builds.apache.org/job/Apache-falcon/ws/webapp/target/failsafe-reports>

-------------------------------------------------------
 T E S T S
-------------------------------------------------------

-------------------------------------------------------
 T E S T S
-------------------------------------------------------
Running org.apache.falcon.validation.FeedEntityValidationIT
Tests run: 8, Failures: 0, Errors: 0, Skipped: 0, Time elapsed: 14.497 sec - in org.apache.falcon.validation.FeedEntityValidationIT
Running org.apache.falcon.validation.ClusterEntityValidationIT
Tests run: 17, Failures: 0, Errors: 0, Skipped: 0, Time elapsed: 10.539 sec - in org.apache.falcon.validation.ClusterEntityValidationIT
Running org.apache.falcon.resource.EntityManagerPaginationJerseyIT
Tests run: 5, Failures: 0, Errors: 0, Skipped: 0, Time elapsed: 23.113 sec - in org.apache.falcon.resource.EntityManagerPaginationJerseyIT
Running org.apache.falcon.resource.ProcessInstanceManagerIT
Tests run: 6, Failures: 0, Errors: 0, Skipped: 0, Time elapsed: 47.629 sec - in org.apache.falcon.resource.ProcessInstanceManagerIT
Running org.apache.falcon.resource.EntityManagerJerseyIT
Tests run: 28, Failures: 1, Errors: 0, Skipped: 0, Time elapsed: 79.398 sec <<< FAILURE!
- in org.apache.falcon.resource.EntityManagerJerseyIT
testDuplicateDeleteCommands(org.apache.falcon.resource.EntityManagerJerseyIT)  Time elapsed:
1.101 sec  <<< FAILURE!
java.lang.AssertionError: expected:<400> but was:<200>
	at org.testng.Assert.fail(Assert.java:89)
	at org.testng.Assert.failNotEquals(Assert.java:489)
	at org.testng.Assert.assertEquals(Assert.java:118)
	at org.testng.Assert.assertEquals(Assert.java:365)
	at org.testng.Assert.assertEquals(Assert.java:375)
	at org.apache.falcon.resource.TestContext.assertFailure(TestContext.java:442)
	at org.apache.falcon.resource.EntityManagerJerseyIT.testDuplicateCommandsResponse(EntityManagerJerseyIT.java:629)
	at org.apache.falcon.resource.EntityManagerJerseyIT.testDuplicateDeleteCommands(EntityManagerJerseyIT.java:622)

Running org.apache.falcon.resource.EntityManagerJerseySmokeIT
Tests run: 2, Failures: 0, Errors: 0, Skipped: 0, Time elapsed: 10.256 sec - in org.apache.falcon.resource.EntityManagerJerseySmokeIT
Running org.apache.falcon.resource.MetadataResourceJerseyIT
Tests run: 2, Failures: 0, Errors: 0, Skipped: 0, Time elapsed: 4.19 sec - in org.apache.falcon.resource.MetadataResourceJerseyIT
Running org.apache.falcon.lifecycle.TableStorageFeedEvictorIT
Tests run: 20, Failures: 0, Errors: 0, Skipped: 0, Time elapsed: 30.68 sec - in org.apache.falcon.lifecycle.TableStorageFeedEvictorIT
Running org.apache.falcon.lifecycle.FileSystemFeedReplicationIT
Tests run: 0, Failures: 0, Errors: 0, Skipped: 0, Time elapsed: 3.105 sec - in org.apache.falcon.lifecycle.FileSystemFeedReplicationIT
Running org.apache.falcon.lifecycle.FeedImportIT
Tests run: 3, Failures: 0, Errors: 0, Skipped: 0, Time elapsed: 8.254 sec - in org.apache.falcon.lifecycle.FeedImportIT
Running org.apache.falcon.lifecycle.TableStorageFeedReplicationIT
Tests run: 0, Failures: 0, Errors: 0, Skipped: 0, Time elapsed: 2.343 sec - in org.apache.falcon.lifecycle.TableStorageFeedReplicationIT
Running org.apache.falcon.process.TableStorageProcessIT
Tests run: 0, Failures: 0, Errors: 0, Skipped: 0, Time elapsed: 2.022 sec - in org.apache.falcon.process.TableStorageProcessIT
Running org.apache.falcon.process.PigProcessIT
Tests run: 0, Failures: 0, Errors: 0, Skipped: 0, Time elapsed: 1.979 sec - in org.apache.falcon.process.PigProcessIT
Running org.apache.falcon.late.LateDataHandlerIT
Tests run: 2, Failures: 0, Errors: 0, Skipped: 0, Time elapsed: 7.112 sec - in org.apache.falcon.late.LateDataHandlerIT
Running org.apache.falcon.cli.FalconCLISmokeIT
Tests run: 1, Failures: 0, Errors: 0, Skipped: 0, Time elapsed: 14.928 sec - in org.apache.falcon.cli.FalconCLISmokeIT
Running org.apache.falcon.cli.FalconCLIIT
Tests run: 27, Failures: 0, Errors: 0, Skipped: 0, Time elapsed: 128.857 sec - in org.apache.falcon.cli.FalconCLIIT
Running org.apache.falcon.catalog.CatalogPartitionHandlerIT
Tests run: 0, Failures: 0, Errors: 0, Skipped: 0, Time elapsed: 0.334 sec - in org.apache.falcon.catalog.CatalogPartitionHandlerIT
Running org.apache.falcon.catalog.HiveCatalogServiceIT
Tests run: 25, Failures: 0, Errors: 0, Skipped: 0, Time elapsed: 18.384 sec - in org.apache.falcon.catalog.HiveCatalogServiceIT

Results :

Failed tests: 
  EntityManagerJerseyIT.testDuplicateDeleteCommands:622->testDuplicateCommandsResponse:629
expected:<400> but was:<200>

Tests run: 146, Failures: 1, Errors: 0, Skipped: 0

[INFO] 
[INFO] --- maven-jetty-plugin:6.1.26:stop (stop-jetty) @ falcon-webapp ---
[INFO] Stopping server 0
[INFO] Stopped SelectChannelConnector@0.0.0.0:41000
[INFO] Stopped SslSocketConnector@0.0.0.0:41443
[INFO] 
[INFO] --- maven-failsafe-plugin:2.16:verify (verify) @ falcon-webapp ---
[INFO] Failsafe report directory: <https://builds.apache.org/job/Apache-falcon/ws/webapp/target/failsafe-reports>
[INFO] ------------------------------------------------------------------------
[INFO] Reactor Summary:
[INFO] 
[INFO] Checkstyle ........................................ SUCCESS [  1.054 s]
[INFO] Apache Falcon ..................................... SUCCESS [  8.936 s]
[INFO] Apache Falcon UI .................................. SUCCESS [ 13.821 s]
[INFO] Build Tools ....................................... SUCCESS [  3.569 s]
[INFO] Apache Falcon CLI client .......................... SUCCESS [ 33.232 s]
[INFO] Apache Falcon Metrics ............................. SUCCESS [ 16.478 s]
[INFO] Apache Falcon Hadoop Dependencies ................. SUCCESS [ 14.370 s]
[INFO] Apache Falcon Test Utility ........................ SUCCESS [ 11.346 s]
[INFO] Apache Falcon Commons ............................. SUCCESS [02:07 min]
[INFO] Apache Falcon Oozie EL Extension .................. SUCCESS [ 15.037 s]
[INFO] Apache Falcon Embedded Hadoop - Test Cluster ...... SUCCESS [ 31.883 s]
[INFO] Apache Falcon Sharelib Hive - Test Cluster ........ SUCCESS [  1.227 s]
[INFO] Apache Falcon Sharelib Pig - Test Cluster ......... SUCCESS [  0.720 s]
[INFO] Apache Falcon Sharelib Hcatalog - Test Cluster .... SUCCESS [  1.040 s]
[INFO] Apache Falcon Sharelib Oozie - Test Cluster ....... SUCCESS [  0.518 s]
[INFO] Apache Falcon Test Tools - Test Cluster ........... SUCCESS [  0.495 s]
[INFO] Apache Falcon Messaging ........................... SUCCESS [ 32.845 s]
[INFO] Apache Falcon LIfecycle Module .................... SUCCESS [ 19.759 s]
[INFO] Apache Falcon Oozie Adaptor ....................... SUCCESS [01:19 min]
[INFO] Apache Falcon Scheduler ........................... SUCCESS [ 39.289 s]
[INFO] Apache Falcon Acquisition ......................... SUCCESS [  0.451 s]
[INFO] Apache Falcon Distcp Replication .................. SUCCESS [ 17.945 s]
[INFO] Apache Falcon Retention ........................... SUCCESS [ 15.052 s]
[INFO] Apache Falcon Archival ............................ SUCCESS [  0.467 s]
[INFO] Apache Falcon Rerun ............................... SUCCESS [ 25.802 s]
[INFO] Apache Falcon Prism ............................... SUCCESS [01:25 min]
[INFO] falcon-unit ....................................... SUCCESS [01:14 min]
[INFO] Apache Falcon Web Application ..................... FAILURE [07:29 min]
[INFO] Apache Falcon Documentation ....................... SKIPPED
[INFO] ------------------------------------------------------------------------
[INFO] BUILD FAILURE
[INFO] ------------------------------------------------------------------------
[INFO] Total time: 18:43 min
[INFO] Finished at: 2015-11-23T15:41:35+00:00
[INFO] Final Memory: 795M/2336M
[INFO] ------------------------------------------------------------------------
[ERROR] Failed to execute goal org.apache.maven.plugins:maven-failsafe-plugin:2.16:verify
(verify) on project falcon-webapp: There are test failures.
[ERROR] 
[ERROR] Please refer to <https://builds.apache.org/job/Apache-falcon/ws/webapp/target/failsafe-reports>
for the individual test results.
[ERROR] -> [Help 1]
[ERROR] 
[ERROR] To see the full stack trace of the errors, re-run Maven with the -e switch.
[ERROR] Re-run Maven using the -X switch to enable full debug logging.
[ERROR] 
[ERROR] For more information about the errors and possible solutions, please read the following
articles:
[ERROR] [Help 1] http://cwiki.apache.org/confluence/display/MAVEN/MojoFailureException
[ERROR] 
[ERROR] After correcting the problems, you can resume the build with the command
[ERROR]   mvn <goals> -rf :falcon-webapp
Shutting down hive metastore.
[INFO] Shutdown hook executing
[INFO] Shutdown hook complete
Build step 'Execute shell' marked build as failure
[CHECKSTYLE] Collecting checkstyle analysis files...
[CHECKSTYLE] Finding all files that match the pattern **/target/checkstyle-result.xml
[CHECKSTYLE] Parsing 30 files in <https://builds.apache.org/job/Apache-falcon/ws/>
[CHECKSTYLE] Successfully parsed file <https://builds.apache.org/job/Apache-falcon/ws/acquisition/target/checkstyle-result.xml>
with 0 unique warnings and 0 duplicates.
[CHECKSTYLE] Successfully parsed file <https://builds.apache.org/job/Apache-falcon/ws/archival/target/checkstyle-result.xml>
with 0 unique warnings and 0 duplicates.
[CHECKSTYLE] Successfully parsed file <https://builds.apache.org/job/Apache-falcon/ws/build-tools/target/checkstyle-result.xml>
with 0 unique warnings and 0 duplicates.
[CHECKSTYLE] Successfully parsed file <https://builds.apache.org/job/Apache-falcon/ws/client/target/checkstyle-result.xml>
with 0 unique warnings and 0 duplicates.
[CHECKSTYLE] Successfully parsed file <https://builds.apache.org/job/Apache-falcon/ws/common/target/checkstyle-result.xml>
with 0 unique warnings and 0 duplicates.
[CHECKSTYLE] Successfully parsed file <https://builds.apache.org/job/Apache-falcon/ws/docs/target/checkstyle-result.xml>
with 0 unique warnings and 0 duplicates.
[CHECKSTYLE] Successfully parsed file <https://builds.apache.org/job/Apache-falcon/ws/falcon-ui/target/checkstyle-result.xml>
with 0 unique warnings and 0 duplicates.
[CHECKSTYLE] Successfully parsed file <https://builds.apache.org/job/Apache-falcon/ws/feed/target/checkstyle-result.xml>
with 0 unique warnings and 0 duplicates.
[CHECKSTYLE] Successfully parsed file <https://builds.apache.org/job/Apache-falcon/ws/hadoop-dependencies/target/checkstyle-result.xml>
with 0 unique warnings and 0 duplicates.
[CHECKSTYLE] Successfully parsed file <https://builds.apache.org/job/Apache-falcon/ws/hadoop-webapp/target/checkstyle-result.xml>
with 0 unique warnings and 0 duplicates.
[CHECKSTYLE] Successfully parsed file <https://builds.apache.org/job/Apache-falcon/ws/lifecycle/target/checkstyle-result.xml>
with 0 unique warnings and 0 duplicates.
[CHECKSTYLE] Successfully parsed file <https://builds.apache.org/job/Apache-falcon/ws/messaging/target/checkstyle-result.xml>
with 0 unique warnings and 0 duplicates.
[CHECKSTYLE] Successfully parsed file <https://builds.apache.org/job/Apache-falcon/ws/metrics/target/checkstyle-result.xml>
with 0 unique warnings and 0 duplicates.
[CHECKSTYLE] Successfully parsed file <https://builds.apache.org/job/Apache-falcon/ws/oozie-el-extensions/target/checkstyle-result.xml>
with 0 unique warnings and 0 duplicates.
[CHECKSTYLE] Successfully parsed file <https://builds.apache.org/job/Apache-falcon/ws/oozie/target/checkstyle-result.xml>
with 0 unique warnings and 0 duplicates.
[CHECKSTYLE] Successfully parsed file <https://builds.apache.org/job/Apache-falcon/ws/prism/target/checkstyle-result.xml>
with 0 unique warnings and 0 duplicates.
[CHECKSTYLE] Successfully parsed file <https://builds.apache.org/job/Apache-falcon/ws/process/target/checkstyle-result.xml>
with 0 unique warnings and 0 duplicates.
[CHECKSTYLE] Successfully parsed file <https://builds.apache.org/job/Apache-falcon/ws/replication/target/checkstyle-result.xml>
with 0 unique warnings and 0 duplicates.
[CHECKSTYLE] Successfully parsed file <https://builds.apache.org/job/Apache-falcon/ws/rerun/target/checkstyle-result.xml>
with 0 unique warnings and 0 duplicates.
[CHECKSTYLE] Successfully parsed file <https://builds.apache.org/job/Apache-falcon/ws/retention/target/checkstyle-result.xml>
with 0 unique warnings and 0 duplicates.
[CHECKSTYLE] Successfully parsed file <https://builds.apache.org/job/Apache-falcon/ws/scheduler/target/checkstyle-result.xml>
with 0 unique warnings and 0 duplicates.
[CHECKSTYLE] Successfully parsed file <https://builds.apache.org/job/Apache-falcon/ws/target/checkstyle-result.xml>
with 0 unique warnings and 0 duplicates.
[CHECKSTYLE] Successfully parsed file <https://builds.apache.org/job/Apache-falcon/ws/test-tools/hadoop-webapp/target/checkstyle-result.xml>
with 0 unique warnings and 0 duplicates.
[CHECKSTYLE] Successfully parsed file <https://builds.apache.org/job/Apache-falcon/ws/test-tools/hcatalog-sharelib/target/checkstyle-result.xml>
with 0 unique warnings and 0 duplicates.
[CHECKSTYLE] Successfully parsed file <https://builds.apache.org/job/Apache-falcon/ws/test-tools/hive-sharelib/target/checkstyle-result.xml>
with 0 unique warnings and 0 duplicates.
[CHECKSTYLE] Successfully parsed file <https://builds.apache.org/job/Apache-falcon/ws/test-tools/oozie-sharelib/target/checkstyle-result.xml>
with 0 unique warnings and 0 duplicates.
[CHECKSTYLE] Successfully parsed file <https://builds.apache.org/job/Apache-falcon/ws/test-tools/pig-sharelib/target/checkstyle-result.xml>
with 0 unique warnings and 0 duplicates.
[CHECKSTYLE] Successfully parsed file <https://builds.apache.org/job/Apache-falcon/ws/test-tools/target/checkstyle-result.xml>
with 0 unique warnings and 0 duplicates.
[CHECKSTYLE] Successfully parsed file <https://builds.apache.org/job/Apache-falcon/ws/test-util/target/checkstyle-result.xml>
with 0 unique warnings and 0 duplicates.
[CHECKSTYLE] Successfully parsed file <https://builds.apache.org/job/Apache-falcon/ws/unit/target/checkstyle-result.xml>
with 0 unique warnings and 0 duplicates.
[CHECKSTYLE] Computing warning deltas based on reference build #850
[FINDBUGS] Collecting findbugs analysis files...
[FINDBUGS] Finding all files that match the pattern **/target/findbugs.xml
[FINDBUGS] Parsing 19 files in <https://builds.apache.org/job/Apache-falcon/ws/>
[FINDBUGS] Successfully parsed file <https://builds.apache.org/job/Apache-falcon/ws/client/target/findbugs.xml>
with 0 unique warnings and 0 duplicates.
[FINDBUGS] Successfully parsed file <https://builds.apache.org/job/Apache-falcon/ws/common/target/findbugs.xml>
with 0 unique warnings and 0 duplicates.
[FINDBUGS] Successfully parsed file <https://builds.apache.org/job/Apache-falcon/ws/feed/target/findbugs.xml>
with 0 unique warnings and 0 duplicates.
[FINDBUGS] Successfully parsed file <https://builds.apache.org/job/Apache-falcon/ws/hadoop-dependencies/target/findbugs.xml>
with 0 unique warnings and 0 duplicates.
[FINDBUGS] Successfully parsed file <https://builds.apache.org/job/Apache-falcon/ws/hadoop-webapp/target/findbugs.xml>
with 0 unique warnings and 0 duplicates.
[FINDBUGS] Successfully parsed file <https://builds.apache.org/job/Apache-falcon/ws/lifecycle/target/findbugs.xml>
with 0 unique warnings and 0 duplicates.
[FINDBUGS] Successfully parsed file <https://builds.apache.org/job/Apache-falcon/ws/messaging/target/findbugs.xml>
with 0 unique warnings and 0 duplicates.
[FINDBUGS] Successfully parsed file <https://builds.apache.org/job/Apache-falcon/ws/metrics/target/findbugs.xml>
with 0 unique warnings and 0 duplicates.
[FINDBUGS] Successfully parsed file <https://builds.apache.org/job/Apache-falcon/ws/oozie-el-extensions/target/findbugs.xml>
with 0 unique warnings and 0 duplicates.
[FINDBUGS] Successfully parsed file <https://builds.apache.org/job/Apache-falcon/ws/oozie/target/findbugs.xml>
with 0 unique warnings and 0 duplicates.
[FINDBUGS] Successfully parsed file <https://builds.apache.org/job/Apache-falcon/ws/prism/target/findbugs.xml>
with 0 unique warnings and 0 duplicates.
[FINDBUGS] Successfully parsed file <https://builds.apache.org/job/Apache-falcon/ws/process/target/findbugs.xml>
with 0 unique warnings and 0 duplicates.
[FINDBUGS] Successfully parsed file <https://builds.apache.org/job/Apache-falcon/ws/replication/target/findbugs.xml>
with 0 unique warnings and 0 duplicates.
[FINDBUGS] Successfully parsed file <https://builds.apache.org/job/Apache-falcon/ws/rerun/target/findbugs.xml>
with 0 unique warnings and 0 duplicates.
[FINDBUGS] Successfully parsed file <https://builds.apache.org/job/Apache-falcon/ws/retention/target/findbugs.xml>
with 0 unique warnings and 0 duplicates.
[FINDBUGS] Successfully parsed file <https://builds.apache.org/job/Apache-falcon/ws/scheduler/target/findbugs.xml>
with 0 unique warnings and 0 duplicates.
[FINDBUGS] Successfully parsed file <https://builds.apache.org/job/Apache-falcon/ws/test-tools/hadoop-webapp/target/findbugs.xml>
with 0 unique warnings and 0 duplicates.
[FINDBUGS] Successfully parsed file <https://builds.apache.org/job/Apache-falcon/ws/test-util/target/findbugs.xml>
with 0 unique warnings and 0 duplicates.
[FINDBUGS] Successfully parsed file <https://builds.apache.org/job/Apache-falcon/ws/unit/target/findbugs.xml>
with 0 unique warnings and 0 duplicates.
[FINDBUGS] Computing warning deltas based on reference build #850
Archiving artifacts
Recording test results
TestNG Reports Processing: START
Looking for TestNG results report in workspace using pattern: **/target/testng-results.xml
Did not find any matching files.

Mime
View raw message