falcon-dev mailing list archives

Site index · List index
Message view « Date » · « Thread »
Top « Date » · « Thread »
From "Sowmya Ramesh (JIRA)" <j...@apache.org>
Subject [jira] [Created] (FALCON-1553) Flaky test in SchedulerUtilTest
Date Wed, 21 Oct 2015 18:41:27 GMT
Sowmya Ramesh created FALCON-1553:
-------------------------------------

             Summary: Flaky test in SchedulerUtilTest
                 Key: FALCON-1553
                 URL: https://issues.apache.org/jira/browse/FALCON-1553
             Project: Falcon
          Issue Type: Sub-task
            Reporter: Sowmya Ramesh


{code}
Tests run: 4, Failures: 1, Errors: 0, Skipped: 0, Time elapsed: 0.385 sec <<< FAILURE!
- in org.apache.falcon.execution.SchedulerUtilTest
testGetFrequencyInMillis(org.apache.falcon.execution.SchedulerUtilTest)  Time elapsed: 0.004
sec  <<< FAILURE!
java.lang.AssertionError: expected:<5270400000> but was:<5274000000>
	at org.testng.Assert.fail(Assert.java:89)
	at org.testng.Assert.failNotEquals(Assert.java:489)
	at org.testng.Assert.assertEquals(Assert.java:118)
	at org.testng.Assert.assertEquals(Assert.java:260)
	at org.testng.Assert.assertEquals(Assert.java:270)
	at org.apache.falcon.execution.SchedulerUtilTest.testGetFrequencyInMillis(SchedulerUtilTest.java:35)
{code}



--
This message was sent by Atlassian JIRA
(v6.3.4#6332)

Mime
View raw message