falcon-dev mailing list archives

Site index · List index
Message view « Date » · « Thread »
Top « Date » · « Thread »
From "Peeyush Bishnoi (JIRA)" <j...@apache.org>
Subject [jira] [Created] (FALCON-1542) FalconUnit tests fails
Date Wed, 14 Oct 2015 12:53:05 GMT
Peeyush Bishnoi created FALCON-1542:
---------------------------------------

             Summary: FalconUnit tests fails
                 Key: FALCON-1542
                 URL: https://issues.apache.org/jira/browse/FALCON-1542
             Project: Falcon
          Issue Type: Bug
            Reporter: Peeyush Bishnoi


Falcon unit test is failing with following exception while building Falcon.
{code:java}
-------------------------------------------------------
Running org.apache.falcon.unit.TestFalconUnit
objc[55556]: Class JavaLaunchHelper is implemented in both /Library/Java/JavaVirtualMachines/jdk1.7.0_67.jdk/Contents/Home/jre/bin/java
and /Library/Java/JavaVirtualMachines/jdk1.7.0_67.jdk/Contents/Home/jre/lib/libinstrument.dylib.
One of the two will be used. Which one is undefined.
Tests run: 3, Failures: 2, Errors: 0, Skipped: 0, Time elapsed: 286.837 sec <<< FAILURE!
- in org.apache.falcon.unit.TestFalconUnit
testProcessInstanceExecution(org.apache.falcon.unit.TestFalconUnit)  Time elapsed: 99.8 sec
 <<< FAILURE!
java.lang.AssertionError: expected:<SUCCEEDED> but was:<RUNNING>
	at org.testng.Assert.fail(Assert.java:89)
	at org.testng.Assert.failNotEquals(Assert.java:489)
	at org.testng.Assert.assertEquals(Assert.java:118)
	at org.testng.Assert.assertEquals(Assert.java:160)
	at org.apache.falcon.unit.TestFalconUnit.testProcessInstanceExecution(TestFalconUnit.java:58)

testRetention(org.apache.falcon.unit.TestFalconUnit)  Time elapsed: 91.354 sec  <<<
FAILURE!
java.lang.AssertionError: expected:<RUNNING> but was:<SUCCEEDED>
	at org.testng.Assert.fail(Assert.java:89)
	at org.testng.Assert.failNotEquals(Assert.java:489)
	at org.testng.Assert.assertEquals(Assert.java:118)
	at org.testng.Assert.assertEquals(Assert.java:160)
	at org.apache.falcon.unit.TestFalconUnit.testRetention(TestFalconUnit.java:87)


Results :

Failed tests: 
  TestFalconUnit.testProcessInstanceExecution:58 expected:<SUCCEEDED> but was:<RUNNING>
  TestFalconUnit.testRetention:87 expected:<RUNNING> but was:<SUCCEEDED>

Tests run: 3, Failures: 2, Errors: 0, Skipped: 0
{code}




--
This message was sent by Atlassian JIRA
(v6.3.4#6332)

Mime
View raw message