falcon-dev mailing list archives

Site index · List index
Message view « Date » · « Thread »
Top « Date » · « Thread »
From "Sowmya Ramesh (JIRA)" <j...@apache.org>
Subject [jira] [Updated] (FALCON-1521) Flaky tests in EntityManagerJerseyIT
Date Thu, 08 Oct 2015 18:38:27 GMT

     [ https://issues.apache.org/jira/browse/FALCON-1521?page=com.atlassian.jira.plugin.system.issuetabpanels:all-tabpanel
]

Sowmya Ramesh updated FALCON-1521:
----------------------------------
    Attachment: org.apache.falcon.resource.EntityManagerJerseyIT-output.txt
                org.apache.falcon.resource.EntityManagerJerseyIT.txt

> Flaky tests in EntityManagerJerseyIT
> ------------------------------------
>
>                 Key: FALCON-1521
>                 URL: https://issues.apache.org/jira/browse/FALCON-1521
>             Project: Falcon
>          Issue Type: Sub-task
>            Reporter: Sowmya Ramesh
>             Fix For: trunk
>
>         Attachments: jetty.log, org.apache.falcon.resource.EntityManagerJerseyIT-output.txt,
org.apache.falcon.resource.EntityManagerJerseyIT.txt
>
>
> {code}
> Running org.apache.falcon.resource.EntityManagerJerseyIT
> Tests run: 28, Failures: 3, Errors: 0, Skipped: 0, Time elapsed: 123.054 sec <<<
FAILURE! - in org.apache.falcon.resource.EntityManagerJerseyIT
> testDryRun(org.apache.falcon.resource.EntityManagerJerseyIT)  Time elapsed: 10.226 sec
 <<< FAILURE!
> java.lang.AssertionError: expected:<200> but was:<400>
> 	at org.testng.Assert.fail(Assert.java:89)
> 	at org.testng.Assert.failNotEquals(Assert.java:489)
> 	at org.testng.Assert.assertEquals(Assert.java:118)
> 	at org.testng.Assert.assertEquals(Assert.java:365)
> 	at org.testng.Assert.assertEquals(Assert.java:375)
> 	at org.apache.falcon.resource.TestContext.assertSuccessful(TestContext.java:444)
> 	at org.apache.falcon.resource.EntityManagerJerseyIT.testDryRun(EntityManagerJerseyIT.java:278)
> testProcessEndtimeUpdate(org.apache.falcon.resource.EntityManagerJerseyIT)  Time elapsed:
8.101 sec  <<< FAILURE!
> java.lang.AssertionError: expected:<200> but was:<400>
> 	at org.testng.Assert.fail(Assert.java:89)
> 	at org.testng.Assert.failNotEquals(Assert.java:489)
> 	at org.testng.Assert.assertEquals(Assert.java:118)
> 	at org.testng.Assert.assertEquals(Assert.java:365)
> 	at org.testng.Assert.assertEquals(Assert.java:375)
> 	at org.apache.falcon.resource.TestContext.assertSuccessful(TestContext.java:444)
> 	at org.apache.falcon.resource.EntityManagerJerseyIT.testProcessEndtimeUpdate(EntityManagerJerseyIT.java:372)
> testProcessInputUpdate(org.apache.falcon.resource.EntityManagerJerseyIT)  Time elapsed:
9.079 sec  <<< FAILURE!
> java.lang.AssertionError: expected:<200> but was:<400>
> 	at org.testng.Assert.fail(Assert.java:89)
> 	at org.testng.Assert.failNotEquals(Assert.java:489)
> 	at org.testng.Assert.assertEquals(Assert.java:118)
> 	at org.testng.Assert.assertEquals(Assert.java:365)
> 	at org.testng.Assert.assertEquals(Assert.java:375)
> 	at org.apache.falcon.resource.TestContext.assertSuccessful(TestContext.java:444)
> 	at org.apache.falcon.resource.EntityManagerJerseyIT.testProcessInputUpdate(EntityManagerJerseyIT.java:338)
> {code}



--
This message was sent by Atlassian JIRA
(v6.3.4#6332)

Mime
View raw message