falcon-dev mailing list archives

Site index · List index
Message view « Date » · « Thread »
Top « Date » · « Thread »
From "Sowmya Ramesh (JIRA)" <j...@apache.org>
Subject [jira] [Updated] (FALCON-1513) Flaky test: org.apache.falcon.messaging.JMSMessageConsumerTest
Date Thu, 08 Oct 2015 17:52:27 GMT

     [ https://issues.apache.org/jira/browse/FALCON-1513?page=com.atlassian.jira.plugin.system.issuetabpanels:all-tabpanel
]

Sowmya Ramesh updated FALCON-1513:
----------------------------------
    Description: 
getTotalEnqueueCount() in JMSMessageConsumerTest is flaky
{code}
org.apache.falcon.messaging.JMSMessageConsumerTest
testSubscriber(org.apache.falcon.messaging.JMSMessageConsumerTest)  Time elapsed: 0.732 sec
 <<< FAILURE!
java.lang.AssertionError: expected:<11> but was:<10>
	at org.testng.Assert.fail(Assert.java:89)
	at org.testng.Assert.failNotEquals(Assert.java:489)
	at org.testng.Assert.assertEquals(Assert.java:118)
	at org.testng.Assert.assertEquals(Assert.java:260)
	at org.testng.Assert.assertEquals(Assert.java:270)
	at org.apache.falcon.messaging.JMSMessageConsumerTest.testSubscriber(JMSMessageConsumerTest.java:145)

{code}

{code}
Running org.apache.falcon.messaging.JMSMessageConsumerTest
Tests run: 3, Failures: 2, Errors: 0, Skipped: 0, Time elapsed: 5.474 sec <<< FAILURE!
- in org.apache.falcon.messaging.JMSMessageConsumerTest
testJMSMessagesForOozieCoord(org.apache.falcon.messaging.JMSMessageConsumerTest)  Time elapsed:
0.076 sec  <<< FAILURE!
java.lang.AssertionError: expected:<12> but was:<11>
	at org.testng.Assert.fail(Assert.java:89)
	at org.testng.Assert.failNotEquals(Assert.java:489)
	at org.testng.Assert.assertEquals(Assert.java:118)
	at org.testng.Assert.assertEquals(Assert.java:260)
	at org.testng.Assert.assertEquals(Assert.java:270)
	at org.apache.falcon.messaging.JMSMessageConsumerTest.testJMSMessagesForOozieCoord(JMSMessageConsumerTest.java:267)

{code}

  was:
getTotalEnqueueCount() in 
{code}
org.apache.falcon.messaging.JMSMessageConsumerTest
testSubscriber(org.apache.falcon.messaging.JMSMessageConsumerTest)  Time elapsed: 0.732 sec
 <<< FAILURE!
java.lang.AssertionError: expected:<11> but was:<10>
	at org.testng.Assert.fail(Assert.java:89)
	at org.testng.Assert.failNotEquals(Assert.java:489)
	at org.testng.Assert.assertEquals(Assert.java:118)
	at org.testng.Assert.assertEquals(Assert.java:260)
	at org.testng.Assert.assertEquals(Assert.java:270)
	at org.apache.falcon.messaging.JMSMessageConsumerTest.testSubscriber(JMSMessageConsumerTest.java:145)

{code}

{code}
Running org.apache.falcon.messaging.JMSMessageConsumerTest
Tests run: 3, Failures: 2, Errors: 0, Skipped: 0, Time elapsed: 5.474 sec <<< FAILURE!
- in org.apache.falcon.messaging.JMSMessageConsumerTest
testJMSMessagesForOozieCoord(org.apache.falcon.messaging.JMSMessageConsumerTest)  Time elapsed:
0.076 sec  <<< FAILURE!
java.lang.AssertionError: expected:<12> but was:<11>
	at org.testng.Assert.fail(Assert.java:89)
	at org.testng.Assert.failNotEquals(Assert.java:489)
	at org.testng.Assert.assertEquals(Assert.java:118)
	at org.testng.Assert.assertEquals(Assert.java:260)
	at org.testng.Assert.assertEquals(Assert.java:270)
	at org.apache.falcon.messaging.JMSMessageConsumerTest.testJMSMessagesForOozieCoord(JMSMessageConsumerTest.java:267)

{code}


> Flaky test: org.apache.falcon.messaging.JMSMessageConsumerTest
> --------------------------------------------------------------
>
>                 Key: FALCON-1513
>                 URL: https://issues.apache.org/jira/browse/FALCON-1513
>             Project: Falcon
>          Issue Type: Sub-task
>    Affects Versions: 0.7
>            Reporter: Sowmya Ramesh
>            Assignee: Peeyush Bishnoi
>             Fix For: trunk
>
>
> getTotalEnqueueCount() in JMSMessageConsumerTest is flaky
> {code}
> org.apache.falcon.messaging.JMSMessageConsumerTest
> testSubscriber(org.apache.falcon.messaging.JMSMessageConsumerTest)  Time elapsed: 0.732
sec  <<< FAILURE!
> java.lang.AssertionError: expected:<11> but was:<10>
> 	at org.testng.Assert.fail(Assert.java:89)
> 	at org.testng.Assert.failNotEquals(Assert.java:489)
> 	at org.testng.Assert.assertEquals(Assert.java:118)
> 	at org.testng.Assert.assertEquals(Assert.java:260)
> 	at org.testng.Assert.assertEquals(Assert.java:270)
> 	at org.apache.falcon.messaging.JMSMessageConsumerTest.testSubscriber(JMSMessageConsumerTest.java:145)
> {code}
> {code}
> Running org.apache.falcon.messaging.JMSMessageConsumerTest
> Tests run: 3, Failures: 2, Errors: 0, Skipped: 0, Time elapsed: 5.474 sec <<<
FAILURE! - in org.apache.falcon.messaging.JMSMessageConsumerTest
> testJMSMessagesForOozieCoord(org.apache.falcon.messaging.JMSMessageConsumerTest)  Time
elapsed: 0.076 sec  <<< FAILURE!
> java.lang.AssertionError: expected:<12> but was:<11>
> 	at org.testng.Assert.fail(Assert.java:89)
> 	at org.testng.Assert.failNotEquals(Assert.java:489)
> 	at org.testng.Assert.assertEquals(Assert.java:118)
> 	at org.testng.Assert.assertEquals(Assert.java:260)
> 	at org.testng.Assert.assertEquals(Assert.java:270)
> 	at org.apache.falcon.messaging.JMSMessageConsumerTest.testJMSMessagesForOozieCoord(JMSMessageConsumerTest.java:267)
> {code}



--
This message was sent by Atlassian JIRA
(v6.3.4#6332)

Mime
View raw message