falcon-dev mailing list archives

Site index · List index
Message view « Date » · « Thread »
Top « Date » · « Thread »
From "Ajay Yadava (JIRA)" <j...@apache.org>
Subject [jira] [Commented] (FALCON-1488) Flaky FalconCLIIT
Date Fri, 25 Sep 2015 17:44:04 GMT

    [ https://issues.apache.org/jira/browse/FALCON-1488?page=com.atlassian.jira.plugin.system.issuetabpanels:comment-tabpanel&focusedCommentId=14908379#comment-14908379
] 

Ajay Yadava commented on FALCON-1488:
-------------------------------------

[~sowmyaramesh] I had actually already run the tests again before creating this. I will definitely
keep an eye out for it and attach the logs next time I encounter it. 

> Flaky FalconCLIIT
> -----------------
>
>                 Key: FALCON-1488
>                 URL: https://issues.apache.org/jira/browse/FALCON-1488
>             Project: Falcon
>          Issue Type: Sub-task
>            Reporter: Ajay Yadava
>             Fix For: trunk
>
>
> FalconCLIIT fails arbitrarily sometimes.
> {code}
> Running org.apache.falcon.cli.FalconCLIIT
> Tests run: 27, Failures: 1, Errors: 0, Skipped: 0, Time elapsed: 92.313 sec <<<
FAILURE! - in org.apache.falcon.cli.FalconCLIIT
> testSuspendResumeStatusEntityValidCommands(org.apache.falcon.cli.FalconCLIIT)  Time elapsed:
11.894 sec  <<< FAILURE!
> java.lang.AssertionError: expected:<0> but was:<-1>
> 	at org.testng.Assert.fail(Assert.java:89)
> 	at org.testng.Assert.failNotEquals(Assert.java:489)
> 	at org.testng.Assert.assertEquals(Assert.java:118)
> 	at org.testng.Assert.assertEquals(Assert.java:365)
> 	at org.testng.Assert.assertEquals(Assert.java:375)
> 	at org.apache.falcon.cli.FalconCLIIT.testSuspendResumeStatusEntityValidCommands(FalconCLIIT.java:261)
> {code}



--
This message was sent by Atlassian JIRA
(v6.3.4#6332)

Mime
View raw message