falcon-dev mailing list archives

Site index · List index
Message view « Date » · « Thread »
Top « Date » · « Thread »
From "Sowmya Ramesh (JIRA)" <j...@apache.org>
Subject [jira] [Updated] (FALCON-1466) Flaky test in CurrentUserTest
Date Thu, 24 Sep 2015 06:10:04 GMT

     [ https://issues.apache.org/jira/browse/FALCON-1466?page=com.atlassian.jira.plugin.system.issuetabpanels:all-tabpanel
]

Sowmya Ramesh updated FALCON-1466:
----------------------------------
    Fix Version/s: 0.8

> Flaky test in CurrentUserTest
> -----------------------------
>
>                 Key: FALCON-1466
>                 URL: https://issues.apache.org/jira/browse/FALCON-1466
>             Project: Falcon
>          Issue Type: Sub-task
>            Reporter: Pallavi Rao
>            Assignee: Sowmya Ramesh
>             Fix For: 0.8
>
>
> I see the following UT fail sporadically :
> {code}
> Running org.apache.falcon.security.CurrentUserTest
> Tests run: 46, Failures: 1, Errors: 0, Skipped: 45, Time elapsed: 1.635 sec <<<
FAILURE! - in org.apache.falcon.security.CurrentUserTest
> setUp(org.apache.falcon.security.CurrentUserTest)  Time elapsed: 1.266 sec  <<<
FAILURE!
> org.apache.falcon.FalconException: falcon.service.ProxyUserService.proxyuser.falcon.service.ProxyUserService.proxyuser.foo.groups
property not set in runtime properties. Please add it.
> 	at org.apache.falcon.service.ProxyUserService.init(ProxyUserService.java:97)
> 	at org.apache.falcon.security.CurrentUserTest.setUp(CurrentUserTest.java:51)
> {code}



--
This message was sent by Atlassian JIRA
(v6.3.4#6332)

Mime
View raw message