falcon-dev mailing list archives

Site index · List index
Message view « Date » · « Thread »
Top « Date » · « Thread »
From Apache Jenkins Server <jenk...@builds.apache.org>
Subject Build failed in Jenkins: Apache-Falcon-Distributed-Assembly #540
Date Fri, 18 Sep 2015 08:30:48 GMT
See <https://builds.apache.org/job/Apache-Falcon-Distributed-Assembly/540/changes>

Changes:

[pallavi.rao] FALCON-1434 Enhance schedule API to accept key-value properties(Contributed
by Pallavi Rao)

[ajaynsit] FALCON-1442 Contract of WorkflowEngine API broken. Contributed by Balu Vellanki.

------------------------------------------
[...truncated 554 lines...]
[INFO] No sources to compile
[INFO] 
[INFO] --- maven-surefire-plugin:2.16:test (default-test) @ falcon-hadoop-dependencies ---
[INFO] Tests are skipped.
[INFO] 
[INFO] --- maven-site-plugin:3.2:site (default) @ falcon-hadoop-dependencies ---
[INFO] maven.site.skip = true: Skipping site generation
[INFO] 
[INFO] --- maven-jar-plugin:2.4:jar (default-jar) @ falcon-hadoop-dependencies ---
[INFO] Building jar: <https://builds.apache.org/job/Apache-Falcon-Distributed-Assembly/ws/hadoop-dependencies/target/falcon-hadoop-dependencies-0.8-SNAPSHOT.jar>
[INFO] 
[INFO] --- maven-site-plugin:3.2:attach-descriptor (attach-descriptor) @ falcon-hadoop-dependencies
---
[INFO] 
[INFO] --- maven-dependency-plugin:2.8:copy-dependencies (default) @ falcon-hadoop-dependencies
---
[INFO] Copying jettison-1.3.jar to <https://builds.apache.org/job/Apache-Falcon-Distributed-Assembly/ws/hadoop-dependencies/target/dependency/jettison-1.3.jar>
[INFO] Copying protobuf-java-2.5.0.jar to <https://builds.apache.org/job/Apache-Falcon-Distributed-Assembly/ws/hadoop-dependencies/target/dependency/protobuf-java-2.5.0.jar>
[INFO] Copying commons-beanutils-1.8.3.jar to <https://builds.apache.org/job/Apache-Falcon-Distributed-Assembly/ws/hadoop-dependencies/target/dependency/commons-beanutils-1.8.3.jar>
[INFO] Copying jersey-json-1.9.jar to <https://builds.apache.org/job/Apache-Falcon-Distributed-Assembly/ws/hadoop-dependencies/target/dependency/jersey-json-1.9.jar>
[INFO] Copying guice-3.0.jar to <https://builds.apache.org/job/Apache-Falcon-Distributed-Assembly/ws/hadoop-dependencies/target/dependency/guice-3.0.jar>
[INFO] Copying api-asn1-api-1.0.0-M20.jar to <https://builds.apache.org/job/Apache-Falcon-Distributed-Assembly/ws/hadoop-dependencies/target/dependency/api-asn1-api-1.0.0-M20.jar>
[INFO] Copying hadoop-mapreduce-client-common-2.5.0.jar to <https://builds.apache.org/job/Apache-Falcon-Distributed-Assembly/ws/hadoop-dependencies/target/dependency/hadoop-mapreduce-client-common-2.5.0.jar>
[INFO] Copying stax-api-1.0.1.jar to <https://builds.apache.org/job/Apache-Falcon-Distributed-Assembly/ws/hadoop-dependencies/target/dependency/stax-api-1.0.1.jar>
[INFO] Copying jackson-xc-1.8.3.jar to <https://builds.apache.org/job/Apache-Falcon-Distributed-Assembly/ws/hadoop-dependencies/target/dependency/jackson-xc-1.8.3.jar>
[INFO] Copying api-util-1.0.0-M20.jar to <https://builds.apache.org/job/Apache-Falcon-Distributed-Assembly/ws/hadoop-dependencies/target/dependency/api-util-1.0.0-M20.jar>
[INFO] Copying xz-1.0.jar to <https://builds.apache.org/job/Apache-Falcon-Distributed-Assembly/ws/hadoop-dependencies/target/dependency/xz-1.0.jar>
[INFO] Copying junit-3.8.1.jar to <https://builds.apache.org/job/Apache-Falcon-Distributed-Assembly/ws/hadoop-dependencies/target/dependency/junit-3.8.1.jar>
[INFO] Copying jsp-api-2.0.jar to <https://builds.apache.org/job/Apache-Falcon-Distributed-Assembly/ws/hadoop-dependencies/target/dependency/jsp-api-2.0.jar>
[INFO] Copying commons-lang-2.6.jar to <https://builds.apache.org/job/Apache-Falcon-Distributed-Assembly/ws/hadoop-dependencies/target/dependency/commons-lang-2.6.jar>
[INFO] Copying jackson-core-asl-1.5.2.jar to <https://builds.apache.org/job/Apache-Falcon-Distributed-Assembly/ws/hadoop-dependencies/target/dependency/jackson-core-asl-1.5.2.jar>
[INFO] Copying jersey-core-1.9.jar to <https://builds.apache.org/job/Apache-Falcon-Distributed-Assembly/ws/hadoop-dependencies/target/dependency/jersey-core-1.9.jar>
[INFO] Copying hadoop-hdfs-2.5.0.jar to <https://builds.apache.org/job/Apache-Falcon-Distributed-Assembly/ws/hadoop-dependencies/target/dependency/hadoop-hdfs-2.5.0.jar>
[INFO] Copying leveldbjni-all-1.8.jar to <https://builds.apache.org/job/Apache-Falcon-Distributed-Assembly/ws/hadoop-dependencies/target/dependency/leveldbjni-all-1.8.jar>
[INFO] Copying commons-daemon-1.0.13.jar to <https://builds.apache.org/job/Apache-Falcon-Distributed-Assembly/ws/hadoop-dependencies/target/dependency/commons-daemon-1.0.13.jar>
[INFO] Copying hadoop-common-2.5.0.jar to <https://builds.apache.org/job/Apache-Falcon-Distributed-Assembly/ws/hadoop-dependencies/target/dependency/hadoop-common-2.5.0.jar>
[INFO] Copying jetty-util-6.1.26.jar to <https://builds.apache.org/job/Apache-Falcon-Distributed-Assembly/ws/hadoop-dependencies/target/dependency/jetty-util-6.1.26.jar>
[INFO] Copying log4j-1.2.17.jar to <https://builds.apache.org/job/Apache-Falcon-Distributed-Assembly/ws/hadoop-dependencies/target/dependency/log4j-1.2.17.jar>
[INFO] Copying hadoop-yarn-server-applicationhistoryservice-2.5.0.jar to <https://builds.apache.org/job/Apache-Falcon-Distributed-Assembly/ws/hadoop-dependencies/target/dependency/hadoop-yarn-server-applicationhistoryservice-2.5.0.jar>
[INFO] Copying guava-11.0.2.jar to <https://builds.apache.org/job/Apache-Falcon-Distributed-Assembly/ws/hadoop-dependencies/target/dependency/guava-11.0.2.jar>
[INFO] Copying commons-httpclient-3.1.jar to <https://builds.apache.org/job/Apache-Falcon-Distributed-Assembly/ws/hadoop-dependencies/target/dependency/commons-httpclient-3.1.jar>
[INFO] Copying netty-3.6.2.Final.jar to <https://builds.apache.org/job/Apache-Falcon-Distributed-Assembly/ws/hadoop-dependencies/target/dependency/netty-3.6.2.Final.jar>
[INFO] Copying jsch-0.1.42.jar to <https://builds.apache.org/job/Apache-Falcon-Distributed-Assembly/ws/hadoop-dependencies/target/dependency/jsch-0.1.42.jar>
[INFO] Copying commons-io-2.2.jar to <https://builds.apache.org/job/Apache-Falcon-Distributed-Assembly/ws/hadoop-dependencies/target/dependency/commons-io-2.2.jar>
[INFO] Copying commons-digester-1.8.jar to <https://builds.apache.org/job/Apache-Falcon-Distributed-Assembly/ws/hadoop-dependencies/target/dependency/commons-digester-1.8.jar>
[INFO] Copying activation-1.1.jar to <https://builds.apache.org/job/Apache-Falcon-Distributed-Assembly/ws/hadoop-dependencies/target/dependency/activation-1.1.jar>
[INFO] Copying paranamer-2.3.jar to <https://builds.apache.org/job/Apache-Falcon-Distributed-Assembly/ws/hadoop-dependencies/target/dependency/paranamer-2.3.jar>
[INFO] Copying httpclient-4.2.5.jar to <https://builds.apache.org/job/Apache-Falcon-Distributed-Assembly/ws/hadoop-dependencies/target/dependency/httpclient-4.2.5.jar>
[INFO] Copying commons-logging-1.1.3.jar to <https://builds.apache.org/job/Apache-Falcon-Distributed-Assembly/ws/hadoop-dependencies/target/dependency/commons-logging-1.1.3.jar>
[INFO] Copying xmlenc-0.52.jar to <https://builds.apache.org/job/Apache-Falcon-Distributed-Assembly/ws/hadoop-dependencies/target/dependency/xmlenc-0.52.jar>
[INFO] Copying guice-servlet-3.0.jar to <https://builds.apache.org/job/Apache-Falcon-Distributed-Assembly/ws/hadoop-dependencies/target/dependency/guice-servlet-3.0.jar>
[INFO] Copying hadoop-mapreduce-client-jobclient-2.5.0.jar to <https://builds.apache.org/job/Apache-Falcon-Distributed-Assembly/ws/hadoop-dependencies/target/dependency/hadoop-mapreduce-client-jobclient-2.5.0.jar>
[INFO] Copying jackson-mapper-asl-1.5.2.jar to <https://builds.apache.org/job/Apache-Falcon-Distributed-Assembly/ws/hadoop-dependencies/target/dependency/jackson-mapper-asl-1.5.2.jar>
[INFO] Copying commons-beanutils-core-1.8.0.jar to <https://builds.apache.org/job/Apache-Falcon-Distributed-Assembly/ws/hadoop-dependencies/target/dependency/commons-beanutils-core-1.8.0.jar>
[INFO] Copying aopalliance-1.0.jar to <https://builds.apache.org/job/Apache-Falcon-Distributed-Assembly/ws/hadoop-dependencies/target/dependency/aopalliance-1.0.jar>
[INFO] Copying commons-codec-1.8.jar to <https://builds.apache.org/job/Apache-Falcon-Distributed-Assembly/ws/hadoop-dependencies/target/dependency/commons-codec-1.8.jar>
[INFO] Copying commons-cli-1.2.jar to <https://builds.apache.org/job/Apache-Falcon-Distributed-Assembly/ws/hadoop-dependencies/target/dependency/commons-cli-1.2.jar>
[INFO] Copying hadoop-yarn-api-2.5.0.jar to <https://builds.apache.org/job/Apache-Falcon-Distributed-Assembly/ws/hadoop-dependencies/target/dependency/hadoop-yarn-api-2.5.0.jar>
[INFO] Copying stax-api-1.0-2.jar to <https://builds.apache.org/job/Apache-Falcon-Distributed-Assembly/ws/hadoop-dependencies/target/dependency/stax-api-1.0-2.jar>
[INFO] Copying apacheds-kerberos-codec-2.0.0-M15.jar to <https://builds.apache.org/job/Apache-Falcon-Distributed-Assembly/ws/hadoop-dependencies/target/dependency/apacheds-kerberos-codec-2.0.0-M15.jar>
[INFO] Copying jcommander-1.12.jar to <https://builds.apache.org/job/Apache-Falcon-Distributed-Assembly/ws/hadoop-dependencies/target/dependency/jcommander-1.12.jar>
[INFO] Copying tools.jar to <https://builds.apache.org/job/Apache-Falcon-Distributed-Assembly/ws/hadoop-dependencies/target/dependency/jdk.tools-1.7.jar>
[INFO] Copying slf4j-api-1.7.5.jar to <https://builds.apache.org/job/Apache-Falcon-Distributed-Assembly/ws/hadoop-dependencies/target/dependency/slf4j-api-1.7.5.jar>
[INFO] Copying hadoop-auth-2.5.0.jar to <https://builds.apache.org/job/Apache-Falcon-Distributed-Assembly/ws/hadoop-dependencies/target/dependency/hadoop-auth-2.5.0.jar>
[INFO] Copying jsr305-1.3.9.jar to <https://builds.apache.org/job/Apache-Falcon-Distributed-Assembly/ws/hadoop-dependencies/target/dependency/jsr305-1.3.9.jar>
[INFO] Copying zookeeper-3.4.6.jar to <https://builds.apache.org/job/Apache-Falcon-Distributed-Assembly/ws/hadoop-dependencies/target/dependency/zookeeper-3.4.6.jar>
[INFO] Copying jasper-compiler-5.5.23.jar to <https://builds.apache.org/job/Apache-Falcon-Distributed-Assembly/ws/hadoop-dependencies/target/dependency/jasper-compiler-5.5.23.jar>
[INFO] Copying testng-6.1.1.jar to <https://builds.apache.org/job/Apache-Falcon-Distributed-Assembly/ws/hadoop-dependencies/target/dependency/testng-6.1.1.jar>
[INFO] Copying avro-1.7.4.jar to <https://builds.apache.org/job/Apache-Falcon-Distributed-Assembly/ws/hadoop-dependencies/target/dependency/avro-1.7.4.jar>
[INFO] Copying apacheds-i18n-2.0.0-M15.jar to <https://builds.apache.org/job/Apache-Falcon-Distributed-Assembly/ws/hadoop-dependencies/target/dependency/apacheds-i18n-2.0.0-M15.jar>
[INFO] Copying hadoop-yarn-common-2.5.0.jar to <https://builds.apache.org/job/Apache-Falcon-Distributed-Assembly/ws/hadoop-dependencies/target/dependency/hadoop-yarn-common-2.5.0.jar>
[INFO] Copying jackson-jaxrs-1.8.3.jar to <https://builds.apache.org/job/Apache-Falcon-Distributed-Assembly/ws/hadoop-dependencies/target/dependency/jackson-jaxrs-1.8.3.jar>
[INFO] Copying commons-compress-1.4.1.jar to <https://builds.apache.org/job/Apache-Falcon-Distributed-Assembly/ws/hadoop-dependencies/target/dependency/commons-compress-1.4.1.jar>
[INFO] Copying hadoop-yarn-server-resourcemanager-2.5.0.jar to <https://builds.apache.org/job/Apache-Falcon-Distributed-Assembly/ws/hadoop-dependencies/target/dependency/hadoop-yarn-server-resourcemanager-2.5.0.jar>
[INFO] Copying hadoop-client-2.5.0.jar to <https://builds.apache.org/job/Apache-Falcon-Distributed-Assembly/ws/hadoop-dependencies/target/dependency/hadoop-client-2.5.0.jar>
[INFO] Copying servlet-api-2.5.jar to <https://builds.apache.org/job/Apache-Falcon-Distributed-Assembly/ws/hadoop-dependencies/target/dependency/servlet-api-2.5.jar>
[INFO] Copying commons-collections-3.2.1.jar to <https://builds.apache.org/job/Apache-Falcon-Distributed-Assembly/ws/hadoop-dependencies/target/dependency/commons-collections-3.2.1.jar>
[INFO] Copying jersey-client-1.9.jar to <https://builds.apache.org/job/Apache-Falcon-Distributed-Assembly/ws/hadoop-dependencies/target/dependency/jersey-client-1.9.jar>
[INFO] Copying hadoop-mapreduce-client-app-2.5.0.jar to <https://builds.apache.org/job/Apache-Falcon-Distributed-Assembly/ws/hadoop-dependencies/target/dependency/hadoop-mapreduce-client-app-2.5.0.jar>
[INFO] Copying hadoop-mapreduce-client-shuffle-2.5.0.jar to <https://builds.apache.org/job/Apache-Falcon-Distributed-Assembly/ws/hadoop-dependencies/target/dependency/hadoop-mapreduce-client-shuffle-2.5.0.jar>
[INFO] Copying hadoop-yarn-client-2.5.0.jar to <https://builds.apache.org/job/Apache-Falcon-Distributed-Assembly/ws/hadoop-dependencies/target/dependency/hadoop-yarn-client-2.5.0.jar>
[INFO] Copying commons-math3-3.1.1.jar to <https://builds.apache.org/job/Apache-Falcon-Distributed-Assembly/ws/hadoop-dependencies/target/dependency/commons-math3-3.1.1.jar>
[INFO] Copying jaxb-api-2.1.jar to <https://builds.apache.org/job/Apache-Falcon-Distributed-Assembly/ws/hadoop-dependencies/target/dependency/jaxb-api-2.1.jar>
[INFO] Copying slf4j-log4j12-1.7.5.jar to <https://builds.apache.org/job/Apache-Falcon-Distributed-Assembly/ws/hadoop-dependencies/target/dependency/slf4j-log4j12-1.7.5.jar>
[INFO] Copying bsh-2.0b4.jar to <https://builds.apache.org/job/Apache-Falcon-Distributed-Assembly/ws/hadoop-dependencies/target/dependency/bsh-2.0b4.jar>
[INFO] Copying commons-configuration-1.6.jar to <https://builds.apache.org/job/Apache-Falcon-Distributed-Assembly/ws/hadoop-dependencies/target/dependency/commons-configuration-1.6.jar>
[INFO] Copying hadoop-yarn-server-nodemanager-2.5.0.jar to <https://builds.apache.org/job/Apache-Falcon-Distributed-Assembly/ws/hadoop-dependencies/target/dependency/hadoop-yarn-server-nodemanager-2.5.0.jar>
[INFO] Copying hadoop-yarn-server-common-2.5.0.jar to <https://builds.apache.org/job/Apache-Falcon-Distributed-Assembly/ws/hadoop-dependencies/target/dependency/hadoop-yarn-server-common-2.5.0.jar>
[INFO] Copying javax.inject-1.jar to <https://builds.apache.org/job/Apache-Falcon-Distributed-Assembly/ws/hadoop-dependencies/target/dependency/javax.inject-1.jar>
[INFO] Copying hadoop-yarn-server-web-proxy-2.5.0.jar to <https://builds.apache.org/job/Apache-Falcon-Distributed-Assembly/ws/hadoop-dependencies/target/dependency/hadoop-yarn-server-web-proxy-2.5.0.jar>
[INFO] Copying hadoop-annotations-2.5.0.jar to <https://builds.apache.org/job/Apache-Falcon-Distributed-Assembly/ws/hadoop-dependencies/target/dependency/hadoop-annotations-2.5.0.jar>
[INFO] Copying hadoop-distcp-2.5.0.jar to <https://builds.apache.org/job/Apache-Falcon-Distributed-Assembly/ws/hadoop-dependencies/target/dependency/hadoop-distcp-2.5.0.jar>
[INFO] Copying jersey-guice-1.9.jar to <https://builds.apache.org/job/Apache-Falcon-Distributed-Assembly/ws/hadoop-dependencies/target/dependency/jersey-guice-1.9.jar>
[INFO] Copying jaxb-impl-2.2.3-1.jar to <https://builds.apache.org/job/Apache-Falcon-Distributed-Assembly/ws/hadoop-dependencies/target/dependency/jaxb-impl-2.2.3-1.jar>
[INFO] Copying jasper-runtime-5.5.23.jar to <https://builds.apache.org/job/Apache-Falcon-Distributed-Assembly/ws/hadoop-dependencies/target/dependency/jasper-runtime-5.5.23.jar>
[INFO] Copying jets3t-0.9.0.jar to <https://builds.apache.org/job/Apache-Falcon-Distributed-Assembly/ws/hadoop-dependencies/target/dependency/jets3t-0.9.0.jar>
[INFO] Copying commons-net-3.1.jar to <https://builds.apache.org/job/Apache-Falcon-Distributed-Assembly/ws/hadoop-dependencies/target/dependency/commons-net-3.1.jar>
[INFO] Copying commons-el-1.0.jar to <https://builds.apache.org/job/Apache-Falcon-Distributed-Assembly/ws/hadoop-dependencies/target/dependency/commons-el-1.0.jar>
[INFO] Copying httpcore-4.1.2.jar to <https://builds.apache.org/job/Apache-Falcon-Distributed-Assembly/ws/hadoop-dependencies/target/dependency/httpcore-4.1.2.jar>
[INFO] Copying snappy-java-1.0.4.1.jar to <https://builds.apache.org/job/Apache-Falcon-Distributed-Assembly/ws/hadoop-dependencies/target/dependency/snappy-java-1.0.4.1.jar>
[INFO] Copying asm-3.1.jar to <https://builds.apache.org/job/Apache-Falcon-Distributed-Assembly/ws/hadoop-dependencies/target/dependency/asm-3.1.jar>
[INFO] Copying jetty-6.1.26.jar to <https://builds.apache.org/job/Apache-Falcon-Distributed-Assembly/ws/hadoop-dependencies/target/dependency/jetty-6.1.26.jar>
[INFO] Copying java-xmlbuilder-0.4.jar to <https://builds.apache.org/job/Apache-Falcon-Distributed-Assembly/ws/hadoop-dependencies/target/dependency/java-xmlbuilder-0.4.jar>
[INFO] Copying jersey-server-1.9.jar to <https://builds.apache.org/job/Apache-Falcon-Distributed-Assembly/ws/hadoop-dependencies/target/dependency/jersey-server-1.9.jar>
[INFO] Copying snakeyaml-1.6.jar to <https://builds.apache.org/job/Apache-Falcon-Distributed-Assembly/ws/hadoop-dependencies/target/dependency/snakeyaml-1.6.jar>
[INFO] Copying hadoop-mapreduce-client-core-2.5.0.jar to <https://builds.apache.org/job/Apache-Falcon-Distributed-Assembly/ws/hadoop-dependencies/target/dependency/hadoop-mapreduce-client-core-2.5.0.jar>
[INFO]                                                                         
[INFO] ------------------------------------------------------------------------
[INFO] Building Apache Falcon Test Utility 0.8-SNAPSHOT
[INFO] ------------------------------------------------------------------------
[INFO] 
[INFO] --- maven-clean-plugin:2.5:clean (default-clean) @ falcon-test-util ---
[INFO] Deleting <https://builds.apache.org/job/Apache-Falcon-Distributed-Assembly/ws/test-util/target>
[INFO] 
[INFO] --- maven-enforcer-plugin:1.3.1:enforce (enforce-property) @ falcon-test-util ---
[INFO] 
[INFO] --- buildnumber-maven-plugin:1.0:create (default) @ falcon-test-util ---
[INFO] Checking for local modifications: skipped.
[INFO] Updating project files from SCM: skipped.
[INFO] Executing: /bin/sh -c cd <https://builds.apache.org/job/Apache-Falcon-Distributed-Assembly/ws/test-util>
&& git show
[INFO] Working directory: <https://builds.apache.org/job/Apache-Falcon-Distributed-Assembly/ws/test-util>
[INFO] Storing buildNumber: 52ce7f8332e4f3dc9b0b644cb8cef3453ae7e1da at timestamp: 1442565054597
[INFO] Executing: /bin/sh -c cd <https://builds.apache.org/job/Apache-Falcon-Distributed-Assembly/ws/test-util>
&& git show
[INFO] Working directory: <https://builds.apache.org/job/Apache-Falcon-Distributed-Assembly/ws/test-util>
[INFO] Storing buildScmBranch: UNKNOWN
[INFO] 
[INFO] --- maven-remote-resources-plugin:1.4:process (default) @ falcon-test-util ---
[INFO] 
[INFO] --- maven-resources-plugin:2.6:resources (default-resources) @ falcon-test-util ---
[INFO] Using 'UTF-8' encoding to copy filtered resources.
[INFO] Copying 1 resource
[INFO] Copying 0 resource
[INFO] skip non existing resourceDirectory <https://builds.apache.org/job/Apache-Falcon-Distributed-Assembly/ws/test-util/src/test/resources>
[INFO] Copying 2 resources to META-INF
[INFO] Copying 3 resources
[INFO] 
[INFO] --- maven-compiler-plugin:2.3.2:compile (default-compile) @ falcon-test-util ---
[INFO] Compiling 3 source files to <https://builds.apache.org/job/Apache-Falcon-Distributed-Assembly/ws/test-util/target/classes>
[INFO] 
[INFO] --- maven-resources-plugin:2.6:testResources (default-testResources) @ falcon-test-util
---
[INFO] Using 'UTF-8' encoding to copy filtered resources.
[INFO] skip non existing resourceDirectory <https://builds.apache.org/job/Apache-Falcon-Distributed-Assembly/ws/test-util/src/test/resources>
[INFO] Copying 3 resources
[INFO] 
[INFO] --- maven-compiler-plugin:2.3.2:testCompile (default-testCompile) @ falcon-test-util
---
[INFO] No sources to compile
[INFO] 
[INFO] --- maven-surefire-plugin:2.16:test (default-test) @ falcon-test-util ---
[INFO] Tests are skipped.
[INFO] 
[INFO] --- maven-site-plugin:3.2:site (default) @ falcon-test-util ---
[INFO] maven.site.skip = true: Skipping site generation
[INFO] 
[INFO] --- maven-jar-plugin:2.4:jar (default-jar) @ falcon-test-util ---
[INFO] Building jar: <https://builds.apache.org/job/Apache-Falcon-Distributed-Assembly/ws/test-util/target/falcon-test-util-0.8-SNAPSHOT.jar>
[INFO] 
[INFO] --- maven-site-plugin:3.2:attach-descriptor (attach-descriptor) @ falcon-test-util
---
[INFO]                                                                         
[INFO] ------------------------------------------------------------------------
[INFO] Building Apache Falcon Commons 0.8-SNAPSHOT
[INFO] ------------------------------------------------------------------------
[INFO] 
[INFO] --- maven-clean-plugin:2.5:clean (default-clean) @ falcon-common ---
[INFO] Deleting <https://builds.apache.org/job/Apache-Falcon-Distributed-Assembly/ws/common/target>
[INFO] 
[INFO] --- maven-enforcer-plugin:1.3.1:enforce (enforce-property) @ falcon-common ---
[INFO] 
[INFO] --- buildnumber-maven-plugin:1.0:create (default) @ falcon-common ---
[INFO] Checking for local modifications: skipped.
[INFO] Updating project files from SCM: skipped.
[INFO] Executing: /bin/sh -c cd <https://builds.apache.org/job/Apache-Falcon-Distributed-Assembly/ws/common>
&& git show
[INFO] Working directory: <https://builds.apache.org/job/Apache-Falcon-Distributed-Assembly/ws/common>
[INFO] Storing buildNumber: 52ce7f8332e4f3dc9b0b644cb8cef3453ae7e1da at timestamp: 1442565056593
[INFO] Executing: /bin/sh -c cd <https://builds.apache.org/job/Apache-Falcon-Distributed-Assembly/ws/common>
&& git show
[INFO] Working directory: <https://builds.apache.org/job/Apache-Falcon-Distributed-Assembly/ws/common>
[INFO] Storing buildScmBranch: UNKNOWN
[INFO] 
[INFO] --- maven-remote-resources-plugin:1.4:process (default) @ falcon-common ---
[INFO] 
[INFO] --- maven-resources-plugin:2.6:resources (default-resources) @ falcon-common ---
[INFO] Using 'UTF-8' encoding to copy filtered resources.
[INFO] Copying 0 resource
[INFO] Copying 3 resources
[INFO] Copying 0 resource
[INFO] Copying 2 resources to META-INF
[INFO] Copying 3 resources
[INFO] 
[INFO] --- maven-compiler-plugin:2.3.2:compile (default-compile) @ falcon-common ---
[INFO] Compiling 87 source files to <https://builds.apache.org/job/Apache-Falcon-Distributed-Assembly/ws/common/target/classes>
[INFO] -------------------------------------------------------------
[ERROR] COMPILATION ERROR : 
[INFO] -------------------------------------------------------------
[ERROR] <https://builds.apache.org/job/Apache-Falcon-Distributed-Assembly/ws/common/src/main/java/org/apache/falcon/workflow/engine/AbstractWorkflowEngine.java>:[52,69]
error: cannot find symbol
[INFO] 1 error
[INFO] -------------------------------------------------------------
[INFO]                                                                         
[INFO] ------------------------------------------------------------------------
[INFO] Skipping Apache Falcon
[INFO] This project has been banned from the build due to previous failures.
[INFO] ------------------------------------------------------------------------
[INFO] ------------------------------------------------------------------------
[INFO] Reactor Summary:
[INFO] 
[INFO] Apache Falcon ..................................... SUCCESS [  1.704 s]
[INFO] Apache Falcon UI .................................. SUCCESS [  8.238 s]
[INFO] Checkstyle ........................................ SUCCESS [  0.370 s]
[INFO] Build Tools ....................................... SUCCESS [  2.922 s]
[INFO] Apache Falcon CLI client .......................... SUCCESS [  7.984 s]
[INFO] Apache Falcon Metrics ............................. SUCCESS [  2.076 s]
[INFO] Apache Falcon Hadoop Dependencies ................. SUCCESS [  2.377 s]
[INFO] Apache Falcon Test Utility ........................ SUCCESS [  1.982 s]
[INFO] Apache Falcon Commons ............................. FAILURE [  3.999 s]
[INFO] Apache Falcon Oozie EL Extension .................. SKIPPED
[INFO] Apache Falcon Embedded Hadoop - Test Cluster ...... SKIPPED
[INFO] Apache Falcon Sharelib Hive - Test Cluster ........ SKIPPED
[INFO] Apache Falcon Sharelib Pig - Test Cluster ......... SKIPPED
[INFO] Apache Falcon Sharelib Hcatalog - Test Cluster .... SKIPPED
[INFO] Apache Falcon Sharelib Oozie - Test Cluster ....... SKIPPED
[INFO] Apache Falcon Test Tools - Test Cluster ........... SKIPPED
[INFO] Apache Falcon Messaging ........................... SKIPPED
[INFO] Apache Falcon Oozie Adaptor ....................... SKIPPED
[INFO] Apache Falcon Acquisition ......................... SKIPPED
[INFO] Apache Falcon Distcp Replication .................. SKIPPED
[INFO] Apache Falcon Retention ........................... SKIPPED
[INFO] Apache Falcon Archival ............................ SKIPPED
[INFO] Apache Falcon Rerun ............................... SKIPPED
[INFO] Apache Falcon Prism ............................... SKIPPED
[INFO] falcon-unit ....................................... SKIPPED
[INFO] Apache Falcon Web Application ..................... SKIPPED
[INFO] Apache Falcon Documentation ....................... SKIPPED
[INFO] ------------------------------------------------------------------------
[INFO] BUILD FAILURE
[INFO] ------------------------------------------------------------------------
[INFO] Total time: 32.535 s
[INFO] Finished at: 2015-09-18T08:31:00+00:00
[INFO] Final Memory: 160M/1304M
[INFO] ------------------------------------------------------------------------
[ERROR] Failed to execute goal org.apache.maven.plugins:maven-compiler-plugin:2.3.2:compile
(default-compile) on project falcon-common: Compilation failure
[ERROR] <https://builds.apache.org/job/Apache-Falcon-Distributed-Assembly/ws/common/src/main/java/org/apache/falcon/workflow/engine/AbstractWorkflowEngine.java>:[52,69]
error: cannot find symbol
[ERROR] -> [Help 1]
[ERROR] 
[ERROR] To see the full stack trace of the errors, re-run Maven with the -e switch.
[ERROR] Re-run Maven using the -X switch to enable full debug logging.
[ERROR] 
[ERROR] For more information about the errors and possible solutions, please read the following
articles:
[ERROR] [Help 1] http://cwiki.apache.org/confluence/display/MAVEN/MojoFailureException
[ERROR] 
[ERROR] After correcting the problems, you can resume the build with the command
[ERROR]   mvn <goals> -rf :falcon-common
Build step 'Execute shell' marked build as failure
Archiving artifacts

Mime
View raw message