falcon-dev mailing list archives

Site index · List index
Message view « Date » · « Thread »
Top « Date » · « Thread »
From "pavan kumar kolamuri (JIRA)" <j...@apache.org>
Subject [jira] [Updated] (FALCON-1392) FalconUnit tests fail
Date Tue, 18 Aug 2015 09:43:46 GMT

     [ https://issues.apache.org/jira/browse/FALCON-1392?page=com.atlassian.jira.plugin.system.issuetabpanels:all-tabpanel
]

pavan kumar kolamuri updated FALCON-1392:
-----------------------------------------
    Attachment: FALCON-1392.patch

> FalconUnit tests fail
> ---------------------
>
>                 Key: FALCON-1392
>                 URL: https://issues.apache.org/jira/browse/FALCON-1392
>             Project: Falcon
>          Issue Type: Sub-task
>    Affects Versions: 0.7
>            Reporter: Ajay Yadava
>            Assignee: pavan kumar kolamuri
>         Attachments: FALCON-1392.patch
>
>
> Following is the error as reported by [~venkatnrangan]
> {code}
> Running org.apache.falcon.unit.TestFalconUnit
> objc[84906]: Class JavaLaunchHelper is implemented in both /Library/Java/JavaVirtualMachines/jdk1.7.0_75.jdk/Contents/Home/jre/bin/java
and /Library/Java/JavaVirtualMachines/jdk1.7.0_75.jdk/Contents/Home/jre/lib/libinstrument.dylib.
One of the two will be used. Which one is undefined.
> Tests run: 1, Failures: 1, Errors: 0, Skipped: 0, Time elapsed: 28.787 sec <<<
FAILURE! - in org.apache.falcon.unit.TestFalconUnit
> testProcessInstanceExecution(org.apache.falcon.unit.TestFalconUnit)  Time elapsed: 25.957
sec  <<< FAILURE!
> java.lang.AssertionError: expected:<RUNNING> but was:<SUCCEEDED>
>         at org.testng.Assert.fail(Assert.java:89)
>         at org.testng.Assert.failNotEquals(Assert.java:489)
>         at org.testng.Assert.assertEquals(Assert.java:118)
>         at org.testng.Assert.assertEquals(Assert.java:160)
>         at org.apache.falcon.unit.TestFalconUnit.testProcessInstanceExecution(TestFalconUnit.java:52)
> Results :
> Failed tests:
>   TestFalconUnit.testProcessInstanceExecution:52 expected:<RUNNING> but was:<SUCCEEDED>
> Tests run: 1, Failures: 1, Errors: 0, Skipped: 0
> {code}



--
This message was sent by Atlassian JIRA
(v6.3.4#6332)

Mime
View raw message