falcon-dev mailing list archives

Site index · List index
Message view « Date » · « Thread »
Top « Date » · « Thread »
From "Srikanth Sundarrajan (JIRA)" <j...@apache.org>
Subject [jira] [Resolved] (FALCON-1307) Falcon trunk build is broken
Date Wed, 08 Jul 2015 14:33:04 GMT

     [ https://issues.apache.org/jira/browse/FALCON-1307?page=com.atlassian.jira.plugin.system.issuetabpanels:all-tabpanel
]

Srikanth Sundarrajan resolved FALCON-1307.
------------------------------------------
       Resolution: Fixed
         Assignee: Srikanth Sundarrajan
    Fix Version/s: 0.7

Reverted FALCON-991

> Falcon trunk build is broken
> ----------------------------
>
>                 Key: FALCON-1307
>                 URL: https://issues.apache.org/jira/browse/FALCON-1307
>             Project: Falcon
>          Issue Type: Bug
>            Reporter: Srikanth Sundarrajan
>            Assignee: Srikanth Sundarrajan
>            Priority: Blocker
>             Fix For: 0.7
>
>
> {noformat}
> Tests run: 5, Failures: 1, Errors: 0, Skipped: 0, Time elapsed: 15.286 sec <<<
FAILURE! - in org.apache.falcon.resource.EntityManagerPaginationJerseyIT
> testPaginationEntitySummary(org.apache.falcon.resource.EntityManagerPaginationJerseyIT)
 Time elapsed: 3.13 sec  <<< FAILURE!
> java.lang.AssertionError: expected:<200> but was:<400>
> 	at org.testng.Assert.fail(Assert.java:89)
> 	at org.testng.Assert.failNotEquals(Assert.java:489)
> 	at org.testng.Assert.assertEquals(Assert.java:118)
> 	at org.testng.Assert.assertEquals(Assert.java:365)
> 	at org.testng.Assert.assertEquals(Assert.java:375)
> 	at org.apache.falcon.resource.EntityManagerPaginationJerseyIT.testPaginationEntitySummary(EntityManagerPaginationJerseyIT.java:148)
> {noformat}



--
This message was sent by Atlassian JIRA
(v6.3.4#6332)

Mime
View raw message