falcon-dev mailing list archives

Site index · List index
Message view « Date » · « Thread »
Top « Date » · « Thread »
From Apache Jenkins Server <jenk...@builds.apache.org>
Subject Build failed in Jenkins: Apache-falcon #650
Date Tue, 05 May 2015 01:58:54 GMT
See <https://builds.apache.org/job/Apache-falcon/650/>

------------------------------------------
[...truncated 2341 lines...]
[INFO] >>> findbugs-maven-plugin:2.5.2:check (findbugs-check) @ falcon-messaging
>>>
[INFO] 
[INFO] --- findbugs-maven-plugin:2.5.2:findbugs (findbugs) @ falcon-messaging ---
[INFO] Fork Value is true
[INFO] Done FindBugs Analysis....
[INFO] 
[INFO] <<< findbugs-maven-plugin:2.5.2:check (findbugs-check) @ falcon-messaging
<<<
[INFO] 
[INFO] --- findbugs-maven-plugin:2.5.2:check (findbugs-check) @ falcon-messaging ---
[INFO] BugInstance size is 0
[INFO] Error size is 0
[INFO] No errors/warnings found
[INFO]                                                                         
[INFO] ------------------------------------------------------------------------
[INFO] Building Apache Falcon Oozie Adaptor 0.7-SNAPSHOT
[INFO] ------------------------------------------------------------------------
[INFO] 
[INFO] --- maven-clean-plugin:2.5:clean (default-clean) @ falcon-oozie-adaptor ---
[INFO] Deleting <https://builds.apache.org/job/Apache-falcon/ws/oozie/target>
[INFO] 
[INFO] --- maven-enforcer-plugin:1.3.1:enforce (enforce-property) @ falcon-oozie-adaptor ---
[INFO] 
[INFO] --- buildnumber-maven-plugin:1.0:create (default) @ falcon-oozie-adaptor ---
[INFO] Checking for local modifications: skipped.
[INFO] Updating project files from SCM: skipped.
[INFO] Executing: /bin/sh -c cd <https://builds.apache.org/job/Apache-falcon/ws/oozie>
&& git show
[INFO] Working directory: <https://builds.apache.org/job/Apache-falcon/ws/oozie>
[INFO] Storing buildNumber: bbd01241c7999b4c0362160c32659ea18a97df7b at timestamp: 1430791094945
[INFO] Executing: /bin/sh -c cd <https://builds.apache.org/job/Apache-falcon/ws/oozie>
&& git show
[INFO] Working directory: <https://builds.apache.org/job/Apache-falcon/ws/oozie>
[INFO] Storing buildScmBranch: UNKNOWN
[INFO] 
[INFO] --- maven-dependency-plugin:2.8:unpack (unpack) @ falcon-oozie-adaptor ---
[INFO] Configured Artifact: org.apache.oozie:oozie-client:?:jar
[INFO] Unpacking /home/jenkins/.m2/repository/org/apache/oozie/oozie-client/4.1.0-falcon/oozie-client-4.1.0-falcon.jar
to <https://builds.apache.org/job/Apache-falcon/ws/oozie/target/oozie-schemas> with
includes "**/*.xsd" and excludes "**/*.class"
[INFO] 
[INFO] --- maven-jaxb2-plugin:0.12.3:generate (coord-gen) @ falcon-oozie-adaptor ---
[WARNING] You are using forceRegenerate=true in your configuration.
This configuration setting is deprecated and not recommended as it causes problems with incremental
builds in IDEs.
Please refer to the following link for more information:
https://github.com/highsource/maven-jaxb2-plugin/wiki/Do-Not-Use-forceRegenerate
Consider removing this setting from your plugin configuration.

[INFO] The [forceRegenerate] switch is turned on, XJC will be executed.
[INFO] 
[INFO] --- maven-jaxb2-plugin:0.12.3:generate (wf-gen) @ falcon-oozie-adaptor ---
[WARNING] You are using forceRegenerate=true in your configuration.
This configuration setting is deprecated and not recommended as it causes problems with incremental
builds in IDEs.
Please refer to the following link for more information:
https://github.com/highsource/maven-jaxb2-plugin/wiki/Do-Not-Use-forceRegenerate
Consider removing this setting from your plugin configuration.

[INFO] The [forceRegenerate] switch is turned on, XJC will be executed.
[INFO] 
[INFO] --- maven-jaxb2-plugin:0.12.3:generate (hive-gen) @ falcon-oozie-adaptor ---
[WARNING] You are using forceRegenerate=true in your configuration.
This configuration setting is deprecated and not recommended as it causes problems with incremental
builds in IDEs.
Please refer to the following link for more information:
https://github.com/highsource/maven-jaxb2-plugin/wiki/Do-Not-Use-forceRegenerate
Consider removing this setting from your plugin configuration.

[INFO] The [forceRegenerate] switch is turned on, XJC will be executed.
[INFO] 
[INFO] --- maven-jaxb2-plugin:0.12.3:generate (bundle-gen) @ falcon-oozie-adaptor ---
[WARNING] You are using forceRegenerate=true in your configuration.
This configuration setting is deprecated and not recommended as it causes problems with incremental
builds in IDEs.
Please refer to the following link for more information:
https://github.com/highsource/maven-jaxb2-plugin/wiki/Do-Not-Use-forceRegenerate
Consider removing this setting from your plugin configuration.

[INFO] The [forceRegenerate] switch is turned on, XJC will be executed.
[INFO] 
[INFO] --- maven-remote-resources-plugin:1.4:process (default) @ falcon-oozie-adaptor ---
[INFO] 
[INFO] --- maven-resources-plugin:2.6:resources (default-resources) @ falcon-oozie-adaptor
---
[INFO] Using 'UTF-8' encoding to copy filtered resources.
[INFO] Copying 14 resources
[INFO] Copying 0 resource
[INFO] Copying 0 resource
[INFO] Copying 2 resources to META-INF
[INFO] Copying 1 resource
[INFO] Copying 1 resource
[INFO] Copying 1 resource
[INFO] Copying 1 resource
[INFO] Copying 3 resources
[INFO] 
[INFO] --- maven-compiler-plugin:2.3.2:compile (default-compile) @ falcon-oozie-adaptor ---
[INFO] Compiling 92 source files to <https://builds.apache.org/job/Apache-falcon/ws/oozie/target/classes>
[INFO] 
[INFO] --- maven-resources-plugin:2.6:testResources (default-testResources) @ falcon-oozie-adaptor
---
[INFO] Using 'UTF-8' encoding to copy filtered resources.
[INFO] Copying 30 resources
[INFO] Copying 3 resources
[INFO] 
[INFO] --- maven-compiler-plugin:2.3.2:testCompile (default-testCompile) @ falcon-oozie-adaptor
---
[INFO] Compiling 8 source files to <https://builds.apache.org/job/Apache-falcon/ws/oozie/target/test-classes>
[INFO] 
[INFO] --- maven-surefire-plugin:2.16:test (default-test) @ falcon-oozie-adaptor ---
[WARNING] The parameter forkMode is deprecated since version 2.14. Use forkCount and reuseForks
instead.
[INFO] Surefire report directory: <https://builds.apache.org/job/Apache-falcon/ws/oozie/target/surefire-reports>

-------------------------------------------------------
 T E S T S
-------------------------------------------------------

-------------------------------------------------------
 T E S T S
-------------------------------------------------------
Running org.apache.falcon.oozie.feed.OozieFeedWorkflowBuilderTest
Tests run: 12, Failures: 0, Errors: 0, Skipped: 0, Time elapsed: 6.541 sec - in org.apache.falcon.oozie.feed.OozieFeedWorkflowBuilderTest
Running org.apache.falcon.oozie.coordinator.CoordinatorUnmarshallingTest
Tests run: 1, Failures: 0, Errors: 0, Skipped: 0, Time elapsed: 0.929 sec - in org.apache.falcon.oozie.coordinator.CoordinatorUnmarshallingTest
Running org.apache.falcon.oozie.logging.TaskLogRetrieverYarnTest
Tests run: 9, Failures: 1, Errors: 0, Skipped: 0, Time elapsed: 1.154 sec <<< FAILURE!
- in org.apache.falcon.oozie.logging.TaskLogRetrieverYarnTest
testSuccess(org.apache.falcon.oozie.logging.TaskLogRetrieverYarnTest)  Time elapsed: 0.034
sec  <<< FAILURE!
java.lang.AssertionError: Collections not equal: expected: [http://host:4000/tracker:0/c4/a1/own1?start=0,
http://host:4000/tracker:0/c1/a1/own1?start=0] and actual: null
	at org.testng.Assert.fail(Assert.java:89)
	at org.testng.Assert.assertEquals(Assert.java:528)
	at org.testng.Assert.assertEquals(Assert.java:509)
	at org.apache.falcon.oozie.logging.TaskLogRetrieverYarnTest.testSuccess(TaskLogRetrieverYarnTest.java:90)

Running org.apache.falcon.oozie.process.OozieProcessWorkflowBuilderTest
Tests run: 17, Failures: 0, Errors: 0, Skipped: 0, Time elapsed: 9.474 sec - in org.apache.falcon.oozie.process.OozieProcessWorkflowBuilderTest
Running org.apache.falcon.oozie.bundle.BundleUnmarshallingTest
Tests run: 1, Failures: 0, Errors: 0, Skipped: 0, Time elapsed: 0.847 sec - in org.apache.falcon.oozie.bundle.BundleUnmarshallingTest
Running org.apache.falcon.oozie.workflow.FalconPostProcessingTest
Tests run: 2, Failures: 0, Errors: 0, Skipped: 0, Time elapsed: 3.559 sec - in org.apache.falcon.oozie.workflow.FalconPostProcessingTest
Running org.apache.falcon.oozie.workflow.WorkflowUnmarshallingTest
Tests run: 1, Failures: 0, Errors: 0, Skipped: 0, Time elapsed: 1.002 sec - in org.apache.falcon.oozie.workflow.WorkflowUnmarshallingTest

Results :

Failed tests: 
  TaskLogRetrieverYarnTest.testSuccess:90 Collections not equal: expected: [http://host:4000/tracker:0/c4/a1/own1?start=0,
http://host:4000/tracker:0/c1/a1/own1?start=0] and actual: null

Tests run: 43, Failures: 1, Errors: 0, Skipped: 0

[INFO] ------------------------------------------------------------------------
[INFO] Reactor Summary:
[INFO] 
[INFO] Checkstyle ........................................ SUCCESS [  0.786 s]
[INFO] Apache Falcon ..................................... SUCCESS [  6.475 s]
[INFO] Apache Falcon UI .................................. SUCCESS [ 10.634 s]
[INFO] Build Tools ....................................... SUCCESS [  3.190 s]
[INFO] Apache Falcon CLI client .......................... SUCCESS [ 26.863 s]
[INFO] Apache Falcon Metrics ............................. SUCCESS [ 10.241 s]
[INFO] Apache Falcon Hadoop Dependencies ................. SUCCESS [ 13.010 s]
[INFO] Apache Falcon Test Utility ........................ SUCCESS [ 10.788 s]
[INFO] Apache Falcon Commons ............................. SUCCESS [01:35 min]
[INFO] Apache Falcon Oozie EL Extension .................. SUCCESS [ 14.223 s]
[INFO] Apache Falcon Embedded Hadoop - Test Cluster ...... SUCCESS [ 28.166 s]
[INFO] Apache Falcon Sharelib Hive - Test Cluster ........ SUCCESS [  1.025 s]
[INFO] Apache Falcon Sharelib Pig - Test Cluster ......... SUCCESS [  0.632 s]
[INFO] Apache Falcon Sharelib Hcatalog - Test Cluster .... SUCCESS [  0.843 s]
[INFO] Apache Falcon Sharelib Oozie - Test Cluster ....... SUCCESS [  0.514 s]
[INFO] Apache Falcon Test Tools - Test Cluster ........... SUCCESS [  0.446 s]
[INFO] Apache Falcon Messaging ........................... SUCCESS [ 23.520 s]
[INFO] Apache Falcon Oozie Adaptor ....................... FAILURE [ 31.568 s]
[INFO] Apache Falcon Acquisition ......................... SKIPPED
[INFO] Apache Falcon Replication ......................... SKIPPED
[INFO] Apache Falcon Retention ........................... SKIPPED
[INFO] Apache Falcon Archival ............................ SKIPPED
[INFO] Apache Falcon Rerun ............................... SKIPPED
[INFO] Apache Falcon Prism ............................... SKIPPED
[INFO] Apache Falcon Web Application ..................... SKIPPED
[INFO] Apache Falcon Documentation ....................... SKIPPED
[INFO] ------------------------------------------------------------------------
[INFO] BUILD FAILURE
[INFO] ------------------------------------------------------------------------
[INFO] Total time: 04:39 min
[INFO] Finished at: 2015-05-05T01:58:46+00:00
[INFO] Final Memory: 291M/1529M
[INFO] ------------------------------------------------------------------------
[ERROR] Failed to execute goal org.apache.maven.plugins:maven-surefire-plugin:2.16:test (default-test)
on project falcon-oozie-adaptor: There are test failures.
[ERROR] 
[ERROR] Please refer to <https://builds.apache.org/job/Apache-falcon/ws/oozie/target/surefire-reports>
for the individual test results.
[ERROR] -> [Help 1]
[ERROR] 
[ERROR] To see the full stack trace of the errors, re-run Maven with the -e switch.
[ERROR] Re-run Maven using the -X switch to enable full debug logging.
[ERROR] 
[ERROR] For more information about the errors and possible solutions, please read the following
articles:
[ERROR] [Help 1] http://cwiki.apache.org/confluence/display/MAVEN/MojoFailureException
[ERROR] 
[ERROR] After correcting the problems, you can resume the build with the command
[ERROR]   mvn <goals> -rf :falcon-oozie-adaptor
Build step 'Execute shell' marked build as failure
[CHECKSTYLE] Collecting checkstyle analysis files...
[CHECKSTYLE] Finding all files that match the pattern **/target/checkstyle-result.xml
[CHECKSTYLE] Parsing 27 files in <https://builds.apache.org/job/Apache-falcon/ws/>
[CHECKSTYLE] Successfully parsed file <https://builds.apache.org/job/Apache-falcon/ws/acquisition/target/checkstyle-result.xml>
of module  with 0 warnings.
[CHECKSTYLE] Successfully parsed file <https://builds.apache.org/job/Apache-falcon/ws/archival/target/checkstyle-result.xml>
of module  with 0 warnings.
[CHECKSTYLE] Successfully parsed file <https://builds.apache.org/job/Apache-falcon/ws/build-tools/target/checkstyle-result.xml>
of module  with 0 warnings.
[CHECKSTYLE] Successfully parsed file <https://builds.apache.org/job/Apache-falcon/ws/client/target/checkstyle-result.xml>
of module  with 0 warnings.
[CHECKSTYLE] Successfully parsed file <https://builds.apache.org/job/Apache-falcon/ws/common/target/checkstyle-result.xml>
of module  with 0 warnings.
[CHECKSTYLE] Successfully parsed file <https://builds.apache.org/job/Apache-falcon/ws/docs/target/checkstyle-result.xml>
of module  with 0 warnings.
[CHECKSTYLE] Successfully parsed file <https://builds.apache.org/job/Apache-falcon/ws/falcon-ui/target/checkstyle-result.xml>
of module  with 0 warnings.
[CHECKSTYLE] Successfully parsed file <https://builds.apache.org/job/Apache-falcon/ws/feed/target/checkstyle-result.xml>
of module  with 0 warnings.
[CHECKSTYLE] Successfully parsed file <https://builds.apache.org/job/Apache-falcon/ws/hadoop-dependencies/target/checkstyle-result.xml>
of module  with 0 warnings.
[CHECKSTYLE] Successfully parsed file <https://builds.apache.org/job/Apache-falcon/ws/hadoop-webapp/target/checkstyle-result.xml>
of module  with 0 warnings.
[CHECKSTYLE] Successfully parsed file <https://builds.apache.org/job/Apache-falcon/ws/messaging/target/checkstyle-result.xml>
of module  with 0 warnings.
[CHECKSTYLE] Successfully parsed file <https://builds.apache.org/job/Apache-falcon/ws/metrics/target/checkstyle-result.xml>
of module  with 0 warnings.
[CHECKSTYLE] Successfully parsed file <https://builds.apache.org/job/Apache-falcon/ws/oozie-el-extensions/target/checkstyle-result.xml>
of module  with 0 warnings.
[CHECKSTYLE] Successfully parsed file <https://builds.apache.org/job/Apache-falcon/ws/prism/target/checkstyle-result.xml>
of module  with 0 warnings.
[CHECKSTYLE] Successfully parsed file <https://builds.apache.org/job/Apache-falcon/ws/process/target/checkstyle-result.xml>
of module  with 0 warnings.
[CHECKSTYLE] Successfully parsed file <https://builds.apache.org/job/Apache-falcon/ws/replication/target/checkstyle-result.xml>
of module  with 0 warnings.
[CHECKSTYLE] Successfully parsed file <https://builds.apache.org/job/Apache-falcon/ws/rerun/target/checkstyle-result.xml>
of module  with 0 warnings.
[CHECKSTYLE] Successfully parsed file <https://builds.apache.org/job/Apache-falcon/ws/retention/target/checkstyle-result.xml>
of module  with 0 warnings.
[CHECKSTYLE] Successfully parsed file <https://builds.apache.org/job/Apache-falcon/ws/target/checkstyle-result.xml>
of module  with 0 warnings.
[CHECKSTYLE] Successfully parsed file <https://builds.apache.org/job/Apache-falcon/ws/test-tools/hadoop-webapp/target/checkstyle-result.xml>
of module  with 0 warnings.
[CHECKSTYLE] Successfully parsed file <https://builds.apache.org/job/Apache-falcon/ws/test-tools/hcatalog-sharelib/target/checkstyle-result.xml>
of module  with 0 warnings.
[CHECKSTYLE] Successfully parsed file <https://builds.apache.org/job/Apache-falcon/ws/test-tools/hive-sharelib/target/checkstyle-result.xml>
of module  with 0 warnings.
[CHECKSTYLE] Successfully parsed file <https://builds.apache.org/job/Apache-falcon/ws/test-tools/oozie-sharelib/target/checkstyle-result.xml>
of module  with 0 warnings.
[CHECKSTYLE] Successfully parsed file <https://builds.apache.org/job/Apache-falcon/ws/test-tools/pig-sharelib/target/checkstyle-result.xml>
of module  with 0 warnings.
[CHECKSTYLE] Successfully parsed file <https://builds.apache.org/job/Apache-falcon/ws/test-tools/target/checkstyle-result.xml>
of module  with 0 warnings.
[CHECKSTYLE] Successfully parsed file <https://builds.apache.org/job/Apache-falcon/ws/test-util/target/checkstyle-result.xml>
of module  with 0 warnings.
[CHECKSTYLE] Successfully parsed file <https://builds.apache.org/job/Apache-falcon/ws/webapp/target/checkstyle-result.xml>
of module  with 0 warnings.
[CHECKSTYLE] Computing warning deltas based on reference build #649
[FINDBUGS] Collecting findbugs analysis files...
[FINDBUGS] Finding all files that match the pattern **/target/findbugs.xml
[FINDBUGS] Parsing 16 files in <https://builds.apache.org/job/Apache-falcon/ws/>
[FINDBUGS] Successfully parsed file <https://builds.apache.org/job/Apache-falcon/ws/client/target/findbugs.xml>
of module  with 0 warnings.
[FINDBUGS] Successfully parsed file <https://builds.apache.org/job/Apache-falcon/ws/common/target/findbugs.xml>
of module  with 0 warnings.
[FINDBUGS] Successfully parsed file <https://builds.apache.org/job/Apache-falcon/ws/feed/target/findbugs.xml>
of module  with 0 warnings.
[FINDBUGS] Successfully parsed file <https://builds.apache.org/job/Apache-falcon/ws/hadoop-dependencies/target/findbugs.xml>
of module  with 0 warnings.
[FINDBUGS] Successfully parsed file <https://builds.apache.org/job/Apache-falcon/ws/hadoop-webapp/target/findbugs.xml>
of module  with 0 warnings.
[FINDBUGS] Successfully parsed file <https://builds.apache.org/job/Apache-falcon/ws/messaging/target/findbugs.xml>
of module  with 0 warnings.
[FINDBUGS] Successfully parsed file <https://builds.apache.org/job/Apache-falcon/ws/metrics/target/findbugs.xml>
of module  with 0 warnings.
[FINDBUGS] Successfully parsed file <https://builds.apache.org/job/Apache-falcon/ws/oozie-el-extensions/target/findbugs.xml>
of module  with 0 warnings.
[FINDBUGS] Successfully parsed file <https://builds.apache.org/job/Apache-falcon/ws/prism/target/findbugs.xml>
of module  with 0 warnings.
[FINDBUGS] Successfully parsed file <https://builds.apache.org/job/Apache-falcon/ws/process/target/findbugs.xml>
of module  with 0 warnings.
[FINDBUGS] Successfully parsed file <https://builds.apache.org/job/Apache-falcon/ws/replication/target/findbugs.xml>
of module  with 0 warnings.
[FINDBUGS] Successfully parsed file <https://builds.apache.org/job/Apache-falcon/ws/rerun/target/findbugs.xml>
of module  with 0 warnings.
[FINDBUGS] Successfully parsed file <https://builds.apache.org/job/Apache-falcon/ws/retention/target/findbugs.xml>
of module  with 0 warnings.
[FINDBUGS] Successfully parsed file <https://builds.apache.org/job/Apache-falcon/ws/test-tools/hadoop-webapp/target/findbugs.xml>
of module  with 0 warnings.
[FINDBUGS] Successfully parsed file <https://builds.apache.org/job/Apache-falcon/ws/test-util/target/findbugs.xml>
of module  with 0 warnings.
[FINDBUGS] Successfully parsed file <https://builds.apache.org/job/Apache-falcon/ws/webapp/target/findbugs.xml>
of module  with 0 warnings.
[FINDBUGS] Computing warning deltas based on reference build #649
Archiving artifacts
Sending artifact delta relative to Apache-falcon #649
Archived 16 artifacts
Archive block size is 32768
Received 331 blocks and 1928820 bytes
Compression is 84.9%
Took 3.6 sec
Recording test results
TestNG Reports Processing: START
Looking for TestNG results report in workspace using pattern: **/target/testng-results.xml
Did not find any matching files.

Mime
View raw message